id_mutation,date_mutation,numero_disposition,nature_mutation,valeur_fonciere,adresse_numero,adresse_suffixe,adresse_nom_voie,adresse_code_voie,code_postal,code_commune,nom_commune,code_departement,ancien_code_commune,ancien_nom_commune,id_parcelle,ancien_id_parcelle,numero_volume,lot1_numero,lot1_surface_carrez,lot2_numero,lot2_surface_carrez,lot3_numero,lot3_surface_carrez,lot4_numero,lot4_surface_carrez,lot5_numero,lot5_surface_carrez,nombre_lots,code_type_local,type_local,surface_reelle_bati,nombre_pieces_principales,code_nature_culture,nature_culture,code_nature_culture_speciale,nature_culture_speciale,surface_terrain,longitude,latitude
2021-228796,2021-05-25,000001,Vente,25000,,,LE PETIT VILLERET,B047,16240,16059,Brettes,16,,,16059000ZK0167,,,,,,,,,,,,,0,,,,,S,sols,,,445,0.032809,45.981024
2021-228796,2021-05-25,000001,Vente,25000,,,DERRIERE LE BOIS,B018,16240,16059,Brettes,16,,,16059000ZK0226,,,,,,,,,,,,,0,,,,,T,terres,,,1800,0.032701,45.981804
2021-228796,2021-05-25,000001,Vente,25000,,,DERRIERE LE BOIS,B018,16240,16059,Brettes,16,,,16059000ZK0226,,,,,,,,,,,,,0,,,,,S,sols,,,1845,0.032701,45.981804
2021-228796,2021-05-25,000001,Vente,25000,,,LE PETIT VILLERET,B047,16240,16059,Brettes,16,,,16059000ZK0228,,,,,,,,,,,,,0,,,,,S,sols,,,3338,0.032548,45.981451
2021-229408,2021-05-20,000001,Echange,2000,,,LA MONTEE DEMPURE,B044,16240,16059,Brettes,16,,,16059000ZD0012,,,,,,,,,,,,,0,,,,,T,terres,,,4240,0.045831,46.012219
2021-229408,2021-05-20,000001,Echange,2000,,,LA MONTEE DEMPURE,B044,16240,16059,Brettes,16,,,16059000ZD0013,,,,,,,,,,,,,0,,,,,T,terres,,,1770,0.046427,46.012125
2021-229408,2021-05-20,000001,Echange,2000,,,LA MONTEE DEMPURE,B044,16240,16059,Brettes,16,,,16059000ZD0014,,,,,,,,,,,,,0,,,,,T,terres,,,1730,0.046692,46.012038
2021-229408,2021-05-20,000001,Echange,2000,,,LA MONTEE DEMPURE,B044,16240,16059,Brettes,16,,,16059000ZD0015,,,,,,,,,,,,,0,,,,,T,terres,,,2580,0.047071,46.012117
2021-229509,2021-05-31,000001,Vente,2300,,,LA MONTEE DEMPURE,B044,16240,16059,Brettes,16,,,16059000ZD0043,,,,,,,,,,,,,0,,,,,T,terres,,,2400,0.05294,46.0109
2021-229509,2021-05-31,000001,Vente,2300,,,LA MONTEE DEMPURE,B044,16240,16059,Brettes,16,,,16059000ZD0045,,,,,,,,,,,,,0,,,,,T,terres,,,4530,0.052146,46.01107
2021-229509,2021-05-31,000001,Vente,2300,,,LA MONTEE DEMPURE,B044,16240,16059,Brettes,16,,,16059000ZD0046,,,,,,,,,,,,,0,,,,,T,terres,,,2930,0.0518,46.010971
2021-229509,2021-05-31,000001,Vente,2300,,,LA MONTEE DEMPURE,B044,16240,16059,Brettes,16,,,16059000ZD0047,,,,,,,,,,,,,0,,,,,T,terres,,,5370,0.051271,46.011023
2021-230007,2021-06-24,000001,Vente,85182,,,LES CHENES,B013,16240,16059,Brettes,16,,,16059000ZE0140,,,,,,,,,,,,,0,,,,,T,terres,,,11210,0.04625,45.996601
2021-230008,2021-06-24,000001,Vente,85880.6,,,LES FONTENELLES,B023,16240,16059,Brettes,16,,,16059000ZO0005,,,,,,,,,,,,,0,,,,,T,terres,,,7850,0.024185,45.999439
2021-230704,2021-07-01,000001,Vente,29178,,,LES GUIGNERS,B034,16240,16059,Brettes,16,,,16059000ZK0193,,,,,,,,,,,,,0,,,,,T,terres,,,5780,0.02638,45.984593
2021-232095,2021-08-17,000001,Vente,95230,,,MARSILLE,B043,16240,16059,Brettes,16,,,16059000AC0042,,,,,,,,,,,,,0,,,,,T,terres,,,4950,0.014871,45.98573
2021-232095,2021-08-17,000001,Vente,95230,,,LES FILLONS,B021,16240,16059,Brettes,16,,,16059000ZB0003,,,,,,,,,,,,,0,,,,,T,terres,,,2010,-0.004252,45.985622
2021-232095,2021-08-17,000001,Vente,95230,,,LES SAUZEES,B065,16240,16059,Brettes,16,,,16059000ZB0018,,,,,,,,,,,,,0,,,,,T,terres,,,6980,-0.001005,45.98388
2021-232095,2021-08-17,000001,Vente,95230,,,LES GRANDS PRES,B032,16240,16059,Brettes,16,,,16059000ZB0034,,,,,,,,,,,,,0,,,,,T,terres,,,12880,0.006731,45.984414
2021-232095,2021-08-17,000001,Vente,95230,,,LES SAINT FRAIGNEES,B064,16240,16059,Brettes,16,,,16059000ZL0002,,,,,,,,,,,,,0,,,,,T,terres,,,38320,0.012109,45.989118
2021-232095,2021-08-17,000001,Vente,95230,,,LES SAINT FRAIGNEES,B064,16240,16059,Brettes,16,,,16059000ZL0003,,,,,,,,,,,,,0,,,,,T,terres,,,600,0.010895,45.990337
2021-232095,2021-08-17,000001,Vente,95230,,,LES SAINT FRAIGNEES,B064,16240,16059,Brettes,16,,,16059000ZL0004,,,,,,,,,,,,,0,,,,,T,terres,,,1500,0.011471,45.990739
2021-232095,2021-08-17,000001,Vente,95230,,,LES SAINT FRAIGNEES,B064,16240,16059,Brettes,16,,,16059000ZL0004,,,,,,,,,,,,,0,,,,,T,terres,,,8760,0.011471,45.990739
2021-232095,2021-08-17,000001,Vente,95230,,,LES SAINT FRAIGNEES,B064,16240,16059,Brettes,16,,,16059000ZL0004,,,,,,,,,,,,,0,,,,,VI,vignes,VAOC,Vins d'appellation d'origine contrôlée,1380,0.011471,45.990739
2021-232095,2021-08-17,000001,Vente,95230,,,LES SAINT FRAIGNEES,B064,16240,16059,Brettes,16,,,16059000ZL0004,,,,,,,,,,,,,0,,,,,J,jardins,,,250,0.011471,45.990739
2021-232095,2021-08-17,000001,Vente,95230,,,LES GRANDES VERSENNES,B031,16240,16059,Brettes,16,,,16059000ZL0012,,,,,,,,,,,,,0,,,,,T,terres,,,26300,0.019191,45.992241
2021-232095,2021-08-17,000001,Vente,95230,,,LORIOUX,B038,16240,16059,Brettes,16,,,16059000ZL0043,,,,,,,,,,,,,0,,,,,T,terres,,,16230,0.014238,45.986458
2021-232095,2021-08-17,000001,Vente,95230,,,LES TERRAGEAUX,B066,16240,16059,Brettes,16,,,16059000ZM0023,,,,,,,,,,,,,0,,,,,T,terres,,,17200,0.006352,45.986548
2021-232095,2021-08-17,000001,Vente,95230,,,LA PIECE DES FILLONS,B050,16240,16059,Brettes,16,,,16059000ZM0030,,,,,,,,,,,,,0,,,,,T,terres,,,21150,0.002741,45.986462
2021-232095,2021-08-17,000001,Vente,95230,,,LES TERRAGEAUX,B066,16240,16059,Brettes,16,,,16059000ZM0047,,,,,,,,,,,,,0,,,,,T,terres,,,11040,0.006531,45.987079
2021-232095,2021-08-17,000001,Vente,95230,,,LA PIECE DU BOIS,B051,16240,16059,Brettes,16,,,16059000ZN0007,,,,,,,,,,,,,0,,,,,T,terres,,,44000,0.011122,45.997124
2021-232400,2021-08-20,000002,Vente,82000,1,,RTE DE MARSILLE,0220,16240,16059,Brettes,16,,,16059000ZP0026,,,,,,,,,,,,,0,1,Maison,82,1,S,sols,,,3690,0.016574,46.006763
2021-232400,2021-08-20,000002,Vente,82000,,,LES RENOUVELIS,B063,16240,16059,Brettes,16,,,16059000ZP0073,,,,,,,,,,,,,0,,,,,T,terres,,,915,0.017071,46.007286
2021-232494,2021-09-10,000001,Vente,1,,,MARSILLE,B043,16240,16059,Brettes,16,,,16059000AC0062,,,,,,,,,,,,,0,,,,,S,sols,,,102,0.017862,45.986917
2021-233957,2021-10-05,000001,Vente,122500,3,,RTE DE L'ALISIER,0008,16240,16059,Brettes,16,,,16059000ZE0162,,,,,,,,,,,,,0,1,Maison,97,4,S,sols,,,878,0.043374,46.003483
2021-233957,2021-10-05,000001,Vente,122500,3,,RTE DE L'ALISIER,0008,16240,16059,Brettes,16,,,16059000ZE0162,,,,,,,,,,,,,0,1,Maison,97,4,T,terres,,,1781,0.043374,46.003483
2021-234295,2021-10-29,000001,Vente,49500,4,,RUE DU LOGIS,0160,16240,16059,Brettes,16,,,16059000AB0025,,,,,,,,,,,,,0,1,Maison,98,2,S,sols,,,1445,0.041097,46.007465
2021-234295,2021-10-29,000001,Vente,49500,,,LE BOURG,B008,16240,16059,Brettes,16,,,16059000AB0026,,,,,,,,,,,,,0,,,,,J,jardins,,,532,0.040994,46.007204
2021-236152,2021-12-14,000001,Vente,422772.06,,,LA GARDE,B026,16240,16059,Brettes,16,,,16059000ZI0005,,,,,,,,,,,,,0,,,,,T,terres,,,8960,0.039019,45.992295
2021-236152,2021-12-14,000001,Vente,422772.06,,,LA GARDE,B026,16240,16059,Brettes,16,,,16059000ZI0005,,,,,,,,,,,,,0,,,,,VI,vignes,VAOC,Vins d'appellation d'origine contrôlée,3110,0.039019,45.992295
2021-236152,2021-12-14,000001,Vente,422772.06,,,VIGNES DU DEVANT,B070,16240,16059,Brettes,16,,,16059000ZL0033,,,,,,,,,,,,,0,,,,,T,terres,,,11360,0.021187,45.989549
