id_mutation,date_mutation,numero_disposition,nature_mutation,valeur_fonciere,adresse_numero,adresse_suffixe,adresse_nom_voie,adresse_code_voie,code_postal,code_commune,nom_commune,code_departement,ancien_code_commune,ancien_nom_commune,id_parcelle,ancien_id_parcelle,numero_volume,lot1_numero,lot1_surface_carrez,lot2_numero,lot2_surface_carrez,lot3_numero,lot3_surface_carrez,lot4_numero,lot4_surface_carrez,lot5_numero,lot5_surface_carrez,nombre_lots,code_type_local,type_local,surface_reelle_bati,nombre_pieces_principales,code_nature_culture,nature_culture,code_nature_culture_speciale,nature_culture_speciale,surface_terrain,longitude,latitude
2021-226665,2021-03-01,000001,Vente,10000,,,LES GRANDS CHAMPS,B047,16250,16075,Champagne-Vigny,16,,,16075000ZB0017,,,,,,,,,,,,,0,,,,,VI,vignes,,,19800,0.046043,45.52023
2021-226869,2021-03-11,000001,Vente,156000,8,,RUE DES DESTINEES,0080,16250,16075,Champagne-Vigny,16,,,16075000AA0035,,,,,,,,,,,,,0,1,Maison,129,4,S,sols,,,500,0.036958,45.509346
2021-226869,2021-03-11,000001,Vente,156000,8,,RUE DES DESTINEES,0080,16250,16075,Champagne-Vigny,16,,,16075000AA0035,,,,,,,,,,,,,0,1,Maison,129,4,AG,terrains d'agrément,,,1389,0.036958,45.509346
2021-227836,2021-03-01,000001,Vente,24821,,,BOIS RABIER,B009,16250,16075,Champagne-Vigny,16,,,16075000ZA0011,,,,,,,,,,,,,0,,,,,T,terres,,,17242,0.048921,45.517276
2021-228350,2021-04-30,000001,Vente,105,,,RUE DE LA MAISON DU BERGER,0150,16250,16075,Champagne-Vigny,16,,,16075000AA0071,,,,,,,,,,,,,0,,,,,S,sols,,,7,0.037495,45.507603
2021-229438,2021-05-21,000002,Vente,14,,,PRES LIQUETS,B075,16250,16075,Champagne-Vigny,16,,,16075000ZD0057,,,,,,,,,,,,,0,,,,,T,terres,,,24,0.052894,45.512252
2021-229439,2021-05-21,000003,Vente,40,,,OUCHES DE LABROUSSE,B057,16250,16075,Champagne-Vigny,16,,,16075000ZH0141,,,,,,,,,,,,,0,,,,,T,terres,,,399,0.053783,45.505066
2021-229482,2021-06-03,000001,Vente,351.5,,,CHAMPS DE BRANDE,B017,16250,16075,Champagne-Vigny,16,,,16075000ZI0018,,,,,,,,,,,,,0,,,,,S,sols,,,703,0.051325,45.491787
2021-230572,2021-07-12,000002,Vente,134100,19,,RUE DES DESTINEES,0080,16250,16075,Champagne-Vigny,16,,,16075000AA0020,,,,,,,,,,,,,0,1,Maison,121,4,S,sols,,,860,0.036159,45.509323
2021-231161,2021-07-28,000001,Vente,1600,,,CHEZ NORMANDIN,B028,16250,16075,Champagne-Vigny,16,,,16075000ZD0044,,,,,,,,,,,,,0,,,,,T,terres,,,3100,0.058585,45.514701
2021-231161,2021-07-28,000001,Vente,1600,,,CHEZ NORMANDIN,B028,16250,16075,Champagne-Vigny,16,,,16075000ZD0044,,,,,,,,,,,,,0,,,,,AG,terrains d'agrément,,,297,0.058585,45.514701
2021-232247,2021-08-13,000001,Vente,155000,7,,CHEZ NORMANDIN,B028,16250,16075,Champagne-Vigny,16,,,16075000ZD0045,,,,,,,,,,,,,0,1,Maison,66,4,S,sols,,,1500,0.058529,45.515119
2021-232247,2021-08-13,000001,Vente,155000,7,,CHEZ NORMANDIN,B028,16250,16075,Champagne-Vigny,16,,,16075000ZD0045,,,,,,,,,,,,,0,1,Maison,66,4,AG,terrains d'agrément,,,1738,0.058529,45.515119
2021-233263,2021-08-24,000001,Vente,65000,1,,RUE DES DESTINEES,0080,16250,16075,Champagne-Vigny,16,,,16075000AA0005,,,,,,,,,,,,,0,1,Maison,80,4,J,jardins,,,842,,
2021-233263,2021-08-24,000001,Vente,65000,1,,RUE DES DESTINEES,0080,16250,16075,Champagne-Vigny,16,,,16075000AA0005,,,,,,,,,,,,,0,1,Maison,80,4,S,sols,,,200,,
