id_mutation,date_mutation,numero_disposition,nature_mutation,valeur_fonciere,adresse_numero,adresse_suffixe,adresse_nom_voie,adresse_code_voie,code_postal,code_commune,nom_commune,code_departement,ancien_code_commune,ancien_nom_commune,id_parcelle,ancien_id_parcelle,numero_volume,lot1_numero,lot1_surface_carrez,lot2_numero,lot2_surface_carrez,lot3_numero,lot3_surface_carrez,lot4_numero,lot4_surface_carrez,lot5_numero,lot5_surface_carrez,nombre_lots,code_type_local,type_local,surface_reelle_bati,nombre_pieces_principales,code_nature_culture,nature_culture,code_nature_culture_speciale,nature_culture_speciale,surface_terrain,longitude,latitude
2021-225954,2021-02-23,000001,Vente,3600,,,LE GRAND PRE,B011,16200,16139,Fleurac,16,,,161390000A0190,,,,,,,,,,,,,0,,,,,P,prés,,,3634,-0.079354,45.723534
2021-228519,2021-05-11,000001,Vente,1500,,,LA RAUBIQUETTE,B023,16200,16139,Fleurac,16,,,161390000A0192,,,,,,,,,,,,,0,,,,,P,prés,,,970,-0.078527,45.721541
2021-228519,2021-05-11,000001,Vente,1500,,,LA RAUBIQUETTE,B023,16200,16139,Fleurac,16,,,161390000A0846,,,,,,,,,,,,,0,,,,,L,landes,,,7330,-0.077558,45.721453
2021-229353,2021-05-21,000001,Vente,290000,12,,RUE GRAND RUE,0075,16200,16139,Fleurac,16,,,161390000A0477,,,,,,,,,,,,,0,1,Maison,80,2,S,sols,,,1772,-0.083182,45.717271
2021-229353,2021-05-21,000001,Vente,290000,12,,RUE GRAND RUE,0075,16200,16139,Fleurac,16,,,161390000A0477,,,,,,,,,,,,,0,3,Dépendance,,0,S,sols,,,1772,-0.083182,45.717271
2021-229353,2021-05-21,000001,Vente,290000,,,LES SABLES,B025,16200,16139,Fleurac,16,,,161390000A0479,,,,,,,,,,,,,0,,,,,P,prés,,,1767,-0.083361,45.717734
2021-229353,2021-05-21,000001,Vente,290000,,,LES SABLES,B025,16200,16139,Fleurac,16,,,161390000A0481,,,,,,,,,,,,,0,,,,,P,prés,,,190,-0.083474,45.717854
2021-229353,2021-05-21,000001,Vente,290000,,,LES SABLES,B025,16200,16139,Fleurac,16,,,161390000A0482,,,,,,,,,,,,,0,,,,,P,prés,,,559,-0.083424,45.718048
2021-229353,2021-05-21,000001,Vente,290000,,,LES SABLES,B025,16200,16139,Fleurac,16,,,161390000A0483,,,,,,,,,,,,,0,,,,,P,prés,,,61,-0.083308,45.718077
2021-229353,2021-05-21,000001,Vente,290000,,,LES SABLES,B025,16200,16139,Fleurac,16,,,161390000A0486,,,,,,,,,,,,,0,,,,,S,sols,,,445,-0.082971,45.717406
2021-229432,2021-06-11,000001,Vente,860,,,LES SABLES,B025,16200,16139,Fleurac,16,,,161390000A0469,,,,,,,,,,,,,0,,,,,P,prés,,,430,-0.084074,45.716763
2021-229884,2021-06-21,000001,Vente,166020,,,LES BOUFFANAUDS,B003,16200,16139,Fleurac,16,,,161390000A0267,,,,,,,,,,,,,0,,,,,S,sols,,,56,-0.08288,45.718485
2021-229884,2021-06-21,000001,Vente,166020,5066,,RUE DES BOUFFANAUDS,0025,16200,16139,Fleurac,16,,,161390000A0268,,,,,,,,,,,,,0,1,Maison,130,6,S,sols,,,1178,-0.082966,45.718196
2021-229884,2021-06-21,000001,Vente,166020,5066,,RUE DES BOUFFANAUDS,0025,16200,16139,Fleurac,16,,,161390000A0268,,,,,,,,,,,,,0,3,Dépendance,,0,S,sols,,,1178,-0.082966,45.718196
2021-229884,2021-06-21,000001,Vente,166020,,,LES BOUFFANAUDS,B003,16200,16139,Fleurac,16,,,161390000A0942,,,,,,,,,,,,,0,,,,,T,terres,,,2758,-0.082773,45.718147
2021-232474,2021-09-15,000001,Vente,185400,5055,,RUE DES BRUYERES,0038,16200,16139,Fleurac,16,,,161390000A0164,,,,,,,,,,,,,0,1,Maison,188,4,S,sols,,,2345,-0.082357,45.722578
2021-232892,2021-09-10,000001,Vente,3000,,,LES MICHAUDS,B016,16200,16139,Fleurac,16,,,161390000A0862,,,,,,,,,,,,,0,,,,,AB,terrains a bâtir,,,1040,-0.085037,45.715679
2021-233275,2021-09-14,000001,Vente,157260,18,,RUE DES MARTINS,0135,16200,16139,Fleurac,16,,,161390000A1155,,,,,,,,,,,,,0,3,Dépendance,,0,AG,terrains d'agrément,,,363,-0.080646,45.722585
2021-233275,2021-09-14,000001,Vente,157260,18,,RUE DES MARTINS,0135,16200,16139,Fleurac,16,,,161390000A1155,,,,,,,,,,,,,0,1,Maison,90,3,S,sols,,,400,-0.080646,45.722585
2021-233275,2021-09-14,000001,Vente,157260,18,,RUE DES MARTINS,0135,16200,16139,Fleurac,16,,,161390000A1155,,,,,,,,,,,,,0,3,Dépendance,,0,S,sols,,,400,-0.080646,45.722585
2021-233275,2021-09-14,000001,Vente,157260,18,,RUE DES MARTINS,0135,16200,16139,Fleurac,16,,,161390000A1155,,,,,,,,,,,,,0,1,Maison,90,3,AG,terrains d'agrément,,,363,-0.080646,45.722585
2021-233275,2021-09-14,000001,Vente,157260,,,RUE DES MARTINS,0135,16200,16139,Fleurac,16,,,161390000A1156,,,,,,,,,,,,,0,,,,,S,sols,,,400,-0.080416,45.722344
2021-233275,2021-09-14,000001,Vente,157260,,,RUE DES MARTINS,0135,16200,16139,Fleurac,16,,,161390000A1156,,,,,,,,,,,,,0,,,,,AG,terrains d'agrément,,,1618,-0.080416,45.722344
2021-234811,2021-11-10,000001,Vente,223000,,,LE BOURG,B004,16200,16139,Fleurac,16,,,161390000A0287,,,,,,,,,,,,,0,,,,,P,prés,,,2270,-0.08276,45.720176
2021-234811,2021-11-10,000001,Vente,223000,5,,RUE CHARLES TRENET,0045,16200,16139,Fleurac,16,,,161390000A0988,,,,,,,,,,,,,0,3,Dépendance,,0,S,sols,,,1371,-0.083586,45.720184
2021-234811,2021-11-10,000001,Vente,223000,5,,RUE CHARLES TRENET,0045,16200,16139,Fleurac,16,,,161390000A0988,,,,,,,,,,,,,0,1,Maison,108,3,S,sols,,,1371,-0.083586,45.720184
2021-234811,2021-11-10,000001,Vente,223000,5,,RUE CHARLES TRENET,0045,16200,16139,Fleurac,16,,,161390000A0988,,,,,,,,,,,,,0,4,Local industriel. commercial ou assimilé,29,0,S,sols,,,1371,-0.083586,45.720184
2021-234811,2021-11-10,000001,Vente,223000,5,,RUE CHARLES TRENET,0045,16200,16139,Fleurac,16,,,161390000A0988,,,,,,,,,,,,,0,3,Dépendance,,0,S,sols,,,1371,-0.083586,45.720184
2021-235232,2021-11-19,000001,Vente,40000,,,HAMEAU DES MARTINS,B014,16200,16139,Fleurac,16,,,161390000A1154,,,,,,,,,,,,,0,,,,,S,sols,,,1340,-0.08127,45.722424
2021-235590,2021-12-06,000001,Vente,222750,5011,,RUE DES PORCHES,0145,16200,16139,Fleurac,16,,,161390000A1149,,,,,,,,,,,,,0,1,Maison,144,6,S,sols,,,432,-0.085943,45.715389
2021-235590,2021-12-06,000001,Vente,222750,5011,,RUE DES PORCHES,0145,16200,16139,Fleurac,16,,,161390000A1149,,,,,,,,,,,,,0,3,Dépendance,,0,S,sols,,,432,-0.085943,45.715389
2021-236714,2021-12-30,000001,Vente,60000,,,LES BOUFFANAUDS,B003,16200,16139,Fleurac,16,,,161390000A0257,,,,,,,,,,,,,0,,,,,P,prés,,,660,-0.082088,45.719287
2021-236714,2021-12-30,000001,Vente,60000,5065,,RUE DES BOUFFANAUDS,0025,16200,16139,Fleurac,16,,,161390000A0262,,,,,,,,,,,,,0,1,Maison,94,4,S,sols,,,210,-0.082143,45.719045
2021-236714,2021-12-30,000001,Vente,60000,,,LES BOUFFANAUDS,B003,16200,16139,Fleurac,16,,,161390000A0659,,,,,,,,,,,,,0,,,,,S,sols,,,200,-0.082108,45.719138
