id_mutation,date_mutation,numero_disposition,nature_mutation,valeur_fonciere,adresse_numero,adresse_suffixe,adresse_nom_voie,adresse_code_voie,code_postal,code_commune,nom_commune,code_departement,ancien_code_commune,ancien_nom_commune,id_parcelle,ancien_id_parcelle,numero_volume,lot1_numero,lot1_surface_carrez,lot2_numero,lot2_surface_carrez,lot3_numero,lot3_surface_carrez,lot4_numero,lot4_surface_carrez,lot5_numero,lot5_surface_carrez,nombre_lots,code_type_local,type_local,surface_reelle_bati,nombre_pieces_principales,code_nature_culture,nature_culture,code_nature_culture_speciale,nature_culture_speciale,surface_terrain,longitude,latitude
2021-225043,2021-01-19,000001,Vente,90000,,,CHAMP DE GROLAS,B341,16120,16204,Bellevigne,16,,,162043860B0331,,,,,,,,,,,,,0,,,,,T,terres,,,4885,-0.123797,45.539221
2021-225043,2021-01-19,000001,Vente,90000,,,CHAMP DE GROLAS,B341,16120,16204,Bellevigne,16,,,162043860B0332,,,,,,,,,,,,,0,,,,,BT,taillis simples,,,2420,-0.12353,45.538941
2021-225043,2021-01-19,000001,Vente,90000,2,,LE BROIX,B334,16120,16204,Bellevigne,16,,,162043860B0453,,,,,,,,,,,,,0,1,Maison,160,5,S,sols,,,2050,-0.12847,45.544038
2021-225043,2021-01-19,000001,Vente,90000,,,LE BROIX,B334,16120,16204,Bellevigne,16,,,162043860B0948,,,,,,,,,,,,,0,,,,,S,sols,,,78,-0.128781,45.54392
2021-225043,2021-01-19,000001,Vente,90000,,,LE BROIX,B334,16120,16204,Bellevigne,16,,,162043860B0948,,,,,,,,,,,,,0,,,,,T,terres,,,2000,-0.128781,45.54392
2021-225043,2021-01-19,000001,Vente,90000,,,LE BROIX,B334,16120,16204,Bellevigne,16,,,162043860B0950,,,,,,,,,,,,,0,,,,,T,terres,,,1804,-0.129062,45.543793
2021-225043,2021-01-19,000001,Vente,90000,,,LES PRES DE FERRANDE,B130,16120,16204,Bellevigne,16,,,162040000C0732,,,,,,,,,,,,,0,,,,,P,prés,,,2658,-0.124176,45.545604
2021-225043,2021-01-19,000001,Vente,90000,,,LES PRES DE FERRANDE,B130,16120,16204,Bellevigne,16,,,162040000C0733,,,,,,,,,,,,,0,,,,,P,prés,,,3017,-0.123345,45.545263
2021-225457,2021-01-25,000001,Vente,14397,,,TERRES ET VIGNES DE CHEZ M,B158,16120,16204,Bellevigne,16,,,162040000B0605,,,,,,,,,,,,,0,,,,,T,terres,,,9770,-0.094463,45.566373
2021-225457,2021-01-25,000001,Vente,14397,,,TERRES ET VIGNES DE CHEZ M,B158,16120,16204,Bellevigne,16,,,162040000B0606,,,,,,,,,,,,,0,,,,,T,terres,,,4627,-0.094508,45.565673
2021-225783,2021-01-26,000002,Vente,125990,,,CHEZ PONTAIS,B192,16120,16204,Bellevigne,16,,,162041290B0651,,,,,,,,,,,,,0,,,,,P,prés,,,750,-0.090606,45.571081
2021-225783,2021-01-26,000002,Vente,125990,30,,RTE DU PONTAIS,0840,16120,16204,Bellevigne,16,,,162041290B1319,,,,,,,,,,,,,0,1,Maison,169,6,S,sols,,,1352,-0.089861,45.571085
2021-226198,2021-02-09,000001,Vente,8000,,,LES SABLES,B301,16120,16204,Bellevigne,16,,,162042470B0221,,,,,,,,,,,,,0,,,,,T,terres,,,4875,-0.109104,45.523925
2021-226198,2021-02-09,000001,Vente,8000,,,LE RENFERMIS,B571,16120,16204,Bellevigne,16,,,162044170A0163,,,,,,,,,,,,,0,,,,,T,terres,,,8490,-0.111726,45.526748
2021-226334,2021-02-13,000001,Vente,60000,,,RENTES DE LIGNIERES,B501,16120,16204,Bellevigne,16,,,162043860C0638,,,,,,,,,,,,,0,,,,,VI,vignes,,,5963,-0.154418,45.527825
2021-226334,2021-02-13,000001,Vente,60000,,,RENTES DE LIGNIERES,B501,16120,16204,Bellevigne,16,,,162043860C0639,,,,,,,,,,,,,0,,,,,VI,vignes,,,452,-0.153988,45.527816
2021-226334,2021-02-13,000001,Vente,60000,,,RENTES DE LIGNIERES,B501,16120,16204,Bellevigne,16,,,162043860C0640,,,,,,,,,,,,,0,,,,,VI,vignes,,,624,-0.1546,45.527334
2021-226334,2021-02-13,000001,Vente,60000,,,FIEF BERGENDON,B409,16120,16204,Bellevigne,16,,,162043860C0720,,,,,,,,,,,,,0,,,,,VI,vignes,,,5900,-0.151406,45.522948
2021-227200,2021-03-12,000001,Vente,16000,,,LA GRANDE PIECE MALAVILLE,B089,16120,16204,Bellevigne,16,,,162040000A0687,,,,,,,,,,,,,0,,,,,T,terres,,,10000,-0.0939,45.569386
2021-227200,2021-03-12,000001,Vente,16000,,,LA GRANDE PIECE MALAVILLE,B089,16120,16204,Bellevigne,16,,,162040000A0786,,,,,,,,,,,,,0,,,,,L,landes,,,4100,-0.094111,45.569343
2021-227279,2021-03-10,000001,Vente,63900,,,COMBE DE CHEZ FOUCHER,B264,16120,16204,Bellevigne,16,,,162042470A0177,,,,,,,,,,,,,0,,,,,T,terres,,,1650,-0.084004,45.524112
2021-227279,2021-03-10,000001,Vente,63900,,,PRAIRIE DU NE NONAVILLE,B294,16120,16204,Bellevigne,16,,,162042470A0288,,,,,,,,,,,,,0,,,,,T,terres,,,1070,-0.091843,45.524105
2021-227279,2021-03-10,000001,Vente,63900,,,PRAIRIE DU NE NONAVILLE,B294,16120,16204,Bellevigne,16,,,162042470A0297,,,,,,,,,,,,,0,,,,,T,terres,,,2750,-0.091385,45.523503
2021-227279,2021-03-10,000001,Vente,63900,,,PRAIRIE DU NE NONAVILLE,B294,16120,16204,Bellevigne,16,,,162042470A0298,,,,,,,,,,,,,0,,,,,T,terres,,,1320,-0.091219,45.523831
2021-227279,2021-03-10,000001,Vente,63900,,,COMBE DES POINTES,B267,16120,16204,Bellevigne,16,,,162042470A0452,,,,,,,,,,,,,0,,,,,BT,taillis simples,,,1080,-0.082178,45.526428
2021-227279,2021-03-10,000001,Vente,63900,,,PRAIRIE DU NE NONAVILLE,B294,16120,16204,Bellevigne,16,,,162042470A0576,,,,,,,,,,,,,0,,,,,T,terres,,,4318,-0.092359,45.52372
2021-227279,2021-03-10,000001,Vente,63900,,,PRAIRIE DU NE NONAVILLE,B294,16120,16204,Bellevigne,16,,,162042470A0928,,,,,,,,,,,,,0,,,,,P,prés,,,3465,-0.08668,45.521929
2021-227279,2021-03-10,000001,Vente,63900,,,PRAIRIE DU NE NONAVILLE,B294,16120,16204,Bellevigne,16,,,162042470A0930,,,,,,,,,,,,,0,,,,,P,prés,,,300,-0.087129,45.522107
2021-227279,2021-03-10,000001,Vente,63900,,,PRAIRIE DU NE NONAVILLE,B294,16120,16204,Bellevigne,16,,,162042470A0932,,,,,,,,,,,,,0,,,,,P,prés,,,785,-0.08746,45.522112
2021-227279,2021-03-10,000001,Vente,63900,,,PRAIRIE DU NE NONAVILLE,B294,16120,16204,Bellevigne,16,,,162042470A0934,,,,,,,,,,,,,0,,,,,P,prés,,,630,-0.087282,45.522082
2021-227279,2021-03-10,000001,Vente,63900,,,RIVIERE DU NE,B299,16120,16204,Bellevigne,16,,,162042470A0984,,,,,,,,,,,,,0,,,,,T,terres,,,7205,-0.08244,45.520775
2021-227279,2021-03-10,000001,Vente,63900,,,PRAIRIE DU NE NONAVILLE,B294,16120,16204,Bellevigne,16,,,162042470A1153,,,,,,,,,,,,,0,,,,,P,prés,,,273,-0.091551,45.522537
2021-227279,2021-03-10,000001,Vente,63900,,,PRAIRIE DU NE NONAVILLE,B294,16120,16204,Bellevigne,16,,,162042470A1155,,,,,,,,,,,,,0,,,,,T,terres,,,347,-0.091367,45.522577
2021-227279,2021-03-10,000001,Vente,63900,,,PRAIRIE DU NE NONAVILLE,B294,16120,16204,Bellevigne,16,,,162042470A1157,,,,,,,,,,,,,0,,,,,T,terres,,,924,-0.090932,45.522688
2021-227279,2021-03-10,000001,Vente,63900,,,PRAIRIE DU NE NONAVILLE,B294,16120,16204,Bellevigne,16,,,162042470A1159,,,,,,,,,,,,,0,,,,,T,terres,,,529,-0.090685,45.522799
2021-227279,2021-03-10,000001,Vente,63900,,,PRAIRIE DU NE NONAVILLE,B294,16120,16204,Bellevigne,16,,,162042470A1161,,,,,,,,,,,,,0,,,,,T,terres,,,808,-0.090545,45.522873
2021-227279,2021-03-10,000001,Vente,63900,,,PRAIRIE DU NE NONAVILLE,B294,16120,16204,Bellevigne,16,,,162042470A1163,,,,,,,,,,,,,0,,,,,T,terres,,,770,-0.09037,45.522936
2021-227279,2021-03-10,000001,Vente,63900,,,PRAIRIE DU NE NONAVILLE,B294,16120,16204,Bellevigne,16,,,162042470A1165,,,,,,,,,,,,,0,,,,,T,terres,,,93,-0.087902,45.523087
2021-227279,2021-03-10,000001,Vente,63900,,,PRAIRIE DU NE NONAVILLE,B294,16120,16204,Bellevigne,16,,,162042470A1167,,,,,,,,,,,,,0,,,,,T,terres,,,569,-0.087626,45.523062
2021-227279,2021-03-10,000001,Vente,63900,,,VERSENNES DU NE,B307,16120,16204,Bellevigne,16,,,162042470A1282,,,,,,,,,,,,,0,,,,,T,terres,,,1370,-0.085075,45.523882
2021-227279,2021-03-10,000001,Vente,63900,5054,,PAS DU PRINCE,B287,16120,16204,Bellevigne,16,,,162042470A1284,,,,,,,,,,,,,0,1,Maison,45,1,S,sols,,,974,-0.084704,45.523723
2021-227358,2021-03-23,000001,Vente,172000,1,,CHEZ MARTELOT,B365,16120,16204,Bellevigne,16,,,162043860C0013,,,,,,,,,,,,,0,1,Maison,290,8,S,sols,,,7200,-0.153391,45.542897
2021-227358,2021-03-23,000001,Vente,172000,,,CHEZ MARTELOT,B365,16120,16204,Bellevigne,16,,,162043860C0014,,,,,,,,,,,,,0,,,,,P,prés,,,5795,-0.154127,45.54263
2021-227358,2021-03-23,000001,Vente,172000,,,CHEZ MARTELOT,B365,16120,16204,Bellevigne,16,,,162043860C0015,,,,,,,,,,,,,0,,,,,J,jardins,,,1640,-0.153889,45.542407
2021-227358,2021-03-23,000001,Vente,172000,,,CHEZ MARTELOT,B365,16120,16204,Bellevigne,16,,,162043860C0019,,,,,,,,,,,,,0,,,,,S,sols,,,270,-0.152867,45.542474
2021-227358,2021-03-23,000001,Vente,172000,,,CHEZ MARTELOT,B365,16120,16204,Bellevigne,16,,,162043860C1067,,,,,,,,,,,,,0,,,,,P,prés,,,2891,-0.15302,45.543369
2021-227358,2021-03-23,000001,Vente,172000,,,LA CROIX BERTAUD,B396,16120,16204,Bellevigne,16,,,162043860C1079,,,,,,,,,,,,,0,,,,,T,terres,,,1103,-0.154378,45.543022
2021-227466,2021-04-15,000001,Vente,65304.25,,,LES NAUDRIES,B211,16120,16204,Bellevigne,16,,,162041290B0625,,,,,,,,,,,,,0,,,,,P,prés,,,1670,-0.085718,45.573819
2021-227466,2021-04-15,000001,Vente,65304.25,,,ERAVILLE      LE BOURG,B182,16120,16204,Bellevigne,16,,,162041290B0636,,,,,,,,,,,,,0,,,,,S,sols,,,250,-0.085681,45.573975
2021-227466,2021-04-15,000001,Vente,65304.25,8,,CHE SAINT PIERRE,1090,16120,16204,Bellevigne,16,,,162041290B0727,,,,,,,,,,,,,0,1,Maison,108,2,S,sols,,,297,-0.085709,45.574044
2021-227466,2021-04-15,000001,Vente,65304.25,,,ERAVILLE      LE BOURG,B182,16120,16204,Bellevigne,16,,,162041290B0728,,,,,,,,,,,,,0,,,,,P,prés,,,542,-0.086185,45.574035
2021-227466,2021-04-15,000001,Vente,65304.25,6,,CHE SAINT PIERRE,1090,16120,16204,Bellevigne,16,,,162041290B0914,,,,,,,,,,,,,0,1,Maison,30,1,S,sols,,,156,-0.085609,45.574158
2021-227478,2021-04-01,000001,Vente,2400,,,BOIS MOREAU,B022,16120,16204,Bellevigne,16,,,162040000B0614,,,,,,,,,,,,,0,,,,,VI,vignes,,,3500,-0.087214,45.559691
2021-227585,2021-03-30,000001,Vente,150000,20,,RTE CHARLES FRANC,0250,16120,16204,Bellevigne,16,,,162040000A0386,,,,,,,,,,,,,0,1,Maison,175,6,S,sols,,,1351,,
2021-227585,2021-03-30,000001,Vente,150000,,,LE MAS DU BOURG,B100,16120,16204,Bellevigne,16,,,162040000A0871,,,,,,,,,,,,,0,,,,,J,jardins,,,797,,
2021-227585,2021-03-30,000001,Vente,150000,,,LE MAS DU BOURG,B100,16120,16204,Bellevigne,16,,,162040000A0871,,,,,,,,,,,,,0,,,,,S,sols,,,200,,
2021-227585,2021-03-30,000001,Vente,150000,,,LE MAS DU BOURG,B100,16120,16204,Bellevigne,16,,,162040000A0873,,,,,,,,,,,,,0,,,,,T,terres,,,52,,
2021-227637,2021-03-26,000001,Vente,1500,,,FIEF DE DEVAUD,B276,16120,16204,Bellevigne,16,,,162042470B0303,,,,,,,,,,,,,0,,,,,T,terres,,,547,-0.108525,45.525639
2021-227637,2021-03-26,000001,Vente,1500,,,FIEF DE DEVAUD,B276,16120,16204,Bellevigne,16,,,162042470B0724,,,,,,,,,,,,,0,,,,,J,jardins,,,475,-0.108626,45.525559
2021-227637,2021-03-26,000001,Vente,1500,,,FIEF DE DEVAUD,B276,16120,16204,Bellevigne,16,,,162042470B0726,,,,,,,,,,,,,0,,,,,T,terres,,,832,-0.10832,45.525544
2021-227637,2021-03-26,000001,Vente,1500,,,PAS GAUFFRETEAU VIVILLE,B557,16120,16204,Bellevigne,16,,,162044170A0170,,,,,,,,,,,,,0,,,,,T,terres,,,1390,-0.111122,45.524321
2021-227763,2021-04-27,000003,Vente,67800,25,,RTE DES PRES CHASSERAUD,0880,16120,16204,Bellevigne,16,,,162040000A0274,,,,,,,,,,,,,0,1,Maison,95,4,S,sols,,,67,-0.095327,45.568233
2021-227763,2021-04-27,000003,Vente,67800,,,PRES DU BUISSON ET CHASSER,B133,16120,16204,Bellevigne,16,,,162040000A1228,,,,,,,,,,,,,0,,,,,J,jardins,,,688,-0.095349,45.568218
2021-227763,2021-04-27,000003,Vente,67800,,,PRES DU BUISSON ET CHASSER,B133,16120,16204,Bellevigne,16,,,162040000A1230,,,,,,,,,,,,,0,,,,,S,sols,,,68,-0.095293,45.567952
2021-227763,2021-04-27,000003,Vente,67800,,,PRES DU BUISSON ET CHASSER,B133,16120,16204,Bellevigne,16,,,162040000A1235,,,,,,,,,,,,,0,,,,,L,landes,,,240,-0.095339,45.568027
2021-227961,2021-04-02,000001,Vente,3471615,,,PUICAILLON,B296,16120,16204,Bellevigne,16,,,162042470A0116,,,,,,,,,,,,,0,,,,,L,landes,,,3670,-0.057843,45.542191
2021-227961,2021-04-02,000001,Vente,3471615,,,PUICAILLON,B296,16120,16204,Bellevigne,16,,,162042470A0119,,,,,,,,,,,,,0,,,,,VI,vignes,,,33990,-0.058436,45.540668
2021-227961,2021-04-02,000001,Vente,3471615,,,PUICAILLON,B296,16120,16204,Bellevigne,16,,,162042470A0121,,,,,,,,,,,,,0,,,,,L,landes,,,1363,-0.060223,45.539757
2021-227961,2021-04-02,000001,Vente,3471615,,,PUICAILLON,B296,16120,16204,Bellevigne,16,,,162042470A0121,,,,,,,,,,,,,0,,,,,VI,vignes,,,2727,-0.060223,45.539757
2021-227961,2021-04-02,000001,Vente,3471615,,,PUICAILLON,B296,16120,16204,Bellevigne,16,,,162042470A0125,,,,,,,,,,,,,0,,,,,L,landes,,,1033,-0.060714,45.539214
2021-227961,2021-04-02,000001,Vente,3471615,,,PUICAILLON,B296,16120,16204,Bellevigne,16,,,162042470A0125,,,,,,,,,,,,,0,,,,,VI,vignes,,,2067,-0.060714,45.539214
2021-227961,2021-04-02,000001,Vente,3471615,,,CHAMP DE FASSIER,B252,16120,16204,Bellevigne,16,,,162042470A0154,,,,,,,,,,,,,0,,,,,T,terres,,,10885,-0.06488,45.537303
2021-227961,2021-04-02,000001,Vente,3471615,,,CHAMP DE FASSIER,B252,16120,16204,Bellevigne,16,,,162042470A0155,,,,,,,,,,,,,0,,,,,T,terres,,,2775,-0.0652,45.536407
2021-227961,2021-04-02,000001,Vente,3471615,,,CHAMP DE FASSIER,B252,16120,16204,Bellevigne,16,,,162042470A0156,,,,,,,,,,,,,0,,,,,T,terres,,,16400,-0.065133,45.535061
2021-227961,2021-04-02,000001,Vente,3471615,,,MOULIN D ECOYEUX,B284,16120,16204,Bellevigne,16,,,162042470A0166,,,,,,,,,,,,,0,,,,,E,eaux,MARE,Mare,145,-0.061529,45.535123
2021-227961,2021-04-02,000001,Vente,3471615,,,PRAIRIE DE BONNEUIL,B293,16120,16204,Bellevigne,16,,,162042470A0172,,,,,,,,,,,,,0,,,,,P,prés,,,31219,-0.06318,45.53411
2021-227961,2021-04-02,000001,Vente,3471615,,,RIVIERE DU NE,B299,16120,16204,Bellevigne,16,,,162042470A0270,,,,,,,,,,,,,0,,,,,P,prés,,,3040,-0.083963,45.520271
2021-227961,2021-04-02,000001,Vente,3471615,,,PUICAILLON,B296,16120,16204,Bellevigne,16,,,162042470A0512,,,,,,,,,,,,,0,,,,,L,landes,,,5600,-0.059595,45.542624
2021-227961,2021-04-02,000001,Vente,3471615,,,CHAMP DE FASSIER,B252,16120,16204,Bellevigne,16,,,162042470A0513,,,,,,,,,,,,,0,,,,,L,landes,,,9751,-0.065861,45.535457
2021-227961,2021-04-02,000001,Vente,3471615,,,CHAMP DE FASSIER,B252,16120,16204,Bellevigne,16,,,162042470A0637,,,,,,,,,,,,,0,,,,,L,landes,,,165,-0.064591,45.53722
2021-227961,2021-04-02,000001,Vente,3471615,,,PUICAILLON,B296,16120,16204,Bellevigne,16,,,162042470A0677,,,,,,,,,,,,,0,,,,,VI,vignes,,,1706,-0.059409,45.540417
2021-227961,2021-04-02,000001,Vente,3471615,,,PUICAILLON,B296,16120,16204,Bellevigne,16,,,162042470A0677,,,,,,,,,,,,,0,,,,,L,landes,,,3204,-0.059409,45.540417
2021-228137,2021-04-14,000001,Vente,135000,5043,,CHAMP DES GAUVINS,B536,16120,16204,Bellevigne,16,,,162044170A1050,,,,,,,,,,,,,0,1,Maison,105,4,T,terres,,,3290,-0.113147,45.523816
2021-228137,2021-04-14,000001,Vente,135000,5043,,CHAMP DES GAUVINS,B536,16120,16204,Bellevigne,16,,,162044170A1050,,,,,,,,,,,,,0,1,Maison,105,4,S,sols,,,1000,-0.113147,45.523816
2021-228481,2021-04-02,000002,Vente,15000,,,CHEZ FARCHAUD,B191,16120,16204,Bellevigne,16,,,162041290A0183,,,,,,,,,,,,,0,,,,,P,prés,,,1150,-0.095032,45.582815
2021-228851,2021-05-12,000001,Vente,158000,4,,CHEZ FARCHAUD,B191,16120,16204,Bellevigne,16,,,162041290B0707,,,,,,,,,,,,,0,1,Maison,78,3,S,sols,,,1800,,
2021-228875,2021-06-01,000001,Vente,1000,,,PRES DU BUISSON ET CHASSER,B133,16120,16204,Bellevigne,16,,,162040000A1229,,,,,,,,,,,,,0,,,,,BT,taillis simples,,,126,-0.09561,45.56782
2021-228875,2021-06-01,000001,Vente,1000,,,PRES DU BUISSON ET CHASSER,B133,16120,16204,Bellevigne,16,,,162040000A1231,,,,,,,,,,,,,0,,,,,BT,taillis simples,,,105,-0.095371,45.567821
2021-228875,2021-06-01,000001,Vente,1000,,,PRES DU BUISSON ET CHASSER,B133,16120,16204,Bellevigne,16,,,162040000A1234,,,,,,,,,,,,,0,,,,,BT,taillis simples,,,13,-0.095434,45.567791
2021-228875,2021-06-01,000001,Vente,1000,,,PRES DU BUISSON ET CHASSER,B133,16120,16204,Bellevigne,16,,,162040000A1236,,,,,,,,,,,,,0,,,,,BT,taillis simples,,,159,-0.09549,45.567817
2021-229302,2021-05-26,000002,Vente,83000,1,,RTE DE BARBEZIEUX,0090,16120,16204,Bellevigne,16,,,162040000A1033,,,,,,,,,,,,,0,1,Maison,57,2,S,sols,,,238,-0.096582,45.556867
2021-229302,2021-05-26,000002,Vente,83000,,,LE MAS DU BOURG,B100,16120,16204,Bellevigne,16,,,162040000A1226,,,,,,,,,,,,,0,,,,,T,terres,,,267,-0.096566,45.556806
2021-229810,2021-06-10,000001,Vente,8994.42,,,CHEZ PIGET,B368,16120,16204,Bellevigne,16,,,162043860D0223,,,,,,,,,,,,,0,,,,,S,sols,,,58,-0.171655,45.538267
2021-229810,2021-06-10,000001,Vente,8994.42,,,BOIS PIGET,B326,16120,16204,Bellevigne,16,,,162043860D0806,,,,,,,,,,,,,0,,,,,T,terres,,,867,-0.17077,45.539797
2021-229810,2021-06-10,000001,Vente,8994.42,,,BOIS PIGET,B326,16120,16204,Bellevigne,16,,,162043860D0950,,,,,,,,,,,,,0,,,,,T,terres,,,2860,-0.17031,45.539348
2021-229810,2021-06-10,000001,Vente,8994.42,,,BOIS PIGET,B326,16120,16204,Bellevigne,16,,,162043860D1149,,,,,,,,,,,,,0,,,,,T,terres,,,9708,-0.171087,45.539461
2021-229811,2021-06-03,000001,Vente,150377.02,,,PRES DE L ESSARD,B483,16120,16204,Bellevigne,16,,,162043860D0033,,,,,,,,,,,,,0,,,,,T,terres,,,8239,-0.172437,45.533874
2021-229811,2021-06-03,000001,Vente,150377.02,,,PRES DE L ESSARD,B483,16120,16204,Bellevigne,16,,,162043860D0040,,,,,,,,,,,,,0,,,,,P,prés,,,456,-0.170947,45.532639
2021-229811,2021-06-03,000001,Vente,150377.02,,,FAIT NOUVEAU,B404,16120,16204,Bellevigne,16,,,162043860D0187,,,,,,,,,,,,,0,,,,,VI,vignes,,,4120,-0.173119,45.539913
2021-229811,2021-06-03,000001,Vente,150377.02,,,FAIT NOUVEAU,B404,16120,16204,Bellevigne,16,,,162043860D0197,,,,,,,,,,,,,0,,,,,VI,vignes,,,35,-0.172667,45.538979
2021-229811,2021-06-03,000001,Vente,150377.02,,,FAIT NOUVEAU,B404,16120,16204,Bellevigne,16,,,162043860D0197,,,,,,,,,,,,,0,,,,,T,terres,,,1950,-0.172667,45.538979
2021-229811,2021-06-03,000001,Vente,150377.02,,,FAIT NOUVEAU,B404,16120,16204,Bellevigne,16,,,162043860D0198,,,,,,,,,,,,,0,,,,,VI,vignes,,,1002,-0.172816,45.538992
2021-229811,2021-06-03,000001,Vente,150377.02,,,FAIT NOUVEAU,B404,16120,16204,Bellevigne,16,,,162043860D0199,,,,,,,,,,,,,0,,,,,VI,vignes,,,2813,-0.17307,45.539011
2021-229811,2021-06-03,000001,Vente,150377.02,8,,CHEZ PIGET,B368,16120,16204,Bellevigne,16,,,162043860D0217,,,,,,,,,,,,,0,1,Maison,60,2,S,sols,,,1420,-0.172118,45.538103
2021-229811,2021-06-03,000001,Vente,150377.02,6,,CHEZ PIGET,B368,16120,16204,Bellevigne,16,,,162043860D0218,,,,,,,,,,,,,0,1,Maison,45,2,S,sols,,,425,-0.171824,45.538199
2021-229811,2021-06-03,000001,Vente,150377.02,,,CHEZ PIGET,B368,16120,16204,Bellevigne,16,,,162043860D0221,,,,,,,,,,,,,0,,,,,S,sols,,,270,-0.171799,45.537973
2021-229811,2021-06-03,000001,Vente,150377.02,,,FAIT NOUVEAU,B404,16120,16204,Bellevigne,16,,,162043860D0707,,,,,,,,,,,,,0,,,,,VI,vignes,,,1180,-0.173335,45.539947
2021-229811,2021-06-03,000001,Vente,150377.02,,,PETITE CHAMPAGNE,B464,16120,16204,Bellevigne,16,,,162043860D0753,,,,,,,,,,,,,0,,,,,L,landes,,,88,-0.169501,45.531445
2021-229811,2021-06-03,000001,Vente,150377.02,,,PETITE CHAMPAGNE,B464,16120,16204,Bellevigne,16,,,162043860D0754,,,,,,,,,,,,,0,,,,,T,terres,,,5252,-0.169475,45.530619
2021-229811,2021-06-03,000001,Vente,150377.02,,,PETITE CHAMPAGNE,B464,16120,16204,Bellevigne,16,,,162043860D0755,,,,,,,,,,,,,0,,,,,T,terres,,,135,-0.16912,45.531343
2021-229811,2021-06-03,000001,Vente,150377.02,,,PETITE CHAMPAGNE,B464,16120,16204,Bellevigne,16,,,162043860D0758,,,,,,,,,,,,,0,,,,,T,terres,,,1060,-0.170138,45.529654
2021-229811,2021-06-03,000001,Vente,150377.02,,,PETITE CHAMPAGNE,B464,16120,16204,Bellevigne,16,,,162043860D0760,,,,,,,,,,,,,0,,,,,T,terres,,,80,-0.169764,45.531512
2021-229811,2021-06-03,000001,Vente,150377.02,,,PETITE CHAMPAGNE,B464,16120,16204,Bellevigne,16,,,162043860D0761,,,,,,,,,,,,,0,,,,,L,landes,,,84,-0.170028,45.531579
2021-229811,2021-06-03,000001,Vente,150377.02,,,PETITE CHAMPAGNE,B464,16120,16204,Bellevigne,16,,,162043860D0762,,,,,,,,,,,,,0,,,,,T,terres,,,494,,
2021-229811,2021-06-03,000001,Vente,150377.02,,,PETITE CHAMPAGNE,B464,16120,16204,Bellevigne,16,,,162043860D0763,,,,,,,,,,,,,0,,,,,P,prés,,,16,-0.170164,45.531614
2021-229811,2021-06-03,000001,Vente,150377.02,,,PETITE CHAMPAGNE,B464,16120,16204,Bellevigne,16,,,162043860D0765,,,,,,,,,,,,,0,,,,,T,terres,,,9469,,
2021-229811,2021-06-03,000001,Vente,150377.02,,,PUY MULET,B495,16120,16204,Bellevigne,16,,,162043860D0771,,,,,,,,,,,,,0,,,,,L,landes,,,125,-0.170218,45.529516
2021-229811,2021-06-03,000001,Vente,150377.02,,,CHEZ PIGET,B368,16120,16204,Bellevigne,16,,,162043860D0794,,,,,,,,,,,,,0,,,,,P,prés,,,1730,-0.172562,45.538154
2021-229811,2021-06-03,000001,Vente,150377.02,,,PRES DE L ESSARD,B483,16120,16204,Bellevigne,16,,,162043860D0915,,,,,,,,,,,,,0,,,,,T,terres,,,2080,-0.171308,45.532466
2021-229811,2021-06-03,000001,Vente,150377.02,,,PRES DE L ESSARD,B483,16120,16204,Bellevigne,16,,,162043860D0916,,,,,,,,,,,,,0,,,,,T,terres,,,20,-0.171402,45.532281
2021-229811,2021-06-03,000001,Vente,150377.02,,,FAIT NOUVEAU,B404,16120,16204,Bellevigne,16,,,162043860D1015,,,,,,,,,,,,,0,,,,,VI,vignes,,,128,-0.173589,45.540488
2021-229811,2021-06-03,000001,Vente,150377.02,,,FAIT NOUVEAU,B404,16120,16204,Bellevigne,16,,,162043860D1018,,,,,,,,,,,,,0,,,,,VI,vignes,,,862,-0.173432,45.539958
2021-229811,2021-06-03,000001,Vente,150377.02,,,PRES DE L ESSARD,B483,16120,16204,Bellevigne,16,,,162043860D1157,,,,,,,,,,,,,0,,,,,T,terres,,,10135,-0.171545,45.533156
2021-229811,2021-06-03,000001,Vente,150377.02,,,PRES DE L ESSARD,B483,16120,16204,Bellevigne,16,,,162043860D1192,,,,,,,,,,,,,0,,,,,T,terres,,,450,-0.171369,45.531717
2021-229811,2021-06-03,000001,Vente,150377.02,,,PETITE CHAMPAGNE,B464,16120,16204,Bellevigne,16,,,162043860D1194,,,,,,,,,,,,,0,,,,,T,terres,,,1507,-0.171894,45.530985
2021-229811,2021-06-03,000001,Vente,150377.02,,,PETITE CHAMPAGNE,B464,16120,16204,Bellevigne,16,,,162043860D1197,,,,,,,,,,,,,0,,,,,T,terres,,,6717,,
2021-229811,2021-06-03,000001,Vente,150377.02,,,PUY MULET,B495,16120,16204,Bellevigne,16,,,162043860D1200,,,,,,,,,,,,,0,,,,,T,terres,,,165,,
2021-229811,2021-06-03,000001,Vente,150377.02,,,PUY MULET,B495,16120,16204,Bellevigne,16,,,162043860D1201,,,,,,,,,,,,,0,,,,,T,terres,,,360,,
2021-230486,2021-07-02,000001,Vente,18900,,,VACHERESSE,B520,16120,16204,Bellevigne,16,,,162043860C1334,,,,,,,,,,,,,0,,,,,T,terres,,,801,-0.155227,45.527068
2021-230565,2021-06-24,000001,Vente,127000,5095,,CHP DE LA RIGOLE ET BOIS C,B194,16120,16204,Bellevigne,16,,,162041290B1151,,,,,,,,,,,,,0,1,Maison,200,5,S,sols,,,500,-0.090734,45.577826
2021-230565,2021-06-24,000001,Vente,127000,5095,,CHP DE LA RIGOLE ET BOIS C,B194,16120,16204,Bellevigne,16,,,162041290B1151,,,,,,,,,,,,,0,1,Maison,200,5,J,jardins,,,2000,-0.090734,45.577826
2021-230565,2021-06-24,000001,Vente,127000,5095,,CHP DE LA RIGOLE ET BOIS C,B194,16120,16204,Bellevigne,16,,,162041290B1151,,,,,,,,,,,,,0,1,Maison,200,5,BT,taillis simples,,,2113,-0.090734,45.577826
2021-230580,2021-07-02,000002,Vente,820,,,VACHERESSE,B520,16120,16204,Bellevigne,16,,,162043860C1335,,,,,,,,,,,,,0,,,,,T,terres,,,82,-0.155267,45.527158
2021-231141,2021-07-09,000001,Vente,208800,,,PRES DU BUISSON ET CHASSER,B133,16120,16204,Bellevigne,16,,,162040000A0271,,,,,,,,,,,,,0,,,,,T,terres,,,700,-0.09666,45.566869
2021-231141,2021-07-09,000001,Vente,208800,,,PRES DU BUISSON ET CHASSER,B133,16120,16204,Bellevigne,16,,,162040000A0279,,,,,,,,,,,,,0,,,,,L,landes,,,590,-0.096024,45.566877
2021-231141,2021-07-09,000001,Vente,208800,,,PRES DU BUISSON ET CHASSER,B133,16120,16204,Bellevigne,16,,,162040000A0280,,,,,,,,,,,,,0,,,,,L,landes,,,393,-0.096275,45.566626
2021-231141,2021-07-09,000001,Vente,208800,,,PRES DU BUISSON ET CHASSER,B133,16120,16204,Bellevigne,16,,,162040000A0781,,,,,,,,,,,,,0,,,,,L,landes,,,320,-0.096311,45.566825
2021-231141,2021-07-09,000001,Vente,208800,11,,RTE DE LA RIVIERE,1010,16120,16204,Bellevigne,16,,,162040000A1005,,,,,,,,,,,,,0,1,Maison,143,5,P,prés,,,9488,-0.0959,45.566554
2021-231141,2021-07-09,000001,Vente,208800,11,,RTE DE LA RIVIERE,1010,16120,16204,Bellevigne,16,,,162040000A1005,,,,,,,,,,,,,0,1,Maison,143,5,S,sols,,,500,-0.0959,45.566554
2021-231141,2021-07-09,000001,Vente,208800,11,,RTE DE LA RIVIERE,1010,16120,16204,Bellevigne,16,,,162040000A1005,,,,,,,,,,,,,0,1,Maison,143,5,J,jardins,,,2000,-0.0959,45.566554
2021-231373,2021-07-09,000001,Vente,257300,71,,RTE BASSE,0110,16120,16204,Bellevigne,16,,,162042470B0088,,,,,,,,,,,,,0,1,Maison,207,6,J,jardins,,,935,-0.08247,45.538085