id_mutation,date_mutation,numero_disposition,nature_mutation,valeur_fonciere,adresse_numero,adresse_suffixe,adresse_nom_voie,adresse_code_voie,code_postal,code_commune,nom_commune,code_departement,ancien_code_commune,ancien_nom_commune,id_parcelle,ancien_id_parcelle,numero_volume,lot1_numero,lot1_surface_carrez,lot2_numero,lot2_surface_carrez,lot3_numero,lot3_surface_carrez,lot4_numero,lot4_surface_carrez,lot5_numero,lot5_surface_carrez,nombre_lots,code_type_local,type_local,surface_reelle_bati,nombre_pieces_principales,code_nature_culture,nature_culture,code_nature_culture_speciale,nature_culture_speciale,surface_terrain,longitude,latitude
2021-225724,2021-02-03,000001,Vente,5625,,,AUX PIGNIERS,B106,16350,16310,Saint-Coutant,16,,,163100000D0111,,,,,,,,,,,,,0,,,,,T,terres,,,11250,0.48728,45.979307
2021-226337,2021-02-26,000001,Vente,76336.57,,,LA PRADELLE,B113,16350,16310,Saint-Coutant,16,,,163100000D0427,,,,,,,,,,,,,0,,,,,T,terres,,,7870,0.47848,45.966907
2021-226337,2021-02-26,000001,Vente,76336.57,,,LA PRADELLE,B113,16350,16310,Saint-Coutant,16,,,163100000D0427,,,,,,,,,,,,,0,,,,,S,sols,,,350,0.47848,45.966907
2021-226337,2021-02-26,000001,Vente,76336.57,,,LA PRADELLE,B113,16350,16310,Saint-Coutant,16,,,163100000D0428,,,,,,,,,,,,,0,,,,,T,terres,,,8610,0.478829,45.967484
2021-226337,2021-02-26,000001,Vente,76336.57,,,LA PRADELLE,B113,16350,16310,Saint-Coutant,16,,,163100000D1082,,,,,,,,,,,,,0,,,,,J,jardins,,,26,0.478022,45.966408
2021-226337,2021-02-26,000001,Vente,76336.57,1,,CHEZ MILLET,B157,16350,16310,Saint-Coutant,16,,,163100000D1083,,,,,,,,,,,,,0,1,Maison,98,4,S,sols,,,1718,0.478228,45.966564
2021-226337,2021-02-26,000001,Vente,76336.57,,,LA PRADELLE,B113,16350,16310,Saint-Coutant,16,,,163100000D1129,,,,,,,,,,,,,0,,,,,T,terres,,,4790,0.477222,45.965783
2021-226337,2021-02-26,000001,Vente,76336.57,,,LE GRAND PRE,B080,16350,16310,Saint-Coutant,16,,,163100000D1132,,,,,,,,,,,,,0,,,,,P,prés,,,4220,0.477689,45.96649
2021-226337,2021-02-26,000001,Vente,76336.57,,,LE GRAND PRE,B080,16350,16310,Saint-Coutant,16,,,163100000D1133,,,,,,,,,,,,,0,,,,,P,prés,,,190,0.476595,45.965916
2021-226337,2021-02-26,000001,Vente,76336.57,,,LA PRADELLE,B113,16350,16310,Saint-Coutant,16,,,163100000D1232,,,,,,,,,,,,,0,,,,,P,prés,,,6809,0.47801,45.967724
2021-226482,2021-02-17,000001,Vente,64000,,,LES FAYES,B066,16350,16310,Saint-Coutant,16,,,163100000B0386,,,,,,,,,,,,,0,,,,,T,terres,,,740,0.465974,46.004693
2021-226482,2021-02-17,000001,Vente,64000,16,,LA RECHAUDIE,B129,16350,16310,Saint-Coutant,16,,,163100000B0660,,,,,,,,,,,,,0,1,Maison,50,2,S,sols,,,275,0.464482,45.998439
2021-226482,2021-02-17,000001,Vente,64000,,,LA RECHAUDIE,B129,16350,16310,Saint-Coutant,16,,,163100000B0661,,,,,,,,,,,,,0,,,,,S,sols,,,10,0.464395,45.998361
2021-226482,2021-02-17,000001,Vente,64000,,,LA RECHAUDIE,B129,16350,16310,Saint-Coutant,16,,,163100000B0690,,,,,,,,,,,,,0,,,,,S,sols,,,679,0.464164,45.998354
2021-226482,2021-02-17,000001,Vente,64000,,,LA RECHAUDIE,B129,16350,16310,Saint-Coutant,16,,,163100000B0691,,,,,,,,,,,,,0,,,,,J,jardins,,,55,0.464014,45.998193
2021-226482,2021-02-17,000001,Vente,64000,,,LA RECHAUDIE,B129,16350,16310,Saint-Coutant,16,,,163100000B0692,,,,,,,,,,,,,0,,,,,J,jardins,,,117,0.464095,45.998185
2021-226482,2021-02-17,000001,Vente,64000,,,LA RECHAUDIE,B129,16350,16310,Saint-Coutant,16,,,163100000B0695,,,,,,,,,,,,,0,,,,,S,sols,,,42,0.464309,45.99843
2021-226482,2021-02-17,000001,Vente,64000,,,LA RECHAUDIE,B129,16350,16310,Saint-Coutant,16,,,163100000B0696,,,,,,,,,,,,,0,,,,,S,sols,,,35,0.464273,45.998487
2021-226482,2021-02-17,000001,Vente,64000,,,LES FAYES,B066,16350,16310,Saint-Coutant,16,,,163100000B0784,,,,,,,,,,,,,0,,,,,T,terres,,,989,0.466066,46.004741
2021-227701,2021-03-30,000001,Vente,33000,,,LES BRANDES,B024,16350,16310,Saint-Coutant,16,,,163100000A0039,,,,,,,,,,,,,0,,,,,T,terres,,,6870,0.433274,46.019282
2021-227701,2021-03-30,000001,Vente,33000,,,AU BRULE,B030,16350,16310,Saint-Coutant,16,,,163100000A0803,,,,,,,,,,,,,0,,,,,T,terres,,,7020,0.429515,46.012439
2021-227780,2021-04-16,000001,Vente,148000,5,,CHEZ GANIVET,B053,16350,16310,Saint-Coutant,16,,,163100000A0376,,,,,,,,,,,,,0,1,Maison,152,6,S,sols,,,565,0.431494,46.012173
2021-227780,2021-04-16,000001,Vente,148000,,,CHEZ GANIVET,B053,16350,16310,Saint-Coutant,16,,,163100000A0377,,,,,,,,,,,,,0,,,,,P,prés,,,1175,0.431117,46.01225
2021-227780,2021-04-16,000001,Vente,148000,,,CHEZ GANIVET,B053,16350,16310,Saint-Coutant,16,,,163100000A0378,,,,,,,,,,,,,0,,,,,P,prés,,,1885,0.43131,46.012466
2021-227871,2021-04-07,000001,Vente,7971,,,LES BRANDES,B024,16350,16310,Saint-Coutant,16,,,163100000A0045,,,,,,,,,,,,,0,,,,,T,terres,,,5240,0.435921,46.019206
2021-227871,2021-04-07,000001,Vente,7971,,,LES BRANDES,B024,16350,16310,Saint-Coutant,16,,,163100000A0048,,,,,,,,,,,,,0,,,,,T,terres,,,3359,0.436867,46.018768
2021-227871,2021-04-07,000001,Vente,7971,,,AUX AGES,B002,16350,16310,Saint-Coutant,16,,,163100000A0079,,,,,,,,,,,,,0,,,,,T,terres,,,1755,0.425777,46.013767
2021-227871,2021-04-07,000001,Vente,7971,,,AUX AGES,B002,16350,16310,Saint-Coutant,16,,,163100000A0080,,,,,,,,,,,,,0,,,,,T,terres,,,1395,0.426019,46.013619
2021-227871,2021-04-07,000001,Vente,7971,,,LA BAISSE,B003,16350,16310,Saint-Coutant,16,,,163100000A0118,,,,,,,,,,,,,0,,,,,T,terres,,,5092,0.433342,46.015363
2021-227871,2021-04-07,000001,Vente,7971,,,AU BRULE,B030,16350,16310,Saint-Coutant,16,,,163100000A0144,,,,,,,,,,,,,0,,,,,T,terres,,,4950,0.43187,46.013796
2021-227871,2021-04-07,000001,Vente,7971,,,LA GRANDE VIGNE,B083,16350,16310,Saint-Coutant,16,,,163100000A0341,,,,,,,,,,,,,0,,,,,T,terres,,,2270,0.428646,46.009311
2021-227871,2021-04-07,000001,Vente,7971,,,LES BRANDES,B024,16350,16310,Saint-Coutant,16,,,163100000A0757,,,,,,,,,,,,,0,,,,,T,terres,,,2511,0.436731,46.018944
2021-228908,2021-05-20,000001,Vente,15000,,,CHEZ GANIVET,B053,16350,16310,Saint-Coutant,16,,,163100000A0389,,,,,,,,,,,,,0,,,,,P,prés,,,1260,0.432824,46.013698
2021-228908,2021-05-20,000001,Vente,15000,,,CHEZ GANIVET,B053,16350,16310,Saint-Coutant,16,,,163100000A0390,,,,,,,,,,,,,0,,,,,S,sols,,,840,0.43298,46.013902
2021-228908,2021-05-20,000001,Vente,15000,,,CHEZ GANIVET,B053,16350,16310,Saint-Coutant,16,,,163100000A0391,,,,,,,,,,,,,0,,,,,VI,vignes,,,2000,0.433008,46.014324
2021-228908,2021-05-20,000001,Vente,15000,,,CHEZ GANIVET,B053,16350,16310,Saint-Coutant,16,,,163100000A0391,,,,,,,,,,,,,0,,,,,P,prés,,,520,0.433008,46.014324
2021-229316,2021-05-20,000001,Vente,130500,2,,LA FILNIE,B158,16350,16310,Saint-Coutant,16,,,163100000C0765,,,,,,,,,,,,,0,3,Dépendance,,0,J,jardins,,,653,0.482139,45.991207
2021-229316,2021-05-20,000001,Vente,130500,2,,LA FILNIE,B158,16350,16310,Saint-Coutant,16,,,163100000C0765,,,,,,,,,,,,,0,3,Dépendance,,0,S,sols,,,1000,0.482139,45.991207
2021-229316,2021-05-20,000001,Vente,130500,2,,LA FILNIE,B158,16350,16310,Saint-Coutant,16,,,163100000C0765,,,,,,,,,,,,,0,1,Maison,110,6,S,sols,,,1000,0.482139,45.991207
2021-229316,2021-05-20,000001,Vente,130500,2,,LA FILNIE,B158,16350,16310,Saint-Coutant,16,,,163100000C0765,,,,,,,,,,,,,0,1,Maison,110,6,J,jardins,,,653,0.482139,45.991207
2021-230285,2021-06-18,000001,Vente,1500,,,CHEZ BANCHARRAUD,B051,16350,16310,Saint-Coutant,16,,,163100000A0273,,,,,,,,,,,,,0,,,,,S,sols,,,130,0.422056,46.010927
2021-230331,2021-06-28,000001,Vente,19488,,,LA VIGNE DE L EPINASSE,B153,16350,16310,Saint-Coutant,16,,,163100000B0768,,,,,,,,,,,,,0,,,,,P,prés,,,1740,0.457369,45.996309
2021-230331,2021-06-28,000001,Vente,19488,,,LA VIGNE DE L EPINASSE,B153,16350,16310,Saint-Coutant,16,,,163100000B0769,,,,,,,,,,,,,0,,,,,P,prés,,,1170,0.457216,45.996464
2021-230331,2021-06-28,000001,Vente,19488,,,LES GRANDS BOIS,B085,16350,16310,Saint-Coutant,16,,,163100000D0131,,,,,,,,,,,,,0,,,,,BT,taillis simples,,,8310,0.472282,45.978349
2021-230331,2021-06-28,000001,Vente,19488,,,LA PIECE DU FORT,B105,16350,16310,Saint-Coutant,16,,,163100000D0188,,,,,,,,,,,,,0,,,,,BT,taillis simples,,,2870,0.473457,45.982685
2021-230331,2021-06-28,000001,Vente,19488,,,POIRIER DE LA RODE,B109,16350,16310,Saint-Coutant,16,,,163100000D0267,,,,,,,,,,,,,0,,,,,BT,taillis simples,,,2598,0.467625,45.989877
2021-230331,2021-06-28,000001,Vente,19488,,,POIRIER DE LA RODE,B109,16350,16310,Saint-Coutant,16,,,163100000D0269,,,,,,,,,,,,,0,,,,,T,terres,,,3170,0.467935,45.990515
2021-230331,2021-06-28,000001,Vente,19488,,,LE GRAND PRE,B080,16350,16310,Saint-Coutant,16,,,163100000D0366,,,,,,,,,,,,,0,,,,,P,prés,,,4770,0.466217,45.990464
2021-230331,2021-06-28,000001,Vente,19488,,,LES CHAILLOTS,B031,16350,16310,Saint-Coutant,16,,,163100000D0594,,,,,,,,,,,,,0,,,,,T,terres,,,7215,0.458332,45.987755
2021-230331,2021-06-28,000001,Vente,19488,,,AU PAIRET,B097,16350,16310,Saint-Coutant,16,,,163100000D0652,,,,,,,,,,,,,0,,,,,BT,taillis simples,,,1915,0.462471,45.980386
2021-230331,2021-06-28,000001,Vente,19488,,,CHAMPS DE GODARD,B039,16350,16310,Saint-Coutant,16,,,163100000D0683,,,,,,,,,,,,,0,,,,,T,terres,,,340,0.454879,45.98932
2021-230331,2021-06-28,000001,Vente,19488,,,CHAMPS DE GODARD,B039,16350,16310,Saint-Coutant,16,,,163100000D0683,,,,,,,,,,,,,0,,,,,VI,vignes,,,1120,0.454879,45.98932
2021-230331,2021-06-28,000001,Vente,19488,,,CHAMPS DE GODARD,B039,16350,16310,Saint-Coutant,16,,,163100000D0684,,,,,,,,,,,,,0,,,,,T,terres,,,4170,0.454693,45.989509
2021-230331,2021-06-28,000001,Vente,19488,,,CHAMPS DE GODARD,B039,16350,16310,Saint-Coutant,16,,,163100000D0685,,,,,,,,,,,,,0,,,,,T,terres,,,2700,0.455705,45.990823
2021-230331,2021-06-28,000001,Vente,19488,,,CHAMPS DE GODARD,B039,16350,16310,Saint-Coutant,16,,,163100000D0688,,,,,,,,,,,,,0,,,,,T,terres,,,1640,0.454347,45.989519
2021-230331,2021-06-28,000001,Vente,19488,,,CHAMPS DE GODARD,B039,16350,16310,Saint-Coutant,16,,,163100000D0724,,,,,,,,,,,,,0,,,,,T,terres,,,3730,0.456909,45.98787
2021-230331,2021-06-28,000001,Vente,19488,,,LA BARRIERE,B005,16350,16310,Saint-Coutant,16,,,163100000D0759,,,,,,,,,,,,,0,,,,,T,terres,,,1525,0.458511,45.989762
2021-230331,2021-06-28,000001,Vente,19488,,,PRES DE LA TOUCHE,B123,16350,16310,Saint-Coutant,16,,,163100000D0875,,,,,,,,,,,,,0,,,,,P,prés,,,645,0.457086,45.995492
2021-230331,2021-06-28,000001,Vente,19488,,,PRES DE LA TOUCHE,B123,16350,16310,Saint-Coutant,16,,,163100000D0875,,,,,,,,,,,,,0,,,,,P,prés,,,645,0.457086,45.995492
2021-230331,2021-06-28,000001,Vente,19488,,,BOIS DE CHEZ MICHAUD,B010,16350,16310,Saint-Coutant,16,,,163100000D1263,,,,,,,,,,,,,0,,,,,T,terres,,,6179,0.454356,45.993989
2021-230331,2021-06-28,000001,Vente,19488,,,PRES DE LA TOUCHE,B123,16350,16310,Saint-Coutant,16,,,163100000D1298,,,,,,,,,,,,,0,,,,,P,prés,,,4814,0.456723,45.996093
2021-230331,2021-06-28,000001,Vente,19488,,,PRES DE LA TOUCHE,B123,16350,16310,Saint-Coutant,16,,,163100000D1298,,,,,,,,,,,,,0,,,,,P,prés,,,4813,0.456723,45.996093
2021-230431,2021-07-05,000001,Vente,134000,4,,CHEZ CHAPELAUD,B052,16350,16310,Saint-Coutant,16,,,163100000D1332,,,,,,,,,,,,,0,3,Dépendance,,0,AG,terrains d'agrément,,,3119,0.463478,45.990152
2021-230431,2021-07-05,000001,Vente,134000,4,,CHEZ CHAPELAUD,B052,16350,16310,Saint-Coutant,16,,,163100000D1332,,,,,,,,,,,,,0,3,Dépendance,,0,AG,terrains d'agrément,,,3119,0.463478,45.990152
2021-230431,2021-07-05,000001,Vente,134000,4,,CHEZ CHAPELAUD,B052,16350,16310,Saint-Coutant,16,,,163100000D1332,,,,,,,,,,,,,0,3,Dépendance,,0,AG,terrains d'agrément,,,3119,0.463478,45.990152
2021-230431,2021-07-05,000001,Vente,134000,4,,CHEZ CHAPELAUD,B052,16350,16310,Saint-Coutant,16,,,163100000D1332,,,,,,,,,,,,,0,1,Maison,111,3,AG,terrains d'agrément,,,3119,0.463478,45.990152
2021-230431,2021-07-05,000001,Vente,134000,4,,CHEZ CHAPELAUD,B052,16350,16310,Saint-Coutant,16,,,163100000D1332,,,,,,,,,,,,,0,3,Dépendance,,0,S,sols,,,500,0.463478,45.990152
2021-230431,2021-07-05,000001,Vente,134000,4,,CHEZ CHAPELAUD,B052,16350,16310,Saint-Coutant,16,,,163100000D1332,,,,,,,,,,,,,0,1,Maison,111,3,S,sols,,,500,0.463478,45.990152
2021-230431,2021-07-05,000001,Vente,134000,4,,CHEZ CHAPELAUD,B052,16350,16310,Saint-Coutant,16,,,163100000D1332,,,,,,,,,,,,,0,3,Dépendance,,0,S,sols,,,500,0.463478,45.990152
2021-230431,2021-07-05,000001,Vente,134000,4,,CHEZ CHAPELAUD,B052,16350,16310,Saint-Coutant,16,,,163100000D1332,,,,,,,,,,,,,0,3,Dépendance,,0,S,sols,,,500,0.463478,45.990152
2021-230786,2021-07-12,000001,Vente,2800,,,LA BARRIERE,B005,16350,16310,Saint-Coutant,16,,,163100000D0773,,,,,,,,,,,,,0,,,,,P,prés,,,2185,0.461718,45.990581
2021-230786,2021-07-12,000001,Vente,2800,,,LA BARRIERE,B005,16350,16310,Saint-Coutant,16,,,163100000D0774,,,,,,,,,,,,,0,,,,,T,terres,,,6085,0.461071,45.989924
2021-230786,2021-07-12,000001,Vente,2800,,,LA BARRIERE,B005,16350,16310,Saint-Coutant,16,,,163100000D0776,,,,,,,,,,,,,0,,,,,T,terres,,,2931,0.460138,45.989943
2021-231263,2021-07-16,000001,Vente,135000,,,LA GRANDE VIGNE,B083,16350,16310,Saint-Coutant,16,,,163100000A0336,,,,,,,,,,,,,0,,,,,T,terres,,,11228,0.429799,46.008131
2021-231263,2021-07-16,000001,Vente,135000,,,LA GRANDE VIGNE,B083,16350,16310,Saint-Coutant,16,,,163100000A0337,,,,,,,,,,,,,0,,,,,T,terres,,,3100,0.431499,46.009239
2021-231263,2021-07-16,000001,Vente,135000,,,LES MAUVAISES,B093,16350,16310,Saint-Coutant,16,,,163100000A0464,,,,,,,,,,,,,0,,,,,J,jardins,,,62,0.432288,46.009988
2021-231263,2021-07-16,000001,Vente,135000,,,LES MAUVAISES,B093,16350,16310,Saint-Coutant,16,,,163100000A0465,,,,,,,,,,,,,0,,,,,J,jardins,,,205,0.432218,46.009907
2021-231263,2021-07-16,000001,Vente,135000,4,,CHEZ GANIVET,B053,16350,16310,Saint-Coutant,16,,,163100000A0466,,,,,,,,,,,,,0,1,Maison,126,5,S,sols,,,1500,0.432105,46.009558
2021-231263,2021-07-16,000001,Vente,135000,4,,CHEZ GANIVET,B053,16350,16310,Saint-Coutant,16,,,163100000A0466,,,,,,,,,,,,,0,1,Maison,126,5,P,prés,,,1470,0.432105,46.009558
2021-231263,2021-07-16,000001,Vente,135000,4,,CHEZ GANIVET,B053,16350,16310,Saint-Coutant,16,,,163100000A0466,,,,,,,,,,,,,0,1,Maison,126,5,P,prés,,,1470,0.432105,46.009558
2021-231263,2021-07-16,000001,Vente,135000,,,LES MAUVAISES,B093,16350,16310,Saint-Coutant,16,,,163100000A0806,,,,,,,,,,,,,0,,,,,P,prés,,,440,0.43196,46.009186
2021-231263,2021-07-16,000001,Vente,135000,,,LES MAUVAISES,B093,16350,16310,Saint-Coutant,16,,,163100000A0806,,,,,,,,,,,,,0,,,,,P,prés,,,440,0.43196,46.009186
2021-231263,2021-07-16,000001,Vente,135000,,,LES MAUVAISES,B093,16350,16310,Saint-Coutant,16,,,163100000A0806,,,,,,,,,,,,,0,,,,,S,sols,,,20,0.43196,46.009186
2021-231263,2021-07-16,000001,Vente,135000,,,LES MAUVAISES,B093,16350,16310,Saint-Coutant,16,,,163100000A0812,,,,,,,,,,,,,0,,,,,J,jardins,,,62,0.432317,46.010025
2021-232075,2021-08-23,000002,Vente,1343,,,L EPINASSE,B065,16350,16310,Saint-Coutant,16,,,163100000B1031,,,,,,,,,,,,,0,,,,,T,terres,,,4476,,
2021-233437,2021-09-30,000001,Vente,151450,17,,LA RECHAUDIE,B129,16350,16310,Saint-Coutant,16,,,163100000B1028,,,,,,,,,,,,,0,3,Dépendance,,0,P,prés,,,3283,0.464083,45.99883
2021-233437,2021-09-30,000001,Vente,151450,17,,LA RECHAUDIE,B129,16350,16310,Saint-Coutant,16,,,163100000B1028,,,,,,,,,,,,,0,1,Maison,95,5,P,prés,,,3283,0.464083,45.99883
2021-233437,2021-09-30,000001,Vente,151450,17,,LA RECHAUDIE,B129,16350,16310,Saint-Coutant,16,,,163100000B1028,,,,,,,,,,,,,0,1,Maison,95,5,S,sols,,,2000,0.464083,45.99883
2021-233437,2021-09-30,000001,Vente,151450,17,,LA RECHAUDIE,B129,16350,16310,Saint-Coutant,16,,,163100000B1028,,,,,,,,,,,,,0,3,Dépendance,,0,S,sols,,,2000,0.464083,45.99883
2021-233554,2021-09-20,000001,Vente,1000,,,AU PAIRET,B097,16350,16310,Saint-Coutant,16,,,163100000D0642,,,,,,,,,,,,,0,,,,,T,terres,,,3630,0.462463,45.982496
2021-234713,2021-11-04,000001,Vente,45000,1,,RUE BASSE CHEZ GANIVET,0080,16350,16310,Saint-Coutant,16,,,163100000A0358,,,,,,,,,,,,,0,1,Maison,125,6,S,sols,,,630,0.433262,46.011159
2021-234713,2021-11-04,000001,Vente,45000,,,CHEZ GANIVET,B053,16350,16310,Saint-Coutant,16,,,163100000A0359,,,,,,,,,,,,,0,,,,,P,prés,,,900,0.433174,46.011334
2021-236615,2021-12-22,000001,Vente,2000,6,,LE BOURG NEUF,B023,16350,16310,Saint-Coutant,16,,,163100000D0953,,,,,,,,,,,,,0,,,,,P,prés,,,1250,0.460183,45.994228
