id_mutation,date_mutation,numero_disposition,nature_mutation,valeur_fonciere,adresse_numero,adresse_suffixe,adresse_nom_voie,adresse_code_voie,code_postal,code_commune,nom_commune,code_departement,ancien_code_commune,ancien_nom_commune,id_parcelle,ancien_id_parcelle,numero_volume,lot1_numero,lot1_surface_carrez,lot2_numero,lot2_surface_carrez,lot3_numero,lot3_surface_carrez,lot4_numero,lot4_surface_carrez,lot5_numero,lot5_surface_carrez,nombre_lots,code_type_local,type_local,surface_reelle_bati,nombre_pieces_principales,code_nature_culture,nature_culture,code_nature_culture_speciale,nature_culture_speciale,surface_terrain,longitude,latitude
2021-226193,2021-02-22,000001,Vente,7000,8,,VIEILLE VIGNE,B205,16420,16363,Saulgond,16,,,163630000E0080,,,,,,,,,,,,,0,,,,,AB,terrains a bâtir,,,1879,0.762511,45.956409
2021-226444,2021-03-08,000001,Vente,300,,,LE MASGIRAL,B114,16420,16363,Saulgond,16,,,163630000D0065,,,,,,,,,,,,,0,,,,,J,jardins,,,310,0.804727,45.926936
2021-226579,2021-02-22,000001,Vente,260000,,,MASFAURANT,B113,16420,16363,Saulgond,16,,,163630000B0516,,,,,,,,,,,,,0,,,,,P,prés,,,4530,0.803895,45.963052
2021-226579,2021-02-22,000001,Vente,260000,,,MASFAURANT,B113,16420,16363,Saulgond,16,,,163630000B0517,,,,,,,,,,,,,0,,,,,E,eaux,ETANG,Etangs,3520,0.804056,45.962911
2021-226579,2021-02-22,000001,Vente,260000,,,MASFAURANT,B113,16420,16363,Saulgond,16,,,163630000B0518,,,,,,,,,,,,,0,,,,,P,prés,,,5890,0.80434,45.962722
2021-226579,2021-02-22,000001,Vente,260000,5,,LE MASJOUBERT,B115,16420,16363,Saulgond,16,,,163630000B1183,,,,,,,,,,,,,0,1,Maison,230,5,S,sols,,,1000,0.805375,45.962377
2021-226579,2021-02-22,000001,Vente,260000,5,,LE MASJOUBERT,B115,16420,16363,Saulgond,16,,,163630000B1183,,,,,,,,,,,,,0,1,Maison,230,5,AG,terrains d'agrément,,,3990,0.805375,45.962377
2021-226700,2021-02-24,000001,Vente,2210,,,VIGNES DU CHASSIN,B208,16420,16363,Saulgond,16,,,163630000F0532,,,,,,,,,,,,,0,,,,,T,terres,,,2860,0.77926,45.958068
2021-226700,2021-02-24,000001,Vente,2210,,,VIGNES DU CHASSIN,B208,16420,16363,Saulgond,16,,,163630000F0533,,,,,,,,,,,,,0,,,,,T,terres,,,1398,0.778722,45.957661
2021-226700,2021-02-24,000001,Vente,2210,,,VIGNES DU CHASSIN,B208,16420,16363,Saulgond,16,,,163630000F0534,,,,,,,,,,,,,0,,,,,T,terres,,,4580,0.778071,45.957542
2021-227237,2021-03-22,000001,Vente,90000,,,LE BOURG,B027,16420,16363,Saulgond,16,,,16363000AB0133,,,,,,,,,,,,,0,,,,,J,jardins,,,403,0.783177,45.949941
2021-227237,2021-03-22,000001,Vente,90000,3,,RUE DE LA GALERIE,0020,16420,16363,Saulgond,16,,,16363000AB0134,,,,,,,,,,,,,0,1,Maison,113,5,S,sols,,,555,0.78338,45.950081
2021-228884,2021-05-18,000001,Vente,100,,,BENETEIX,B015,16420,16363,Saulgond,16,,,163630000B0893,,,,,,,,,,,,,0,,,,,S,sols,,,22,0.799911,45.954535
2021-229056,2021-05-10,000001,Vente,560,,,LA MARLINE,B110,16420,16363,Saulgond,16,,,163630000C0534,,,,,,,,,,,,,0,,,,,T,terres,,,1986,0.777661,45.949583
2021-229133,2021-06-01,000001,Vente,130000,5418,F,LE MASJOUBERT,B115,16420,16363,Saulgond,16,,,163630000B0668,,,,,,,,,,,,,0,3,Dépendance,,0,S,sols,,,347,0.804793,45.96147
2021-229133,2021-06-01,000001,Vente,130000,2,,LE MASJOUBERT,B115,16420,16363,Saulgond,16,,,163630000B0669,,,,,,,,,,,,,0,1,Maison,114,3,S,sols,,,288,0.8045,45.961502
2021-229133,2021-06-01,000001,Vente,130000,5419,F,LE MASJOUBERT,B115,16420,16363,Saulgond,16,,,163630000B0938,,,,,,,,,,,,,0,3,Dépendance,,0,S,sols,,,182,0.804719,45.961571
2021-229133,2021-06-01,000001,Vente,130000,,,LE MASJOUBERT,B115,16420,16363,Saulgond,16,,,163630000B1179,,,,,,,,,,,,,0,,,,,T,terres,,,1760,0.804444,45.961166
2021-229133,2021-06-01,000001,Vente,130000,,,LE MASJOUBERT,B115,16420,16363,Saulgond,16,,,163630000B1179,,,,,,,,,,,,,0,,,,,T,terres,,,1760,0.804444,45.961166
2021-229133,2021-06-01,000001,Vente,130000,5420,F,LE MASJOUBERT,B115,16420,16363,Saulgond,16,,,163630000B1180,,,,,,,,,,,,,0,3,Dépendance,,0,S,sols,,,405,0.804767,45.961638
2021-229271,2021-06-08,000001,Vente,37500,10,,LE CHASSIN,B042,16420,16363,Saulgond,16,,,163630000E0208,,,,,,,,,,,,,0,1,Maison,60,2,S,sols,,,175,0.775381,45.956013
2021-230054,2021-06-18,000001,Vente,1800,,,LE MASBIENASSIS,B112,16420,16363,Saulgond,16,,,163630000C0497,,,,,,,,,,,,,0,,,,,P,prés,,,3261,0.775952,45.943559
2021-230054,2021-06-18,000001,Vente,1800,,,CHAMPS DU MASBIENASSIS,B040,16420,16363,Saulgond,16,,,163630000C0498,,,,,,,,,,,,,0,,,,,P,prés,,,360,0.775947,45.943382
2021-230790,2021-07-23,000001,Vente,120000,11,,LOT SOUS VILLELOUBEIX,A100,16420,16363,Saulgond,16,,,163630000C0686,,,,,,,,,,,,,0,3,Dépendance,,0,S,sols,,,1017,0.781363,45.952579
2021-230790,2021-07-23,000001,Vente,120000,11,,LOT SOUS VILLELOUBEIX,A100,16420,16363,Saulgond,16,,,163630000C0686,,,,,,,,,,,,,0,1,Maison,73,3,S,sols,,,1017,0.781363,45.952579
2021-230797,2021-07-20,000001,Vente,138000,4,,BENETEIX,B015,16420,16363,Saulgond,16,,,163630000B0773,,,,,,,,,,,,,0,1,Maison,160,6,S,sols,,,1340,0.799447,45.953854
2021-230797,2021-07-20,000001,Vente,138000,4,,BENETEIX,B015,16420,16363,Saulgond,16,,,163630000B0773,,,,,,,,,,,,,0,1,Maison,160,6,P,prés,,,2560,0.799447,45.953854
2021-230797,2021-07-20,000001,Vente,138000,4,,BENETEIX,B015,16420,16363,Saulgond,16,,,163630000B0773,,,,,,,,,,,,,0,1,Maison,160,6,J,jardins,,,560,0.799447,45.953854
2021-232113,2021-08-03,000001,Vente,7500,5443,F,VILLELOUBEX,B211,16420,16363,Saulgond,16,,,163630000C0203,,,,,,,,,,,,,0,3,Dépendance,,0,S,sols,,,207,0.782022,45.956916
2021-232338,2021-09-01,000001,Vente,700,,,PRE DE LA MAISON,B158,16420,16363,Saulgond,16,,,163630000E0171,,,,,,,,,,,,,0,,,,,L,landes,,,291,0.768322,45.96492
2021-232865,2021-09-17,000001,Vente,20000,4,,RUE PRINCIPALE,0100,16420,16363,Saulgond,16,,,16363000AB0037,,,,,,,,,,,,,0,1,Maison,92,2,S,sols,,,131,0.783915,45.95041
2021-233130,2021-09-28,000001,Vente,140000,,,LE MASGIRAL,B114,16420,16363,Saulgond,16,,,163630000D0088,,,,,,,,,,,,,0,,,,,J,jardins,,,700,0.806321,45.927114
2021-233130,2021-09-28,000001,Vente,140000,7,,RUE DES PUITS,0120,16420,16363,Saulgond,16,,,163630000D0089,,,,,,,,,,,,,0,1,Maison,110,3,S,sols,,,1010,0.806088,45.927117
2021-233130,2021-09-28,000001,Vente,140000,7,,RUE DES PUITS,0120,16420,16363,Saulgond,16,,,163630000D0089,,,,,,,,,,,,,0,3,Dépendance,,0,S,sols,,,1010,0.806088,45.927117
2021-233130,2021-09-28,000001,Vente,140000,,,LES BOIGES,B022,16420,16363,Saulgond,16,,,163630000D0166,,,,,,,,,,,,,0,,,,,P,prés,,,8560,0.807107,45.927152
2021-233724,2021-10-14,000001,Vente,2200,,,LE CLOS,B051,16420,16363,Saulgond,16,,,163630000E0021,,,,,,,,,,,,,0,,,,,T,terres,,,9710,0.764474,45.952979
2021-233980,2021-08-20,000001,Vente,338000,,,MOULIN DE POMMIER,B125,16420,16363,Saulgond,16,,,163630000F0366,,,,,,,,,,,,,0,,,,,T,terres,,,2876,0.777717,45.961721
2021-233980,2021-08-20,000001,Vente,338000,,,MOULIN DE POMMIER,B125,16420,16363,Saulgond,16,,,163630000F0368,,,,,,,,,,,,,0,,,,,L,landes,,,42,0.77814,45.963612
2021-233980,2021-08-20,000001,Vente,338000,,,MOULIN DE POMMIER,B125,16420,16363,Saulgond,16,,,163630000F0369,,,,,,,,,,,,,0,,,,,L,landes,,,570,0.77802,45.963322
2021-233980,2021-08-20,000001,Vente,338000,,,MOULIN DE POMMIER,B125,16420,16363,Saulgond,16,,,163630000F0370,,,,,,,,,,,,,0,,,,,L,landes,,,366,0.777871,45.963738
2021-233980,2021-08-20,000001,Vente,338000,,,MOULIN DE POMMIER,B125,16420,16363,Saulgond,16,,,163630000F0373,,,,,,,,,,,,,0,,,,,P,prés,,,2840,0.776727,45.963819
2021-233980,2021-08-20,000001,Vente,338000,,,MOULIN DE POMMIER,B125,16420,16363,Saulgond,16,,,163630000F0374,,,,,,,,,,,,,0,,,,,T,terres,,,2060,0.776841,45.964391
2021-233980,2021-08-20,000001,Vente,338000,,,MOULIN DE POMMIER,B125,16420,16363,Saulgond,16,,,163630000F0376,,,,,,,,,,,,,0,,,,,P,prés,,,10570,0.777675,45.964249
2021-233980,2021-08-20,000001,Vente,338000,,,MOULIN DE POMMIER,B125,16420,16363,Saulgond,16,,,163630000F0377,,,,,,,,,,,,,0,,,,,L,landes,,,120,0.778166,45.964007
2021-233980,2021-08-20,000001,Vente,338000,,,MOULIN DE POMMIER,B125,16420,16363,Saulgond,16,,,163630000F0378,,,,,,,,,,,,,0,,,,,L,landes,,,710,0.778524,45.964592
2021-233980,2021-08-20,000001,Vente,338000,1,,MOULIN DE POMMIER,B125,16420,16363,Saulgond,16,,,163630000F0379,,,,,,,,,,,,,0,3,Dépendance,,0,S,sols,,,1500,0.778667,45.964415
2021-233980,2021-08-20,000001,Vente,338000,1,,MOULIN DE POMMIER,B125,16420,16363,Saulgond,16,,,163630000F0379,,,,,,,,,,,,,0,3,Dépendance,,0,S,sols,,,1500,0.778667,45.964415
2021-233980,2021-08-20,000001,Vente,338000,1,,MOULIN DE POMMIER,B125,16420,16363,Saulgond,16,,,163630000F0379,,,,,,,,,,,,,0,1,Maison,150,5,S,sols,,,1500,0.778667,45.964415
2021-233980,2021-08-20,000001,Vente,338000,5396,F,MOULIN DE POMMIER,B125,16420,16363,Saulgond,16,,,163630000F0380,,,,,,,,,,,,,0,3,Dépendance,,0,S,sols,,,500,0.778799,45.963876
2021-233980,2021-08-20,000001,Vente,338000,5396,F,MOULIN DE POMMIER,B125,16420,16363,Saulgond,16,,,163630000F0380,,,,,,,,,,,,,0,3,Dépendance,,0,P,prés,,,4280,0.778799,45.963876
2021-233980,2021-08-20,000001,Vente,338000,5396,F,MOULIN DE POMMIER,B125,16420,16363,Saulgond,16,,,163630000F0380,,,,,,,,,,,,,0,3,Dépendance,,0,S,sols,,,500,0.778799,45.963876
2021-233980,2021-08-20,000001,Vente,338000,5396,F,MOULIN DE POMMIER,B125,16420,16363,Saulgond,16,,,163630000F0380,,,,,,,,,,,,,0,3,Dépendance,,0,P,prés,,,4280,0.778799,45.963876
2021-233980,2021-08-20,000001,Vente,338000,,,MOULIN DE POMMIER,B125,16420,16363,Saulgond,16,,,163630000F0381,,,,,,,,,,,,,0,,,,,E,eaux,ETANG,Etangs,1100,0.779145,45.96415
2021-233980,2021-08-20,000001,Vente,338000,,,MOULIN DE POMMIER,B125,16420,16363,Saulgond,16,,,163630000F0382,,,,,,,,,,,,,0,,,,,P,prés,,,10760,0.779561,45.964126
2021-233980,2021-08-20,000001,Vente,338000,,,MOULIN DE POMMIER,B125,16420,16363,Saulgond,16,,,163630000F0389,,,,,,,,,,,,,0,,,,,T,terres,,,1602,0.778535,45.965248
2021-233980,2021-08-20,000001,Vente,338000,,,MOULIN DE POMMIER,B125,16420,16363,Saulgond,16,,,163630000F0392,,,,,,,,,,,,,0,,,,,L,landes,,,6,0.778211,45.96539
2021-233980,2021-08-20,000001,Vente,338000,5377,,MOULIN DE POMMIER,B125,16420,16363,Saulgond,16,,,163630000F0504,,,,,,,,,,,,,0,4,Local industriel. commercial ou assimilé,39,0,S,sols,,,100,0.779454,45.963051
2021-233980,2021-08-20,000001,Vente,338000,5377,,MOULIN DE POMMIER,B125,16420,16363,Saulgond,16,,,163630000F0504,,,,,,,,,,,,,0,4,Local industriel. commercial ou assimilé,39,0,P,prés,,,20910,0.779454,45.963051
2021-233980,2021-08-20,000001,Vente,338000,,,DERRIERE LES PILES,B071,16420,16363,Saulgond,16,,,163630000F0508,,,,,,,,,,,,,0,,,,,T,terres,,,6540,0.778304,45.96217
2021-233980,2021-08-20,000001,Vente,338000,,,MOULIN DE POMMIER,B125,16420,16363,Saulgond,16,,,163630000F0569,,,,,,,,,,,,,0,,,,,L,landes,,,2090,0.778475,45.963308
2021-233980,2021-08-20,000001,Vente,338000,,,MOULIN DE POMMIER,B125,16420,16363,Saulgond,16,,,163630000F0596,,,,,,,,,,,,,0,,,,,T,terres,,,3630,0.777772,45.963058
2021-233980,2021-08-20,000001,Vente,338000,,,MOULIN DE POMMIER,B125,16420,16363,Saulgond,16,,,163630000F0609,,,,,,,,,,,,,0,,,,,P,prés,,,940,0.778206,45.964434
2021-233980,2021-08-20,000001,Vente,338000,,,MOULIN DE POMMIER,B125,16420,16363,Saulgond,16,,,163630000F0613,,,,,,,,,,,,,0,,,,,T,terres,,,560,0.777116,45.964124
2021-233980,2021-08-20,000001,Vente,338000,,,MOULIN DE POMMIER,B125,16420,16363,Saulgond,16,,,163630000F0631,,,,,,,,,,,,,0,,,,,P,prés,,,570,0.779218,45.964646
2021-233980,2021-08-20,000001,Vente,338000,,,MOULIN DE POMMIER,B125,16420,16363,Saulgond,16,,,163630000F0634,,,,,,,,,,,,,0,,,,,P,prés,,,3600,0.778831,45.96485
2021-234493,2021-10-14,000001,Vente,20000,,,CLOU DE MARTIN,B055,16420,16363,Saulgond,16,,,163630000B0599,,,,,,,,,,,,,0,,,,,T,terres,,,4430,0.793348,45.959918
2021-234493,2021-10-14,000001,Vente,20000,,,CLOU DE MARTIN,B055,16420,16363,Saulgond,16,,,163630000B0602,,,,,,,,,,,,,0,,,,,BT,taillis simples,,,1500,0.793875,45.959005
2021-234493,2021-10-14,000001,Vente,20000,,,CLOU DE MARTIN,B055,16420,16363,Saulgond,16,,,163630000B0603,,,,,,,,,,,,,0,,,,,T,terres,,,9135,0.794221,45.958726
2021-234493,2021-10-14,000001,Vente,20000,,,CLOU DE MARTIN,B055,16420,16363,Saulgond,16,,,163630000B0603,,,,,,,,,,,,,0,,,,,T,terres,,,9135,0.794221,45.958726
2021-234493,2021-10-14,000001,Vente,20000,,,CLOU DE MARTIN,B055,16420,16363,Saulgond,16,,,163630000B0605,,,,,,,,,,,,,0,,,,,P,prés,,,4670,0.795194,45.957488
2021-234493,2021-10-14,000001,Vente,20000,,,CLOU DE MARTIN,B055,16420,16363,Saulgond,16,,,163630000B0606,,,,,,,,,,,,,0,,,,,P,prés,,,6320,0.795633,45.957956
2021-234493,2021-10-14,000001,Vente,20000,,,LES CLOS,B052,16420,16363,Saulgond,16,,,163630000B0611,,,,,,,,,,,,,0,,,,,BT,taillis simples,,,2360,0.793824,45.960294
2021-234493,2021-10-14,000001,Vente,20000,,,LES CLOS,B052,16420,16363,Saulgond,16,,,163630000B0611,,,,,,,,,,,,,0,,,,,P,prés,,,12800,0.793824,45.960294
2021-234493,2021-10-14,000001,Vente,20000,,,LA COURRIERE,B067,16420,16363,Saulgond,16,,,163630000B0629,,,,,,,,,,,,,0,,,,,S,sols,,,360,0.796524,45.95749
2021-234493,2021-10-14,000001,Vente,20000,,,LES PRADES,B156,16420,16363,Saulgond,16,,,163630000B0643,,,,,,,,,,,,,0,,,,,T,terres,,,1450,0.796043,45.955666
2021-234493,2021-10-14,000001,Vente,20000,,,LES PLANTES,B151,16420,16363,Saulgond,16,,,163630000B0818,,,,,,,,,,,,,0,,,,,T,terres,,,5454,0.795295,45.955936
2021-234493,2021-10-14,000001,Vente,20000,,,LES PLANTES,B151,16420,16363,Saulgond,16,,,163630000B0819,,,,,,,,,,,,,0,,,,,P,prés,,,10380,0.795734,45.956662
2021-234493,2021-10-14,000001,Vente,20000,,,LES PLANTES,B151,16420,16363,Saulgond,16,,,163630000B0820,,,,,,,,,,,,,0,,,,,P,prés,,,3290,0.795919,45.957119
2021-234493,2021-10-14,000001,Vente,20000,,,LES PLANTES,B151,16420,16363,Saulgond,16,,,163630000B0821,,,,,,,,,,,,,0,,,,,P,prés,,,810,0.795405,45.957192
2021-234493,2021-10-14,000001,Vente,20000,,,LA COURRIERE,B067,16420,16363,Saulgond,16,,,163630000B1095,,,,,,,,,,,,,0,,,,,J,jardins,,,313,0.796418,45.957679
2021-234689,2021-10-19,000002,Vente,462500,,,LES CAVAILLES,B034,16420,16363,Saulgond,16,,,163630000A0052,,,,,,,,,,,,,0,,,,,P,prés,,,20980,0.782599,45.978086
2021-234689,2021-10-19,000002,Vente,462500,,,LES CAVAILLES,B034,16420,16363,Saulgond,16,,,163630000A0053,,,,,,,,,,,,,0,,,,,T,terres,,,30970,0.78238,45.979948
2021-234689,2021-10-19,000002,Vente,462500,,,LES CAVAILLES,B034,16420,16363,Saulgond,16,,,163630000A0054,,,,,,,,,,,,,0,,,,,P,prés,,,26720,0.781783,45.981915
2021-234689,2021-10-19,000002,Vente,462500,,,LES CAVAILLES,B034,16420,16363,Saulgond,16,,,163630000A0056,,,,,,,,,,,,,0,,,,,BT,taillis simples,,,822,0.782591,45.982495
2021-234689,2021-10-19,000002,Vente,462500,,,LA CROIX PIERRE,B068,16420,16363,Saulgond,16,,,163630000A0256,,,,,,,,,,,,,0,,,,,P,prés,,,40040,0.78895,45.986768
2021-234689,2021-10-19,000002,Vente,462500,,,LA CROIX PIERRE,B068,16420,16363,Saulgond,16,,,163630000A0257,,,,,,,,,,,,,0,,,,,BT,taillis simples,,,53840,0.790212,45.985407
2021-234689,2021-10-19,000002,Vente,462500,,,LA CROIX PIERRE,B068,16420,16363,Saulgond,16,,,163630000A0257,,,,,,,,,,,,,0,,,,,BT,taillis simples,,,26920,0.790212,45.985407
2021-234689,2021-10-19,000002,Vente,462500,,,LA CROIX PIERRE,B068,16420,16363,Saulgond,16,,,163630000A0587,,,,,,,,,,,,,0,,,,,BT,taillis simples,,,7000,0.78741,45.984513
2021-234689,2021-10-19,000002,Vente,462500,,,LA CROIX PIERRE,B068,16420,16363,Saulgond,16,,,163630000A0735,,,,,,,,,,,,,0,,,,,T,terres,,,17616,0.790806,45.987157
2021-234691,2021-10-20,000001,Vente,85000,14,,POMMIER,B152,16420,16363,Saulgond,16,,,163630000F0412,,,,,,,,,,,,,0,1,Maison,80,4,S,sols,,,90,0.778536,45.966597
2021-234691,2021-10-20,000001,Vente,85000,5398,F,POMMIER,B152,16420,16363,Saulgond,16,,,163630000F0416,,,,,,,,,,,,,0,3,Dépendance,,0,S,sols,,,260,0.778842,45.966516
2021-234691,2021-10-20,000001,Vente,85000,5414,F,POMMIER,B152,16420,16363,Saulgond,16,,,163630000F0417,,,,,,,,,,,,,0,1,Maison,40,0,S,sols,,,49,0.778583,45.966499
2021-234691,2021-10-20,000001,Vente,85000,,,POMMIER,B152,16420,16363,Saulgond,16,,,163630000F0425,,,,,,,,,,,,,0,,,,,P,prés,,,400,0.779164,45.966393
2021-234691,2021-10-20,000001,Vente,85000,,,POMMIER,B152,16420,16363,Saulgond,16,,,163630000F0426,,,,,,,,,,,,,0,,,,,T,terres,,,62,0.778993,45.966432
2021-234691,2021-10-20,000001,Vente,85000,,,POMMIER,B152,16420,16363,Saulgond,16,,,163630000F0427,,,,,,,,,,,,,0,,,,,S,sols,,,88,0.778867,45.966394
2021-234691,2021-10-20,000001,Vente,85000,,,POMMIER,B152,16420,16363,Saulgond,16,,,163630000F0428,,,,,,,,,,,,,0,,,,,T,terres,,,130,0.778881,45.966464
2021-234691,2021-10-20,000001,Vente,85000,,,POMMIER,B152,16420,16363,Saulgond,16,,,163630000F0597,,,,,,,,,,,,,0,,,,,S,sols,,,16,0.778515,45.966509
2021-234691,2021-10-20,000001,Vente,85000,5415,F,POMMIER,B152,16420,16363,Saulgond,16,,,163630000F0598,,,,,,,,,,,,,0,3,Dépendance,,0,S,sols,,,28,0.778533,45.966477
2021-234691,2021-10-20,000001,Vente,85000,,,POMMIER,B152,16420,16363,Saulgond,16,,,163630000F0649,,,,,,,,,,,,,0,,,,,P,prés,,,586,0.779129,45.966591
2021-234691,2021-10-20,000001,Vente,85000,,,LES CAVAILLES,B034,16420,16363,Saulgond,16,,,163630000F0652,,,,,,,,,,,,,0,,,,,P,prés,,,67,0.779129,45.966729
2021-234691,2021-10-20,000001,Vente,85000,,,POMMIER,B152,16420,16363,Saulgond,16,,,163630000F0659,,,,,,,,,,,,,0,,,,,S,sols,,,80,0.778667,45.966441
2021-234691,2021-10-20,000001,Vente,85000,,,POMMIER,B152,16420,16363,Saulgond,16,,,163630000F0661,,,,,,,,,,,,,0,,,,,P,prés,,,823,0.778978,45.966262
