id_mutation,date_mutation,numero_disposition,nature_mutation,valeur_fonciere,adresse_numero,adresse_suffixe,adresse_nom_voie,adresse_code_voie,code_postal,code_commune,nom_commune,code_departement,ancien_code_commune,ancien_nom_commune,id_parcelle,ancien_id_parcelle,numero_volume,lot1_numero,lot1_surface_carrez,lot2_numero,lot2_surface_carrez,lot3_numero,lot3_surface_carrez,lot4_numero,lot4_surface_carrez,lot5_numero,lot5_surface_carrez,nombre_lots,code_type_local,type_local,surface_reelle_bati,nombre_pieces_principales,code_nature_culture,nature_culture,code_nature_culture_speciale,nature_culture_speciale,surface_terrain,longitude,latitude
2021-237319,2021-01-21,000001,Vente,45000,,,LE BOURG,B007,17170,17132,Cramchaban,17,,,17132000AB0394,,,,,,,,,,,,,0,,,,,AB,terrains a bâtir,,,47,-0.722125,46.21868
2021-237319,2021-01-21,000001,Vente,45000,,,LE BOURG,B007,17170,17132,Cramchaban,17,,,17132000AB0396,,,,,,,,,,,,,0,,,,,AB,terrains a bâtir,,,1053,-0.722151,46.218542
2021-237319,2021-01-21,000001,Vente,45000,,,LE BOURG,B007,17170,17132,Cramchaban,17,,,17132000AB0400,,,,,,,,,,,,,0,,,,,AB,terrains a bâtir,,,447,-0.722103,46.218362
2021-237358,2021-02-05,000001,Vente,6000,,,LE TARTRE,B079,17170,17132,Cramchaban,17,,,17132000ZC0142,,,,,,,,,,,,,0,,,,,AB,terrains a bâtir,,,517,-0.724986,46.224563
2021-237412,2021-01-21,000001,Vente,168000,3,,RUE DU 19 MARS 1962,0034,17170,17132,Cramchaban,17,,,17132000ZC0140,,,,,,,,,,,,,0,1,Maison,96,4,S,sols,,,515,-0.724862,46.224245
2021-237810,2021-02-13,000001,Vente,207330,6,,CHE DE L'AMANDIER,0006,17170,17132,Cramchaban,17,,,17132000ZV0070,,,,,,,,,,,,,0,1,Maison,106,5,S,sols,,,66,-0.704298,46.21417
2021-237810,2021-02-13,000001,Vente,207330,,,LES NOURREES,B053,17170,17132,Cramchaban,17,,,17132000ZV0078,,,,,,,,,,,,,0,,,,,AB,terrains a bâtir,,,798,-0.704086,46.213995
2021-237810,2021-02-13,000001,Vente,207330,,,LES NOURREES,B053,17170,17132,Cramchaban,17,,,17132000ZV0085,,,,,,,,,,,,,0,,,,,S,sols,,,142,-0.704373,46.214089
2021-238947,2021-04-21,000001,Vente,2541.9,,,LE GRAND MARAIS,B034,17170,17132,Cramchaban,17,,,17132000AH0113,,,,,,,,,,,,,0,,,,,P,prés,,,8473,-0.721744,46.231085
2021-239151,2021-05-06,000001,Vente,135300,8,,IMP DU COIN DES BOIS,0013,17170,17132,Cramchaban,17,,,17132000AB0226,,,,,,,,,,,,,0,1,Maison,65,3,S,sols,,,698,-0.720269,46.219704
2021-239151,2021-05-06,000001,Vente,135300,,,LE BOURG,B007,17170,17132,Cramchaban,17,,,17132000AB0412,,,,,,,,,,,,,0,,,,,S,sols,,,118,-0.72054,46.219721
2021-239607,2021-05-07,000002,Vente,4000,,,LE BOURG,B007,17170,17132,Cramchaban,17,,,17132000AB0436,,,,,,,,,,,,,0,,,,,S,sols,,,2,-0.723945,46.220173
2021-239607,2021-05-07,000002,Vente,4000,,,LE BOURG,B007,17170,17132,Cramchaban,17,,,17132000AB0494,,,,,,,,,,,,,0,,,,,S,sols,,,134,-0.723941,46.22025
2021-241830,2021-06-28,000001,Vente,9000,,,PORT DES GUEUX,B063,17170,17132,Cramchaban,17,,,17132000AH0050,,,,,,,,,,,,,0,,,,,S,sols,,,21,-0.729956,46.231375
2021-241830,2021-06-28,000001,Vente,9000,,,PORT DES GUEUX,B063,17170,17132,Cramchaban,17,,,17132000AH0158,,,,,,,,,,,,,0,,,,,S,sols,,,406,-0.730089,46.231149
2021-242659,2021-06-30,000001,Vente,151800,7,,RTE DU MARAIS,0037,17170,17132,Cramchaban,17,,,17132000AC0017,,,,,,,,,,,,,0,1,Maison,80,4,S,sols,,,1391,-0.722423,46.222608
2021-242659,2021-06-30,000001,Vente,151800,7,,RTE DU MARAIS,0037,17170,17132,Cramchaban,17,,,17132000AC0017,,,,,,,,,,,,,0,3,Dépendance,,0,S,sols,,,1391,-0.722423,46.222608
2021-242659,2021-06-30,000001,Vente,151800,7,,RTE DU MARAIS,0037,17170,17132,Cramchaban,17,,,17132000AC0017,,,,,,,,,,,,,0,3,Dépendance,,0,S,sols,,,1391,-0.722423,46.222608
2021-242659,2021-06-30,000001,Vente,151800,,,LE PEU,B058,17170,17132,Cramchaban,17,,,17132000AC0018,,,,,,,,,,,,,0,,,,,J,jardins,,,1216,-0.721896,46.222286
2021-242961,2021-07-13,000001,Vente,145500,6,,RUE DES VIEUX MOULINS,0043,17170,17132,Cramchaban,17,,,17132000AD0009,,,,,,,,,,,,,0,3,Dépendance,,0,S,sols,,,445,-0.705813,46.215722
2021-242961,2021-07-13,000001,Vente,145500,6,,RUE DES VIEUX MOULINS,0043,17170,17132,Cramchaban,17,,,17132000AD0009,,,,,,,,,,,,,0,1,Maison,135,5,S,sols,,,445,-0.705813,46.215722
2021-242961,2021-07-13,000001,Vente,145500,6,,RUE DES VIEUX MOULINS,0043,17170,17132,Cramchaban,17,,,17132000AD0009,,,,,,,,,,,,,0,3,Dépendance,,0,S,sols,,,445,-0.705813,46.215722
2021-243117,2021-07-26,000001,Vente,180000,1,,VEN DU BALLET,0009,17170,17132,Cramchaban,17,,,17132000AD0155,,,,,,,,,,,,,0,3,Dépendance,,0,S,sols,,,913,-0.701431,46.214797
2021-243117,2021-07-26,000001,Vente,180000,1,,VEN DU BALLET,0009,17170,17132,Cramchaban,17,,,17132000AD0155,,,,,,,,,,,,,0,3,Dépendance,,0,S,sols,,,913,-0.701431,46.214797
2021-243117,2021-07-26,000001,Vente,180000,1,,VEN DU BALLET,0009,17170,17132,Cramchaban,17,,,17132000AD0155,,,,,,,,,,,,,0,1,Maison,140,4,S,sols,,,913,-0.701431,46.214797
2021-243141,2021-07-26,000001,Vente,330000,,,CHABAN,B010,17170,17132,Cramchaban,17,,,17132000AD0257,,,,,,,,,,,,,0,,,,,T,terres,,,5290,-0.706805,46.216117
2021-243141,2021-07-26,000001,Vente,330000,,,CHABAN,B010,17170,17132,Cramchaban,17,,,17132000AD0259,,,,,,,,,,,,,0,,,,,S,sols,,,281,-0.706597,46.216467
2021-243141,2021-07-26,000001,Vente,330000,2,,RUE DES VIEUX MOULINS,0043,17170,17132,Cramchaban,17,,,17132000AD0261,,,,,,,,,,,,,0,1,Maison,293,7,S,sols,,,700,-0.706865,46.215802
2021-243263,2021-07-29,000001,Vente,205000,2,,RUE DE L ABREUVOIR,0004,17170,17132,Cramchaban,17,,,17132000AB0132,,,,,,,,,,,,,0,3,Dépendance,,0,S,sols,,,1165,-0.721391,46.219522
2021-243263,2021-07-29,000001,Vente,205000,2,,RUE DE L ABREUVOIR,0004,17170,17132,Cramchaban,17,,,17132000AB0132,,,,,,,,,,,,,0,1,Maison,115,4,S,sols,,,1165,-0.721391,46.219522
2021-243483,2021-07-29,000002,Vente,4000.5,,,CHE DES RIVIERES,0055,17170,17132,Cramchaban,17,,,17132000AB0497,,,,,,,,,,,,,0,,,,,S,sols,,,75,-0.722171,46.218122
2021-243484,2021-07-29,000003,Vente,201999.5,7,B,CHE DES RIVIERES,0055,17170,17132,Cramchaban,17,,,17132000AB0483,,,,,,,,,,,,,0,1,Maison,96,4,S,sols,,,658,-0.722057,46.218137
2021-243732,2021-08-04,000001,Vente,2200,,,MARAIS DES CHILETTES,B046,17170,17132,Cramchaban,17,,,17132000AE0068,,,,,,,,,,,,,0,,,,,B,bois,,,699,-0.74703,46.230842
2021-244606,2021-08-26,000001,Vente,180000,2,,RUE DU 19 MARS 1962,0034,17170,17132,Cramchaban,17,,,17132000ZC0144,,,,,,,,,,,,,0,3,Dépendance,,0,AB,terrains a bâtir,,,536,-0.725475,46.224604
2021-244606,2021-08-26,000001,Vente,180000,2,,RUE DU 19 MARS 1962,0034,17170,17132,Cramchaban,17,,,17132000ZC0144,,,,,,,,,,,,,0,1,Maison,100,4,AB,terrains a bâtir,,,536,-0.725475,46.224604
2021-244961,2021-08-10,000001,Vente,6000,,,MARAIS DU ROSEAU,B047,17170,17132,Cramchaban,17,,,17132000AE0093,,,,,,,,,,,,,0,,,,,B,bois,,,1071,-0.748158,46.240532
2021-244982,2021-09-03,000001,Vente,30000,,,LE TARTRE,B079,17170,17132,Cramchaban,17,,,17132000ZC0142,,,,,,,,,,,,,0,,,,,AB,terrains a bâtir,,,517,-0.724986,46.224563
2021-245701,2021-09-08,000002,Vente terrain à bâtir,10140,5148,F,RUE DU TARTRE,0064,17170,17132,Cramchaban,17,,,17132000ZC0164,,,,,,,,,,,,,0,4,Local industriel. commercial ou assimilé,100,0,S,sols,,,338,-0.724585,46.222993
2021-245707,2021-09-08,000001,Vente,9420,,,LE TARTRE,B079,17170,17132,Cramchaban,17,,,17132000ZC0165,,,,,,,,,,,,,0,,,,,AB,terrains a bâtir,,,314,-0.724492,46.223149
2021-246113,2021-09-29,000001,Vente,250,,,MARAIS DES CHILETTES,B046,17170,17132,Cramchaban,17,,,17132000AE0071,,,,,,,,,,,,,0,,,,,B,bois,,,1846,-0.74667,46.231725
2021-246682,2021-10-02,000001,Vente,365000,2,,RTE DU PRE NOMBRIN,0052,17170,17132,Cramchaban,17,,,17132000AE0050,,,,,,,,,,,,,0,1,Maison,171,4,S,sols,,,1238,-0.738139,46.233962
2021-246682,2021-10-02,000001,Vente,365000,2,,RTE DU PRE NOMBRIN,0052,17170,17132,Cramchaban,17,,,17132000AE0050,,,,,,,,,,,,,0,3,Dépendance,,0,S,sols,,,1238,-0.738139,46.233962
2021-246682,2021-10-02,000001,Vente,365000,,,LE ROSEAU,B070,17170,17132,Cramchaban,17,,,17132000AE0051,,,,,,,,,,,,,0,,,,,T,terres,,,4221,-0.737966,46.233628
2021-246682,2021-10-02,000001,Vente,365000,,,LE ROSEAU,B070,17170,17132,Cramchaban,17,,,17132000AE0052,,,,,,,,,,,,,0,,,,,S,sols,,,2685,-0.738535,46.233865
2021-247409,2021-10-11,000001,Vente,3500,5094,,RUE DE LA MARGELLE,0047,17170,17132,Cramchaban,17,,,17132000AD0077,,,,,,,,,,,,,0,3,Dépendance,,0,S,sols,,,21,-0.703211,46.215318
2021-249311,2021-11-23,000001,Vente,1000,,,LES GRANDES POINTES,B038,17170,17132,Cramchaban,17,,,17132000AM0016,,,,,,,,,,,,,0,,,,,B,bois,,,2801,-0.690278,46.213964
2021-249311,2021-11-23,000001,Vente,1000,,,LES GRANDES POINTES,B038,17170,17132,Cramchaban,17,,,17132000AM0017,,,,,,,,,,,,,0,,,,,B,bois,,,1123,-0.69085,46.213341
2021-249389,2021-12-01,000001,Vente,1,,,LE TARTRE,B079,17170,17132,Cramchaban,17,,,17132000ZC0145,,,,,,,,,,,,,0,,,,,S,sols,,,1352,-0.725002,46.224593
2021-249888,2021-12-07,000001,Vente,290000,,,LE BOURG,B007,17170,17132,Cramchaban,17,,,17132000AB0064,,,,,,,,,,,,,0,,,,,P,prés,,,4838,-0.719751,46.220019
2021-249888,2021-12-07,000001,Vente,290000,,,LE BOURG,B007,17170,17132,Cramchaban,17,,,17132000AB0064,,,,,,,,,,,,,0,,,,,S,sols,,,75,-0.719751,46.220019
2021-249888,2021-12-07,000001,Vente,290000,,,LE BOURG,B007,17170,17132,Cramchaban,17,,,17132000AB0072,,,,,,,,,,,,,0,,,,,J,jardins,,,253,-0.719548,46.219735
2021-249888,2021-12-07,000001,Vente,290000,,,LE BOURG,B007,17170,17132,Cramchaban,17,,,17132000AB0073,,,,,,,,,,,,,0,,,,,J,jardins,,,247,-0.719757,46.219612
2021-249888,2021-12-07,000001,Vente,290000,,,LE BOURG,B007,17170,17132,Cramchaban,17,,,17132000AB0240,,,,,,,,,,,,,0,,,,,S,sols,,,172,-0.720091,46.219758
2021-249888,2021-12-07,000001,Vente,290000,12,,IMP DU COIN DES BOIS,0013,17170,17132,Cramchaban,17,,,17132000AB0264,,,,,,,,,,,,,0,1,Maison,129,5,S,sols,,,837,-0.719862,46.219748
2021-249888,2021-12-07,000001,Vente,290000,12,,IMP DU COIN DES BOIS,0013,17170,17132,Cramchaban,17,,,17132000AB0264,,,,,,,,,,,,,0,3,Dépendance,,0,S,sols,,,837,-0.719862,46.219748
2021-249888,2021-12-07,000001,Vente,290000,12,,IMP DU COIN DES BOIS,0013,17170,17132,Cramchaban,17,,,17132000AB0264,,,,,,,,,,,,,0,3,Dépendance,,0,S,sols,,,837,-0.719862,46.219748
2021-249888,2021-12-07,000001,Vente,290000,12,,IMP DU COIN DES BOIS,0013,17170,17132,Cramchaban,17,,,17132000AB0264,,,,,,,,,,,,,0,3,Dépendance,,0,S,sols,,,837,-0.719862,46.219748
2021-249888,2021-12-07,000001,Vente,290000,,,LES COINS,B017,17170,17132,Cramchaban,17,,,17132000AC0170,,,,,,,,,,,,,0,,,,,B,bois,,,28,-0.71845,46.219934
2021-249888,2021-12-07,000001,Vente,290000,,,LES COINS,B017,17170,17132,Cramchaban,17,,,17132000AC0171,,,,,,,,,,,,,0,,,,,B,bois,,,69,-0.718526,46.219908
2021-249888,2021-12-07,000001,Vente,290000,,,LES COINS,B017,17170,17132,Cramchaban,17,,,17132000AC0172,,,,,,,,,,,,,0,,,,,B,bois,,,107,-0.718644,46.219839
2021-249888,2021-12-07,000001,Vente,290000,,,LES COINS,B017,17170,17132,Cramchaban,17,,,17132000AC0173,,,,,,,,,,,,,0,,,,,B,bois,,,314,-0.718826,46.219629
2021-249888,2021-12-07,000001,Vente,290000,,,LES COINS,B017,17170,17132,Cramchaban,17,,,17132000AC0174,,,,,,,,,,,,,0,,,,,B,bois,,,93,-0.718608,46.219721
2021-249888,2021-12-07,000001,Vente,290000,,,LES COINS,B017,17170,17132,Cramchaban,17,,,17132000AC0175,,,,,,,,,,,,,0,,,,,B,bois,,,125,-0.718526,46.219758
2021-249888,2021-12-07,000001,Vente,290000,,,LES COINS,B017,17170,17132,Cramchaban,17,,,17132000AC0176,,,,,,,,,,,,,0,,,,,B,bois,,,225,-0.718375,46.219843
2021-249888,2021-12-07,000001,Vente,290000,,,LES COINS,B017,17170,17132,Cramchaban,17,,,17132000AC0207,,,,,,,,,,,,,0,,,,,J,jardins,,,136,-0.719,46.219632
2021-249888,2021-12-07,000001,Vente,290000,,,LES COINS,B017,17170,17132,Cramchaban,17,,,17132000AC0208,,,,,,,,,,,,,0,,,,,J,jardins,,,164,-0.719162,46.219684
2021-249888,2021-12-07,000001,Vente,290000,,,LES COINS,B017,17170,17132,Cramchaban,17,,,17132000AC0209,,,,,,,,,,,,,0,,,,,J,jardins,,,121,-0.719115,46.219571
2021-249888,2021-12-07,000001,Vente,290000,,,LES COINS,B017,17170,17132,Cramchaban,17,,,17132000AC0210,,,,,,,,,,,,,0,,,,,J,jardins,,,112,-0.719217,46.219535
2021-249888,2021-12-07,000001,Vente,290000,,,LES COINS,B017,17170,17132,Cramchaban,17,,,17132000AC0211,,,,,,,,,,,,,0,,,,,J,jardins,,,759,-0.719473,46.219552
2021-249888,2021-12-07,000001,Vente,290000,,,LES COINS,B017,17170,17132,Cramchaban,17,,,17132000AC0381,,,,,,,,,,,,,0,,,,,P,prés,,,185,-0.718829,46.219755
2021-249888,2021-12-07,000001,Vente,290000,,,LES COINS,B017,17170,17132,Cramchaban,17,,,17132000AC0382,,,,,,,,,,,,,0,,,,,P,prés,,,210,-0.718956,46.219769
2021-249888,2021-12-07,000001,Vente,290000,,,LES COINS,B017,17170,17132,Cramchaban,17,,,17132000AC0383,,,,,,,,,,,,,0,,,,,P,prés,,,2225,-0.719013,46.219896
2021-250008,2021-11-26,000001,Vente,45000,,,LE BOURG,B007,17170,17132,Cramchaban,17,,,17132000AB0489,,,,,,,,,,,,,0,,,,,AB,terrains a bâtir,,,864,-0.726163,46.219249
2021-250901,2021-12-22,000001,Vente,216000,11,,RUE GRAND RUE,0057,17170,17132,Cramchaban,17,,,17132000AB0150,,,,,,,,,,,,,0,1,Maison,141,4,S,sols,,,159,-0.723987,46.220109
2021-250901,2021-12-22,000001,Vente,216000,,,LE BOURG,B007,17170,17132,Cramchaban,17,,,17132000AB0436,,,,,,,,,,,,,0,,,,,S,sols,,,2,-0.723945,46.220173
2021-250901,2021-12-22,000001,Vente,216000,,,LE BOURG,B007,17170,17132,Cramchaban,17,,,17132000AB0494,,,,,,,,,,,,,0,,,,,S,sols,,,134,-0.723941,46.22025
2021-251575,2021-10-08,000001,Vente,200000,,,LE ROSEAU,B070,17170,17132,Cramchaban,17,,,17132000AE0001,,,,,,,,,,,,,0,,,,,P,prés,,,4075,-0.750768,46.244772
2021-251575,2021-10-08,000001,Vente,200000,,,LE ROSEAU,B070,17170,17132,Cramchaban,17,,,17132000AE0002,,,,,,,,,,,,,0,,,,,P,prés,,,2047,-0.749053,46.243894
