id_mutation,date_mutation,numero_disposition,nature_mutation,valeur_fonciere,adresse_numero,adresse_suffixe,adresse_nom_voie,adresse_code_voie,code_postal,code_commune,nom_commune,code_departement,ancien_code_commune,ancien_nom_commune,id_parcelle,ancien_id_parcelle,numero_volume,lot1_numero,lot1_surface_carrez,lot2_numero,lot2_surface_carrez,lot3_numero,lot3_surface_carrez,lot4_numero,lot4_surface_carrez,lot5_numero,lot5_surface_carrez,nombre_lots,code_type_local,type_local,surface_reelle_bati,nombre_pieces_principales,code_nature_culture,nature_culture,code_nature_culture_speciale,nature_culture_speciale,surface_terrain,longitude,latitude
2021-258496,2021-08-26,000001,Vente,219450,14,,RUE SAMSON,0065,17520,17192,Jarnac-Champagne,17,,,17192000AE0381,,,,,,,,,,,,,0,3,Dépendance,,0,S,sols,,,985,-0.400986,45.561205
2021-258496,2021-08-26,000001,Vente,219450,14,,RUE SAMSON,0065,17520,17192,Jarnac-Champagne,17,,,17192000AE0381,,,,,,,,,,,,,0,3,Dépendance,,0,S,sols,,,985,-0.400986,45.561205
2021-258496,2021-08-26,000001,Vente,219450,14,,RUE SAMSON,0065,17520,17192,Jarnac-Champagne,17,,,17192000AE0381,,,,,,,,,,,,,0,1,Maison,168,5,S,sols,,,985,-0.400986,45.561205
2021-258496,2021-08-26,000001,Vente,219450,,,LE BOURG OUEST,B018,17520,17192,Jarnac-Champagne,17,,,17192000AE0383,,,,,,,,,,,,,0,,,,,AB,terrains a bâtir,,,1245,-0.40105,45.560986
2021-258564,2021-08-31,000002,Vente,200,,,RTE DE CHADENAC,0023,17520,17192,Jarnac-Champagne,17,,,17192000AS0318,,,,,,,,,,,,,0,,,,,S,sols,,,15,-0.41961,45.550017
2021-259245,2021-10-04,000001,Vente,29900,,,MINAUFOND,B093,17520,17192,Jarnac-Champagne,17,,,17192000AM0337,,,,,,,,,,,,,0,,,,,T,terres,,,1661,-0.368083,45.543184
2021-260513,2021-09-24,000001,Vente,25000,,,RUE SAMSON,0065,17520,17192,Jarnac-Champagne,17,,,17192000AE0413,,,,,,,,,,,,,0,,,,,P,prés,,,98,-0.400685,45.560533
2021-260513,2021-09-24,000001,Vente,25000,,,RUE SAMSON,0065,17520,17192,Jarnac-Champagne,17,,,17192000AE0414,,,,,,,,,,,,,0,,,,,P,prés,,,300,-0.400243,45.560748
2021-260513,2021-09-24,000001,Vente,25000,,,LE BOURG OUEST,B018,17520,17192,Jarnac-Champagne,17,,,17192000AE0417,,,,,,,,,,,,,0,,,,,P,prés,,,1153,-0.400535,45.560544
2021-260953,2021-11-26,000001,Vente,176000,,,LA FEUILLARDE,B061,17520,17192,Jarnac-Champagne,17,,,17192000AP0242,,,,,,,,,,,,,0,,,,,T,terres,,,769,-0.414194,45.546644
2021-260953,2021-11-26,000001,Vente,176000,15,,RUE DES TONNEAUX,0067,17520,17192,Jarnac-Champagne,17,,,17192000AP0251,,,,,,,,,,,,,0,1,Maison,110,6,S,sols,,,522,-0.413832,45.546634
2021-261363,2021-11-27,000001,Vente,390000,7,,RUE DE LA JEUNESSE,0039,17520,17192,Jarnac-Champagne,17,,,17192000AH0205,,,,,,,,,,,,,0,3,Dépendance,,0,AG,terrains d'agrément,PARC,Parc,1311,-0.397828,45.556796
2021-261363,2021-11-27,000001,Vente,390000,7,,RUE DE LA JEUNESSE,0039,17520,17192,Jarnac-Champagne,17,,,17192000AH0205,,,,,,,,,,,,,0,1,Maison,197,6,AG,terrains d'agrément,PARC,Parc,1311,-0.397828,45.556796
2021-261363,2021-11-27,000001,Vente,390000,7,,RUE DE LA JEUNESSE,0039,17520,17192,Jarnac-Champagne,17,,,17192000AH0205,,,,,,,,,,,,,0,3,Dépendance,,0,S,sols,,,500,-0.397828,45.556796
2021-261363,2021-11-27,000001,Vente,390000,7,,RUE DE LA JEUNESSE,0039,17520,17192,Jarnac-Champagne,17,,,17192000AH0205,,,,,,,,,,,,,0,1,Maison,197,6,S,sols,,,500,-0.397828,45.556796
2021-261363,2021-11-27,000001,Vente,390000,,,LE MILLARD,B092,17520,17192,Jarnac-Champagne,17,,,17192000AH0207,,,,,,,,,,,,,0,,,,,S,sols,,,1088,-0.397168,45.557075
2021-261382,2021-12-15,000001,Vente,75531.75,,,LES BRANDES,B019,17520,17192,Jarnac-Champagne,17,,,17192000AY0011,,,,,,,,,,,,,0,,,,,VI,vignes,,,6743,-0.423081,45.572216
2021-261382,2021-12-15,000001,Vente,75531.75,,,LES FONTENILLES,B072,17520,17192,Jarnac-Champagne,17,,,17192000AZ0122,,,,,,,,,,,,,0,,,,,VI,vignes,,,7644,-0.428825,45.571198
2021-261931,2021-12-27,000002,Echange,4595,,,LA FONT VIEILLE,B071,17520,17192,Jarnac-Champagne,17,,,17192000AL0068,,,,,,,,,,,,,0,,,,,T,terres,,,2065,-0.381141,45.551249
2021-262251,2021-01-28,000001,Vente,128100,1,,RUE ROMANEAU,0061,17520,17192,Jarnac-Champagne,17,,,17192000AL0043,,,,,,,,,,,,,0,1,Maison,120,4,S,sols,,,1670,-0.379137,45.546877
2021-262251,2021-01-28,000001,Vente,128100,,,LA FONT VIEILLE,B071,17520,17192,Jarnac-Champagne,17,,,17192000AL0059,,,,,,,,,,,,,0,,,,,T,terres,,,2275,-0.378544,45.547209
2021-262319,2021-02-24,000001,Vente,3000,,,BONNE MORT,B014,17520,17192,Jarnac-Champagne,17,,,17192000AP0007,,,,,,,,,,,,,0,,,,,T,terres,,,4341,-0.402969,45.5331
2021-262378,2021-03-04,000001,Vente,25000,,,LA SABLIERE,B125,17520,17192,Jarnac-Champagne,17,,,17192000ZB0015,,,,,,,,,,,,,0,,,,,T,terres,,,15695,-0.399633,45.53147
2021-262410,2021-01-21,000001,Vente,35000,,,CHEZ MESNARD,B038,17520,17192,Jarnac-Champagne,17,,,17192000AM0500,,,,,,,,,,,,,0,,,,,T,terres,,,7632,-0.368508,45.542069
2021-262410,2021-01-21,000001,Vente,35000,,,CHEZ MESNARD,B038,17520,17192,Jarnac-Champagne,17,,,17192000AM0500,,,,,,,,,,,,,0,,,,,S,sols,,,1000,-0.368508,45.542069
2021-262793,2021-05-07,000001,Vente,8600,,,LA POUYADE,B111,17520,17192,Jarnac-Champagne,17,,,17192000AX0288,,,,,,,,,,,,,0,,,,,AB,terrains a bâtir,,,888,-0.417284,45.563682
2021-262793,2021-05-07,000001,Vente,8600,,,LA POUYADE,B111,17520,17192,Jarnac-Champagne,17,,,17192000AX0289,,,,,,,,,,,,,0,,,,,AB,terrains a bâtir,,,828,-0.417347,45.563514
2021-262842,2021-05-07,000001,Vente,1850,,,LA BESSE,B006,17520,17192,Jarnac-Champagne,17,,,17192000AO0441,,,,,,,,,,,,,0,,,,,S,sols,,,370,-0.400244,45.539359
2021-262962,2021-06-04,000001,Vente,100000,9,,RUE DE SAINTONGE,0064,17520,17192,Jarnac-Champagne,17,,,17192000AE0093,,,,,,,,,,,,,0,1,Maison,168,6,S,sols,,,543,-0.400067,45.559116
2021-262962,2021-06-04,000001,Vente,100000,,,LE BOURG OUEST,B018,17520,17192,Jarnac-Champagne,17,,,17192000AE0155,,,,,,,,,,,,,0,,,,,S,sols,,,86,-0.400172,45.55913
2021-262999,2021-06-15,000001,Echange,3184.65,,,LE COIN,B050,17520,17192,Jarnac-Champagne,17,,,17192000AI0056,,,,,,,,,,,,,0,,,,,VI,vignes,,,7077,-0.384859,45.560435
2021-263003,2021-06-04,000001,Vente,187450,,,LES BOUREILLES,B016,17520,17192,Jarnac-Champagne,17,,,17192000AD0197,,,,,,,,,,,,,0,,,,,AB,terrains a bâtir,,,805,-0.411752,45.562127
2021-263035,2021-06-18,000001,Vente,26000,,,LA POUYADE,B111,17520,17192,Jarnac-Champagne,17,,,17192000AX0048,,,,,,,,,,,,,0,,,,,S,sols,,,218,-0.417812,45.564812
2021-263035,2021-06-18,000001,Vente,26000,8,,RUE LA POUYADE,0054,17520,17192,Jarnac-Champagne,17,,,17192000AX0049,,,,,,,,,,,,,0,3,Dépendance,,0,S,sols,,,444,-0.417667,45.564877
2021-263110,2021-06-14,000001,Vente,650,,,BONNE MORT,B014,17520,17192,Jarnac-Champagne,17,,,17192000AP0014,,,,,,,,,,,,,0,,,,,BT,taillis simples,,,1456,-0.40484,45.534596
2021-263110,2021-06-14,000001,Vente,650,,,BONNE MORT,B014,17520,17192,Jarnac-Champagne,17,,,17192000AP0027,,,,,,,,,,,,,0,,,,,BT,taillis simples,,,2415,-0.406894,45.534861
2021-263110,2021-06-14,000001,Vente,650,,,LA PITARDRIE,B105,17520,17192,Jarnac-Champagne,17,,,17192000AP0103,,,,,,,,,,,,,0,,,,,BT,taillis simples,,,2267,-0.407816,45.545675
2021-263110,2021-06-14,000001,Vente,650,,,BOIS GABET,B010,17520,17192,Jarnac-Champagne,17,,,17192000AT0333,,,,,,,,,,,,,0,,,,,BT,taillis simples,,,1551,-0.436044,45.547942
2021-263110,2021-06-14,000001,Vente,650,,,BOIS GABET,B010,17520,17192,Jarnac-Champagne,17,,,17192000AT0336,,,,,,,,,,,,,0,,,,,BT,taillis simples,,,2141,-0.436528,45.547721
2021-263196,2021-06-24,000001,Vente,732,,,LE PAS DE LA PLANCHE,B100,17520,17192,Jarnac-Champagne,17,,,17192000AO0124,,,,,,,,,,,,,0,,,,,T,terres,,,1830,-0.397855,45.545971
2021-263197,2021-06-24,000001,Vente,2500,,,LE PAS DE LA PLANCHE,B100,17520,17192,Jarnac-Champagne,17,,,17192000AO0125,,,,,,,,,,,,,0,,,,,P,prés,,,6160,-0.397568,45.546332
2021-263258,2021-07-12,000001,Vente,150000,4,,RUE AUDEBEAU,0015,17520,17192,Jarnac-Champagne,17,,,17192000AS0029,,,,,,,,,,,,,0,1,Maison,124,5,S,sols,,,1030,,
2021-263258,2021-07-12,000001,Vente,150000,4,,RUE AUDEBEAU,0015,17520,17192,Jarnac-Champagne,17,,,17192000AS0029,,,,,,,,,,,,,0,3,Dépendance,,0,S,sols,,,1030,,
2021-263258,2021-07-12,000001,Vente,150000,,,CHEZ AUDEBAUD,B032,17520,17192,Jarnac-Champagne,17,,,17192000AS0300,,,,,,,,,,,,,0,,,,,T,terres,,,2847,-0.418058,45.5503
2021-263258,2021-07-12,000001,Vente,150000,,,CHEZ AUDEBAUD,B032,17520,17192,Jarnac-Champagne,17,,,17192000AS0301,,,,,,,,,,,,,0,,,,,T,terres,,,1578,,
2021-263270,2021-06-15,000002,Echange,653,,,LE RAT,B119,17520,17192,Jarnac-Champagne,17,,,17192000AH0186,,,,,,,,,,,,,0,,,,,J,jardins,,,498,-0.394953,45.555013
2021-263270,2021-06-15,000002,Echange,653,,,CHE DU RAZ,0057,17520,17192,Jarnac-Champagne,17,,,17192000AH0190,,,,,,,,,,,,,0,,,,,S,sols,,,450,-0.395345,45.55482
2021-263270,2021-06-15,000002,Echange,653,,,CHE DU RAZ,0057,17520,17192,Jarnac-Champagne,17,,,17192000AH0191,,,,,,,,,,,,,0,,,,,S,sols,,,504,-0.394755,45.555326
2021-263343,2021-07-22,000001,Vente,153000,31,,RUE DE LA CROIX BASSE,0028,17520,17192,Jarnac-Champagne,17,,,17192000AI0228,,,,,,,,,,,,,0,1,Maison,115,5,S,sols,,,500,-0.387675,45.553677
2021-263343,2021-07-22,000001,Vente,153000,31,,RUE DE LA CROIX BASSE,0028,17520,17192,Jarnac-Champagne,17,,,17192000AI0228,,,,,,,,,,,,,0,1,Maison,115,5,P,prés,,,700,-0.387675,45.553677
2021-263433,2021-07-28,000001,Vente,7000,,,LE BOUQUET,B015,17520,17192,Jarnac-Champagne,17,,,17192000AN0113,,,,,,,,,,,,,0,,,,,T,terres,,,8047,-0.376726,45.538055
