id_mutation,date_mutation,numero_disposition,nature_mutation,valeur_fonciere,adresse_numero,adresse_suffixe,adresse_nom_voie,adresse_code_voie,code_postal,code_commune,nom_commune,code_departement,ancien_code_commune,ancien_nom_commune,id_parcelle,ancien_id_parcelle,numero_volume,lot1_numero,lot1_surface_carrez,lot2_numero,lot2_surface_carrez,lot3_numero,lot3_surface_carrez,lot4_numero,lot4_surface_carrez,lot5_numero,lot5_surface_carrez,nombre_lots,code_type_local,type_local,surface_reelle_bati,nombre_pieces_principales,code_nature_culture,nature_culture,code_nature_culture_speciale,nature_culture_speciale,surface_terrain,longitude,latitude
2021-259677,2021-10-15,000001,Vente,5000,,,CHEZ GUIET,B047,17130,17454,Tugéras-Saint-Maurice,17,,,17454000ZK0094,,,,,,,,,,,,,0,,,,,T,terres,,,520,-0.425209,45.34347
2021-260107,2021-10-28,000001,Vente,172000,15,B,RUE DU PUITS VIEIL,0021,17130,17454,Tugéras-Saint-Maurice,17,,,174540000B0167,,,,,,,,,,,,,0,1,Maison,147,5,S,sols,,,500,-0.407193,45.357981
2021-260107,2021-10-28,000001,Vente,172000,15,B,RUE DU PUITS VIEIL,0021,17130,17454,Tugéras-Saint-Maurice,17,,,174540000B0167,,,,,,,,,,,,,0,1,Maison,147,5,AG,terrains d'agrément,,,1420,-0.407193,45.357981
2021-260112,2021-10-28,000001,Vente,130000,2,,RUE CHAMPAGNE DU MOULIN,0036,17130,17454,Tugéras-Saint-Maurice,17,,,17454000ZI0360,,,,,,,,,,,,,0,1,Maison,97,4,S,sols,,,500,-0.41506,45.360294
2021-260112,2021-10-28,000001,Vente,130000,2,,RUE CHAMPAGNE DU MOULIN,0036,17130,17454,Tugéras-Saint-Maurice,17,,,17454000ZI0360,,,,,,,,,,,,,0,1,Maison,97,4,AG,terrains d'agrément,,,588,-0.41506,45.360294
2021-262154,2021-02-02,000001,Vente,240000,5131,,FAVREAU DE BAS,B064,17130,17454,Tugéras-Saint-Maurice,17,,,17454000ZD0065,,,,,,,,,,,,,0,3,Dépendance,,0,S,sols,,,500,-0.386392,45.36257
2021-262154,2021-02-02,000001,Vente,240000,5131,,FAVREAU DE BAS,B064,17130,17454,Tugéras-Saint-Maurice,17,,,17454000ZD0065,,,,,,,,,,,,,0,3,Dépendance,,0,S,sols,,,500,-0.386392,45.36257
2021-262154,2021-02-02,000001,Vente,240000,5131,,FAVREAU DE BAS,B064,17130,17454,Tugéras-Saint-Maurice,17,,,17454000ZD0065,,,,,,,,,,,,,0,3,Dépendance,,0,AG,terrains d'agrément,,,1777,-0.386392,45.36257
2021-262154,2021-02-02,000001,Vente,240000,5131,,FAVREAU DE BAS,B064,17130,17454,Tugéras-Saint-Maurice,17,,,17454000ZD0065,,,,,,,,,,,,,0,3,Dépendance,,0,AG,terrains d'agrément,,,1777,-0.386392,45.36257
2021-262154,2021-02-02,000001,Vente,240000,5131,,FAVREAU DE BAS,B064,17130,17454,Tugéras-Saint-Maurice,17,,,17454000ZD0065,,,,,,,,,,,,,0,1,Maison,100,4,AG,terrains d'agrément,,,1777,-0.386392,45.36257
2021-262154,2021-02-02,000001,Vente,240000,5131,,FAVREAU DE BAS,B064,17130,17454,Tugéras-Saint-Maurice,17,,,17454000ZD0065,,,,,,,,,,,,,0,1,Maison,100,4,S,sols,,,500,-0.386392,45.36257
2021-262173,2021-01-13,000003,Echange,200,,,LE BOURG,B015,17130,17454,Tugéras-Saint-Maurice,17,,,174540000B1129,,,,,,,,,,,,,0,,,,,P,prés,,,115,-0.407429,45.35867
2021-262317,2021-02-18,000002,Vente,25000,3,,HAM DE LA GOBELLE,A015,17130,17454,Tugéras-Saint-Maurice,17,,,17454370ZB0157,,,,,,,,,,,,,0,1,Maison,50,1,,,,,,-0.386788,45.356546
2021-262317,2021-02-18,000002,Vente,25000,3,,HAM DE LA GOBELLE,A015,17130,17454,Tugéras-Saint-Maurice,17,,,17454370ZB0157,,,,,,,,,,,,,0,1,Maison,54,1,,,,,,-0.386788,45.356546
2021-262325,2021-01-13,000001,Vente,65000,,,LE BOURG,B015,17130,17454,Tugéras-Saint-Maurice,17,,,174540000B1128,,,,,,,,,,,,,0,,,,,P,prés,,,646,-0.407293,45.358836
2021-262325,2021-01-13,000001,Vente,65000,,,LE BOURG,B015,17130,17454,Tugéras-Saint-Maurice,17,,,174540000B1129,,,,,,,,,,,,,0,,,,,P,prés,,,115,-0.407429,45.35867
2021-262325,2021-01-13,000001,Vente,65000,3,,RUE DU PUITS VIEIL,0021,17130,17454,Tugéras-Saint-Maurice,17,,,174540000B1130,,,,,,,,,,,,,0,3,Dépendance,,0,,,,,,-0.407798,45.358892
2021-262325,2021-01-13,000001,Vente,65000,3,,RUE DU PUITS VIEIL,0021,17130,17454,Tugéras-Saint-Maurice,17,,,174540000B1130,,,,,,,,,,,,,0,1,Maison,44,2,,,,,,-0.407798,45.358892
2021-262343,2021-02-15,000001,Vente,34164.9,,,LES BARRES,B001,17130,17454,Tugéras-Saint-Maurice,17,,,17454370ZD0017,,,,,,,,,,,,,0,,,,,T,terres,,,13030,-0.387167,45.34477
2021-262343,2021-02-15,000001,Vente,34164.9,,,LES BARRES,B001,17130,17454,Tugéras-Saint-Maurice,17,,,17454370ZD0018,,,,,,,,,,,,,0,,,,,T,terres,,,1020,-0.387272,45.34464
2021-262343,2021-02-15,000001,Vente,34164.9,,,LES BARRES,B001,17130,17454,Tugéras-Saint-Maurice,17,,,17454370ZD0019,,,,,,,,,,,,,0,,,,,T,terres,,,16980,-0.387699,45.344518
2021-262452,2021-03-05,000001,Vente,27475.67,,,LA CHATAIGNERAIE,B034,17130,17454,Tugéras-Saint-Maurice,17,,,174540000E0230,,,,,,,,,,,,,0,,,,,BT,taillis simples,,,2067,-0.434427,45.344883
2021-262452,2021-03-05,000001,Vente,27475.67,,,LA FORET,B069,17130,17454,Tugéras-Saint-Maurice,17,,,17454000ZB0383,,,,,,,,,,,,,0,,,,,BT,taillis simples,,,1027,-0.418997,45.36662
2021-262452,2021-03-05,000001,Vente,27475.67,,,BOIS DE CHEZ BERNON,B007,17130,17454,Tugéras-Saint-Maurice,17,,,17454000ZI0158,,,,,,,,,,,,,0,,,,,BT,taillis simples,,,735,-0.422774,45.351334
2021-262452,2021-03-05,000001,Vente,27475.67,,,LE PINIER,B096,17130,17454,Tugéras-Saint-Maurice,17,,,17454000ZI0191,,,,,,,,,,,,,0,,,,,BT,taillis simples,,,172,-0.420056,45.350904
2021-262452,2021-03-05,000001,Vente,27475.67,,,LE PINIER,B096,17130,17454,Tugéras-Saint-Maurice,17,,,17454000ZI0234,,,,,,,,,,,,,0,,,,,BT,taillis simples,,,253,-0.421846,45.350486
2021-262452,2021-03-05,000001,Vente,27475.67,,,LE PINIER,B096,17130,17454,Tugéras-Saint-Maurice,17,,,17454000ZI0238,,,,,,,,,,,,,0,,,,,BT,taillis simples,,,150,-0.421718,45.350677
2021-262452,2021-03-05,000001,Vente,27475.67,,,BOIS DE LA GARENNE,B010,17130,17454,Tugéras-Saint-Maurice,17,,,17454000ZI0290,,,,,,,,,,,,,0,,,,,BT,taillis simples,,,2213,-0.423149,45.349229
2021-262452,2021-03-05,000001,Vente,27475.67,,,LE PINIER,B096,17130,17454,Tugéras-Saint-Maurice,17,,,17454000ZI0315,,,,,,,,,,,,,0,,,,,BT,taillis simples,,,235,-0.419689,45.350173
2021-262452,2021-03-05,000001,Vente,27475.67,,,LE PINIER,B096,17130,17454,Tugéras-Saint-Maurice,17,,,17454000ZI0317,,,,,,,,,,,,,0,,,,,BT,taillis simples,,,36,-0.419938,45.349971
2021-262452,2021-03-05,000001,Vente,27475.67,,,BOIS DE CHEZ DURET,B008,17130,17454,Tugéras-Saint-Maurice,17,,,17454000ZK0315,,,,,,,,,,,,,0,,,,,BT,taillis simples,,,85,-0.423022,45.344839
2021-262551,2021-03-19,000001,Vente,22000,,,AUX HOUMES,B082,17130,17454,Tugéras-Saint-Maurice,17,,,17454000ZT0010,,,,,,,,,,,,,0,,,,,T,terres,,,20607,-0.432436,45.362554
2021-262592,2021-04-01,000001,Vente,16502,5015,,LA GOBELLE,B165,17130,17454,Tugéras-Saint-Maurice,17,,,17454370ZB0143,,,,,,,,,,,,,0,3,Dépendance,,0,T,terres,,,3077,-0.386671,45.356821
2021-262592,2021-04-01,000001,Vente,16502,5015,,LA GOBELLE,B165,17130,17454,Tugéras-Saint-Maurice,17,,,17454370ZB0143,,,,,,,,,,,,,0,3,Dépendance,,0,S,sols,,,1290,-0.386671,45.356821
2021-262593,2021-04-01,000002,Vente,55998,5,,HAM DE LA GOBELLE,A015,17130,17454,Tugéras-Saint-Maurice,17,,,17454370ZB0070,,,,,,,,,,,,,0,1,Maison,85,4,S,sols,,,860,-0.386345,45.356336
2021-262621,2021-03-26,000002,Vente,2000,1,,IMP DES GRANGES,0014,17130,17454,Tugéras-Saint-Maurice,17,,,17454370ZC0134,,,,,,,,,,,,,0,1,Maison,55,2,,,,,,-0.379566,45.350902
2021-262621,2021-03-26,000002,Vente,2000,1,,IMP DES GRANGES,0014,17130,17454,Tugéras-Saint-Maurice,17,,,17454370ZC0134,,,,,,,,,,,,,0,3,Dépendance,,0,,,,,,-0.379566,45.350902
2021-262684,2021-04-14,000001,Vente,100,,,RUE DES PRES DES BOIS,0022,17130,17454,Tugéras-Saint-Maurice,17,,,17454000ZB0463,,,,,,,,,,,,,0,,,,,T,terres,,,265,-0.409829,45.362348
2021-262684,2021-04-14,000001,Vente,100,,,LES PRES DES BOIS,B106,17130,17454,Tugéras-Saint-Maurice,17,,,17454000ZS0076,,,,,,,,,,,,,0,,,,,T,terres,,,175,-0.409567,45.362454
2021-262713,2021-04-14,000001,Echange,2000,,,CHAMPS D ERAUX,B024,17130,17454,Tugéras-Saint-Maurice,17,,,17454000ZH0081,,,,,,,,,,,,,0,,,,,T,terres,,,4410,-0.408389,45.349808
2021-262713,2021-04-14,000002,Echange,2000,,,LES PRES DES BOIS,B106,17130,17454,Tugéras-Saint-Maurice,17,,,17454000ZS0052,,,,,,,,,,,,,0,,,,,T,terres,,,1210,-0.409452,45.362292
2021-262777,2021-04-26,000001,Vente,10000,,,LE BOURG,B015,17130,17454,Tugéras-Saint-Maurice,17,,,174540000B1129,,,,,,,,,,,,,0,,,,,AG,terrains d'agrément,,,115,-0.407429,45.35867
2021-262777,2021-04-26,000001,Vente,10000,,,LE BOURG,B015,17130,17454,Tugéras-Saint-Maurice,17,,,174540000B1131,,,,,,,,,,,,,0,,,,,S,sols,,,1066,-0.407642,45.358644
2021-262777,2021-04-26,000001,Vente,10000,,,LE BOURG,B015,17130,17454,Tugéras-Saint-Maurice,17,,,174540000B1134,,,,,,,,,,,,,0,,,,,S,sols,,,24,-0.407997,45.358594
2021-262836,2021-05-10,000001,Vente,269500,,,CHEZ DAZAC,B041,17130,17454,Tugéras-Saint-Maurice,17,,,17454000ZK0280,,,,,,,,,,,,,0,,,,,S,sols,,,757,-0.4217,45.343346
2021-262836,2021-05-10,000001,Vente,269500,,,CHEZ DAZAC,B041,17130,17454,Tugéras-Saint-Maurice,17,,,17454000ZK0281,,,,,,,,,,,,,0,,,,,S,sols,,,550,-0.421798,45.343288
2021-262836,2021-05-10,000001,Vente,269500,17,,HAM DE CHEZ DAZAC,A007,17130,17454,Tugéras-Saint-Maurice,17,,,17454000ZK0282,,,,,,,,,,,,,0,3,Dépendance,,0,AG,terrains d'agrément,,,2211,-0.422175,45.343086
2021-262836,2021-05-10,000001,Vente,269500,17,,HAM DE CHEZ DAZAC,A007,17130,17454,Tugéras-Saint-Maurice,17,,,17454000ZK0282,,,,,,,,,,,,,0,1,Maison,246,7,S,sols,,,1000,-0.422175,45.343086
2021-262836,2021-05-10,000001,Vente,269500,17,,HAM DE CHEZ DAZAC,A007,17130,17454,Tugéras-Saint-Maurice,17,,,17454000ZK0282,,,,,,,,,,,,,0,3,Dépendance,,0,S,sols,,,1000,-0.422175,45.343086
2021-262836,2021-05-10,000001,Vente,269500,17,,HAM DE CHEZ DAZAC,A007,17130,17454,Tugéras-Saint-Maurice,17,,,17454000ZK0282,,,,,,,,,,,,,0,1,Maison,246,7,AG,terrains d'agrément,,,2211,-0.422175,45.343086
2021-262836,2021-05-10,000001,Vente,269500,,,CHEZ DAZAC,B041,17130,17454,Tugéras-Saint-Maurice,17,,,17454000ZK0442,,,,,,,,,,,,,0,,,,,S,sols,,,156,-0.421904,45.343181
2021-263101,2021-06-08,000001,Vente,2500,,,LE BOURG,B015,17130,17454,Tugéras-Saint-Maurice,17,,,174540000B1105,,,,,,,,,,,,,0,,,,,AB,terrains a bâtir,,,274,-0.40955,45.361702
2021-263101,2021-06-08,000001,Vente,2500,,,LE BOURG,B015,17130,17454,Tugéras-Saint-Maurice,17,,,174540000B1106,,,,,,,,,,,,,0,,,,,S,sols,,,18,-0.409642,45.361805
2021-263338,2021-07-09,000001,Vente,72400,3,,RUE DES PRES DES BOIS,0022,17130,17454,Tugéras-Saint-Maurice,17,,,174540000B0043,,,,,,,,,,,,,0,1,Maison,125,4,S,sols,,,1485,-0.408824,45.362012
2021-263442,2021-07-30,000001,Vente,111010,,,LE BOURG,B015,17130,17454,Tugéras-Saint-Maurice,17,,,174540000B0070,,,,,,,,,,,,,0,,,,,J,jardins,,,215,-0.407752,45.35991
2021-263442,2021-07-30,000001,Vente,111010,5,,RUE DU PRINTEMPS,0025,17130,17454,Tugéras-Saint-Maurice,17,,,174540000B0071,,,,,,,,,,,,,0,1,Maison,57,3,S,sols,,,935,-0.407509,45.359781
2021-263442,2021-07-30,000001,Vente,111010,,,LE BOURG,B015,17130,17454,Tugéras-Saint-Maurice,17,,,174540000B0951,,,,,,,,,,,,,0,,,,,P,prés,,,170,-0.407595,45.360009
2021-263442,2021-07-30,000001,Vente,111010,,,LE BOURG,B015,17130,17454,Tugéras-Saint-Maurice,17,,,174540000B0991,,,,,,,,,,,,,0,,,,,S,sols,,,50,-0.407316,45.359666
2021-263442,2021-07-30,000001,Vente,111010,,,LE BOURG,B015,17130,17454,Tugéras-Saint-Maurice,17,,,174540000B1050,,,,,,,,,,,,,0,,,,,S,sols,,,215,-0.407261,45.359676
