id_mutation,date_mutation,numero_disposition,nature_mutation,valeur_fonciere,adresse_numero,adresse_suffixe,adresse_nom_voie,adresse_code_voie,code_postal,code_commune,nom_commune,code_departement,ancien_code_commune,ancien_nom_commune,id_parcelle,ancien_id_parcelle,numero_volume,lot1_numero,lot1_surface_carrez,lot2_numero,lot2_surface_carrez,lot3_numero,lot3_surface_carrez,lot4_numero,lot4_surface_carrez,lot5_numero,lot5_surface_carrez,nombre_lots,code_type_local,type_local,surface_reelle_bati,nombre_pieces_principales,code_nature_culture,nature_culture,code_nature_culture_speciale,nature_culture_speciale,surface_terrain,longitude,latitude
2021-264927,2021-01-14,000001,Vente,85000,416,,BOURSAC,B034,18110,18004,Allogny,18,,,180040000D0841,,,,,,,,,,,,,0,1,Maison,90,5,S,sols,,,748,2.292736,47.208609
2021-264927,2021-01-14,000001,Vente,85000,416,,BOURSAC,B034,18110,18004,Allogny,18,,,180040000D0841,,,,,,,,,,,,,0,1,Maison,90,5,AG,terrains d'agrément,,,1307,2.292736,47.208609
2021-264976,2021-01-06,000001,Vente,15000,,,TAILLE D EN HAUT,B286,18110,18004,Allogny,18,,,180040000A1085,,,,,,,,,,,,,0,,,,,BS,taillis sous futaie,,,1300,2.299322,47.235508
2021-264986,2021-01-15,000002,Vente,45000,,,LA PRINQUETTE,B257,18110,18004,Allogny,18,,,180040000D0380,,,,,,,,,,,,,0,,,,,S,sols,,,62,,
2021-264986,2021-01-15,000002,Vente,45000,5,,CHE DE LA PRINQUETTE,0039,18110,18004,Allogny,18,,,180040000D1587,,,,,,,,,,,,,0,1,Maison,82,2,S,sols,,,309,,
2021-264986,2021-01-15,000002,Vente,45000,,,LA PRINQUETTE,B257,18110,18004,Allogny,18,,,180040000D1588,,,,,,,,,,,,,0,,,,,S,sols,,,65,,
2021-264986,2021-01-15,000002,Vente,45000,,,LA PRINQUETTE,B257,18110,18004,Allogny,18,,,180040000D1591,,,,,,,,,,,,,0,,,,,J,jardins,,,320,,
2021-264986,2021-01-15,000002,Vente,45000,,,LA PRINQUETTE,B257,18110,18004,Allogny,18,,,180040000D1682,,,,,,,,,,,,,0,,,,,T,terres,,,1399,,
2021-264986,2021-01-15,000002,Vente,45000,,,LA PRINQUETTE,B257,18110,18004,Allogny,18,,,180040000D1684,,,,,,,,,,,,,0,,,,,P,prés,,,587,,
2021-265008,2021-01-08,000001,Vente,50000,,,GRAND CHAMP,B148,18110,18004,Allogny,18,,,180040000D0075,,,,,,,,,,,,,0,,,,,T,terres,,,3102,2.266579,47.220831
2021-265008,2021-01-08,000001,Vente,50000,,,LES DELAS,B120,18110,18004,Allogny,18,,,180040000D1021,,,,,,,,,,,,,0,,,,,S,sols,,,59,2.266184,47.22158
2021-265008,2021-01-08,000001,Vente,50000,224,,LES DELAS,B120,18110,18004,Allogny,18,,,180040000D1104,,,,,,,,,,,,,0,3,Dépendance,,0,S,sols,,,43,2.266503,47.221597
2021-265008,2021-01-08,000001,Vente,50000,224,A,LES DELAS,B120,18110,18004,Allogny,18,,,180040000D1105,,,,,,,,,,,,,0,1,Maison,58,1,S,sols,,,247,2.266449,47.221485
2021-265008,2021-01-08,000001,Vente,50000,,,GRAND CHAMP,B148,18110,18004,Allogny,18,,,180040000D1114,,,,,,,,,,,,,0,,,,,T,terres,,,550,2.266624,47.221419
2021-265008,2021-01-08,000001,Vente,50000,,,LES DELAS,B120,18110,18004,Allogny,18,,,180040000D1506,,,,,,,,,,,,,0,,,,,S,sols,,,505,2.266334,47.22145
2021-265447,2021-02-09,000001,Vente,66000,,,CHAMP DE RICHON,B068,18110,18004,Allogny,18,,,180040000D0502,,,,,,,,,,,,,0,,,,,S,sols,,,2525,2.294118,47.226491
2021-265447,2021-02-09,000001,Vente,66000,,,LE RIEAU DELAS,B266,18110,18004,Allogny,18,,,180040000D0508,,,,,,,,,,,,,0,,,,,T,terres,,,16320,2.296933,47.225251
2021-265447,2021-02-09,000001,Vente,66000,,,LE RIEAU DELAS,B266,18110,18004,Allogny,18,,,180040000D0512,,,,,,,,,,,,,0,,,,,P,prés,,,4640,2.296936,47.225941
2021-265447,2021-02-09,000001,Vente,66000,,,LE RIEAU DELAS,B266,18110,18004,Allogny,18,,,180040000D0513,,,,,,,,,,,,,0,,,,,P,prés,,,4640,2.296936,47.22627
2021-265447,2021-02-09,000001,Vente,66000,,,LE RIEAU DELAS,B266,18110,18004,Allogny,18,,,180040000D0514,,,,,,,,,,,,,0,,,,,BS,taillis sous futaie,,,12940,2.297506,47.227064
2021-265447,2021-02-09,000001,Vente,66000,,,LE RIEAU DELAS,B266,18110,18004,Allogny,18,,,180040000D0515,,,,,,,,,,,,,0,,,,,T,terres,,,9330,2.297499,47.226612
2021-265447,2021-02-09,000001,Vente,66000,,,LES MELETS,B190,18110,18004,Allogny,18,,,180040000D0578,,,,,,,,,,,,,0,,,,,BS,taillis sous futaie,,,1950,2.301153,47.22091
2021-265447,2021-02-09,000001,Vente,66000,,,LES MELETS,B190,18110,18004,Allogny,18,,,180040000D0579,,,,,,,,,,,,,0,,,,,P,prés,,,5608,2.300617,47.221999
2021-265447,2021-02-09,000001,Vente,66000,,,LES MELETS,B190,18110,18004,Allogny,18,,,180040000D0589,,,,,,,,,,,,,0,,,,,P,prés,,,1715,2.299428,47.221701
2021-265447,2021-02-09,000001,Vente,66000,,,LES MELETS,B190,18110,18004,Allogny,18,,,180040000D0590,,,,,,,,,,,,,0,,,,,S,sols,,,1572,2.299961,47.221903
2021-265447,2021-02-09,000001,Vente,66000,,,LES MELETS,B190,18110,18004,Allogny,18,,,180040000D0591,,,,,,,,,,,,,0,,,,,T,terres,,,26355,2.300141,47.220785
2021-265447,2021-02-09,000001,Vente,66000,,,LES MELETS,B190,18110,18004,Allogny,18,,,180040000D0592,,,,,,,,,,,,,0,,,,,BS,taillis sous futaie,,,1760,2.298587,47.220802
2021-265447,2021-02-09,000001,Vente,66000,,,LES MELETS,B190,18110,18004,Allogny,18,,,180040000D0593,,,,,,,,,,,,,0,,,,,T,terres,,,1120,2.298462,47.221156
2021-265447,2021-02-09,000001,Vente,66000,,,LA NOUE RAMAIS,B205,18110,18004,Allogny,18,,,180040000D0626,,,,,,,,,,,,,0,,,,,BS,taillis sous futaie,,,2005,2.295651,47.218659
2021-265447,2021-02-09,000001,Vente,66000,,,LES TUREAUX,B323,18110,18004,Allogny,18,,,180040000D0630,,,,,,,,,,,,,0,,,,,T,terres,,,22365,2.299304,47.21911
2021-265636,2021-02-12,000001,Vente,90000,7,,RTE DE MEHUN,0036,18110,18004,Allogny,18,,,180040000C0120,,,,,,,,,,,,,0,1,Maison,108,4,S,sols,,,172,2.318736,47.22417
2021-265636,2021-02-12,000001,Vente,90000,,,LE BOURG,B031,18110,18004,Allogny,18,,,180040000C0121,,,,,,,,,,,,,0,,,,,S,sols,,,235,2.318726,47.224349
2021-265636,2021-02-12,000001,Vente,90000,46,,LE BOURG,B031,18110,18004,Allogny,18,,,180040000C0130,,,,,,,,,,,,,0,3,Dépendance,,0,J,jardins,,,648,2.318844,47.223993
2021-265636,2021-02-12,000001,Vente,90000,46,,LE BOURG,B031,18110,18004,Allogny,18,,,180040000C0130,,,,,,,,,,,,,0,3,Dépendance,,0,S,sols,,,37,2.318844,47.223993
2021-265731,2021-03-18,000001,Vente,145450,8,,CHE DE LA CREUSEE,0021,18110,18004,Allogny,18,,,180040000B0524,,,,,,,,,,,,,0,1,Maison,110,4,S,sols,,,1109,2.32509,47.225128
2021-265731,2021-03-18,000001,Vente,145450,,,LA CREUSEE,B112,18110,18004,Allogny,18,,,180040000B0640,,,,,,,,,,,,,0,,,,,S,sols,,,26,2.324795,47.225169
2021-266147,2021-04-15,000001,Vente,82500,4,,RTE DE MEHUN,0036,18110,18004,Allogny,18,,,180040000C0176,,,,,,,,,,,,,0,1,Maison,40,2,S,sols,,,153,2.31847,47.224635
2021-266147,2021-04-15,000001,Vente,82500,,,LA VIGNE BLONDEAU,B329,18110,18004,Allogny,18,,,180040000D0556,,,,,,,,,,,,,0,,,,,S,sols,,,390,2.317213,47.224563
2021-266236,2021-04-24,000001,Vente,6000,,,LES GRANDS PRES,B167,18110,18004,Allogny,18,,,180040000D1679,,,,,,,,,,,,,0,,,,,P,prés,,,10502,2.311949,47.222169
2021-266316,2021-04-28,000001,Vente,113925,8,,RTE D HENRICHEMONT,0009,18110,18004,Allogny,18,,,180040000C0930,,,,,,,,,,,,,0,1,Maison,48,3,S,sols,,,67,2.320618,47.225278
2021-266316,2021-04-28,000001,Vente,113925,6,,RTE D HENRICHEMONT,0009,18110,18004,Allogny,18,,,180040000C0932,,,,,,,,,,,,,0,,,,,S,sols,,,8,2.320551,47.225274
2021-266316,2021-04-28,000001,Vente,113925,6,,RTE D HENRICHEMONT,0009,18110,18004,Allogny,18,,,180040000C0933,,,,,,,,,,,,,0,,,,,S,sols,,,93,2.320644,47.225199
2021-266510,2021-05-10,000001,Vente,31500,,,LA NOUE PALISSE,B203,18110,18004,Allogny,18,,,180040000B0887,,,,,,,,,,,,,0,,,,,J,jardins,,,1497,2.325422,47.23022
2021-266609,2021-05-18,000001,Vente,1212000,,,CHAMP DES BONJOURS,B064,18110,18004,Allogny,18,,,180040000A0001,,,,,,,,,,,,,0,,,,,BR,futaies résineuses,SAPIN,Sapins ou sapinière,16044,2.284075,47.255724
2021-266609,2021-05-18,000001,Vente,1212000,,,CHAMP DES BONJOURS,B064,18110,18004,Allogny,18,,,180040000A0001,,,,,,,,,,,,,0,,,,,BS,taillis sous futaie,,,23426,2.284075,47.255724
2021-266609,2021-05-18,000001,Vente,1212000,,,CHAMP DES BONJOURS,B064,18110,18004,Allogny,18,,,180040000A0002,,,,,,,,,,,,,0,,,,,BS,taillis sous futaie,,,10540,2.28361,47.253819
2021-266609,2021-05-18,000001,Vente,1212000,,,CHAMP DES BONJOURS,B064,18110,18004,Allogny,18,,,180040000A0003,,,,,,,,,,,,,0,,,,,BS,taillis sous futaie,,,26850,2.284545,47.253191
2021-266609,2021-05-18,000001,Vente,1212000,,,CHAMP DES BONJOURS,B064,18110,18004,Allogny,18,,,180040000A0004,,,,,,,,,,,,,0,,,,,BS,taillis sous futaie,,,42335,2.287428,47.252292
2021-266609,2021-05-18,000001,Vente,1212000,,,CHAMP DES BONJOURS,B064,18110,18004,Allogny,18,,,180040000A0005,,,,,,,,,,,,,0,,,,,BS,taillis sous futaie,,,27000,2.286989,47.25418
2021-266609,2021-05-18,000001,Vente,1212000,,,CHAMP DES BONJOURS,B064,18110,18004,Allogny,18,,,180040000A0006,,,,,,,,,,,,,0,,,,,BS,taillis sous futaie,,,46120,2.286005,47.256098
2021-266609,2021-05-18,000001,Vente,1212000,,,CHAMP DES BONJOURS,B064,18110,18004,Allogny,18,,,180040000A0007,,,,,,,,,,,,,0,,,,,BS,taillis sous futaie,,,1950,2.286751,47.255921
2021-266609,2021-05-18,000001,Vente,1212000,,,CHAMP DES BONJOURS,B064,18110,18004,Allogny,18,,,180040000A0008,,,,,,,,,,,,,0,,,,,T,terres,,,37590,2.28763,47.256289
2021-266609,2021-05-18,000001,Vente,1212000,,,CHAMP DES BONJOURS,B064,18110,18004,Allogny,18,,,180040000A0009,,,,,,,,,,,,,0,,,,,T,terres,,,4435,2.287568,47.254675
2021-266609,2021-05-18,000001,Vente,1212000,,,CHAMP DU PUITS,B075,18110,18004,Allogny,18,,,180040000A0010,,,,,,,,,,,,,0,,,,,T,terres,,,3360,2.288524,47.256128
2021-266609,2021-05-18,000001,Vente,1212000,,,CHAMP DU PUITS,B075,18110,18004,Allogny,18,,,180040000A0011,,,,,,,,,,,,,0,,,,,BS,taillis sous futaie,,,16580,2.292239,47.257251
2021-266609,2021-05-18,000001,Vente,1212000,,,CHAMP DU PUITS,B075,18110,18004,Allogny,18,,,180040000A0013,,,,,,,,,,,,,0,,,,,BS,taillis sous futaie,,,1790,2.292005,47.252921
2021-266609,2021-05-18,000001,Vente,1212000,,,LA TERRE ROUGE,B314,18110,18004,Allogny,18,,,180040000A0014,,,,,,,,,,,,,0,,,,,BS,taillis sous futaie,,,3070,2.293231,47.253877
2021-266609,2021-05-18,000001,Vente,1212000,,,LES VEVRES,B327,18110,18004,Allogny,18,,,180040000A0026,,,,,,,,,,,,,0,,,,,BS,taillis sous futaie,,,33700,2.291704,47.252219
2021-266609,2021-05-18,000001,Vente,1212000,,,LES VEVRES,B327,18110,18004,Allogny,18,,,180040000A0027,,,,,,,,,,,,,0,,,,,BS,taillis sous futaie,,,24195,2.291426,47.250357
2021-266609,2021-05-18,000001,Vente,1212000,,,LES VEVRES,B327,18110,18004,Allogny,18,,,180040000A0027,,,,,,,,,,,,,0,,,,,T,terres,,,20170,2.291426,47.250357
2021-266609,2021-05-18,000001,Vente,1212000,,,LES GIRARDERIES,B140,18110,18004,Allogny,18,,,180040000A0028,,,,,,,,,,,,,0,,,,,L,landes,,,10206,2.291465,47.24809
2021-266609,2021-05-18,000001,Vente,1212000,,,LES GIRARDERIES,B140,18110,18004,Allogny,18,,,180040000A0028,,,,,,,,,,,,,0,,,,,BS,taillis sous futaie,,,62459,2.291465,47.24809
2021-266609,2021-05-18,000001,Vente,1212000,,,LES GIRARDERIES,B140,18110,18004,Allogny,18,,,180040000A0029,,,,,,,,,,,,,0,,,,,L,landes,,,25425,2.290294,47.24782
2021-266609,2021-05-18,000001,Vente,1212000,,,LES GIRARDERIES,B140,18110,18004,Allogny,18,,,180040000A0030,,,,,,,,,,,,,0,,,,,BS,taillis sous futaie,,,36070,2.288098,47.248022
2021-266609,2021-05-18,000001,Vente,1212000,,,LA PLURE BONJOUR,B236,18110,18004,Allogny,18,,,180040000A0033,,,,,,,,,,,,,0,,,,,BS,taillis sous futaie,,,82455,2.285073,47.245777
2021-266609,2021-05-18,000001,Vente,1212000,,,TERRES DES LAUGY,B317,18110,18004,Allogny,18,,,180040000A0359,,,,,,,,,,,,,0,,,,,BR,futaies résineuses,SAPIN,Sapins ou sapinière,28580,2.282719,47.248424
2021-266609,2021-05-18,000001,Vente,1212000,,,TERRES DES LAUGY,B317,18110,18004,Allogny,18,,,180040000A0359,,,,,,,,,,,,,0,,,,,BS,taillis sous futaie,,,40020,2.282719,47.248424
2021-266609,2021-05-18,000001,Vente,1212000,,,TERRES DES LAUGY,B317,18110,18004,Allogny,18,,,180040000A0359,,,,,,,,,,,,,0,,,,,BR,futaies résineuses,SAPIN,Sapins ou sapinière,251420,2.282719,47.248424
2021-266609,2021-05-18,000001,Vente,1212000,,,TERRES DES LAUGY,B317,18110,18004,Allogny,18,,,180040000A0359,,,,,,,,,,,,,0,,,,,L,landes,,,72520,2.282719,47.248424
2021-266609,2021-05-18,000001,Vente,1212000,,,TERRES DES LAUGY,B317,18110,18004,Allogny,18,,,180040000A0359,,,,,,,,,,,,,0,,,,,E,eaux,PECH,Etangs pêchables,13500,2.282719,47.248424
2021-266609,2021-05-18,000001,Vente,1212000,,,TERRES DES LAUGY,B317,18110,18004,Allogny,18,,,180040000A0360,,,,,,,,,,,,,0,,,,,BS,taillis sous futaie,,,15480,2.284138,47.248259
2021-266609,2021-05-18,000001,Vente,1212000,,,TERRES DES LAUGY,B317,18110,18004,Allogny,18,,,180040000A0361,,,,,,,,,,,,,0,,,,,BR,futaies résineuses,SAPIN,Sapins ou sapinière,33425,2.286604,47.248967
2021-266609,2021-05-18,000001,Vente,1212000,,,TERRES DES LAUGY,B317,18110,18004,Allogny,18,,,180040000A0361,,,,,,,,,,,,,0,,,,,L,landes,,,57900,2.286604,47.248967
2021-266609,2021-05-18,000001,Vente,1212000,,,TERRES DES LAUGY,B317,18110,18004,Allogny,18,,,180040000A0361,,,,,,,,,,,,,0,,,,,L,landes,,,38920,2.286604,47.248967
2021-266609,2021-05-18,000001,Vente,1212000,,,TERRES DES LAUGY,B317,18110,18004,Allogny,18,,,180040000A0362,,,,,,,,,,,,,0,,,,,L,landes,,,12435,2.288328,47.251528
2021-266609,2021-05-18,000001,Vente,1212000,,,TERRES DES LAUGY,B317,18110,18004,Allogny,18,,,180040000A0363,,,,,,,,,,,,,0,,,,,BS,taillis sous futaie,,,1285,2.286106,47.250947
2021-266609,2021-05-18,000001,Vente,1212000,,,TERRES DES LAUGY,B317,18110,18004,Allogny,18,,,180040000A0364,,,,,,,,,,,,,0,,,,,L,landes,,,8745,2.285965,47.251644
2021-266609,2021-05-18,000001,Vente,1212000,,,TERRES DES LAUGY,B317,18110,18004,Allogny,18,,,180040000A0365,,,,,,,,,,,,,0,,,,,BR,futaies résineuses,SAPIN,Sapins ou sapinière,38005,2.282549,47.252068
2021-266609,2021-05-18,000001,Vente,1212000,,,TERRES DES LAUGY,B317,18110,18004,Allogny,18,,,180040000A0366,,,,,,,,,,,,,0,,,,,BS,taillis sous futaie,,,41420,2.280064,47.252912
2021-266609,2021-05-18,000001,Vente,1212000,,,TERRES DES LAUGY,B317,18110,18004,Allogny,18,,,180040000A0367,,,,,,,,,,,,,0,,,,,BS,taillis sous futaie,,,7250,2.280679,47.253856
2021-266609,2021-05-18,000001,Vente,1212000,,,TERRES DES LAUGY,B317,18110,18004,Allogny,18,,,180040000A0368,,,,,,,,,,,,,0,,,,,BS,taillis sous futaie,,,18570,2.282829,47.253722
2021-266609,2021-05-18,000001,Vente,1212000,,,TERRES DES LAUGY,B317,18110,18004,Allogny,18,,,180040000A0691,,,,,,,,,,,,,0,,,,,BR,futaies résineuses,SAPIN,Sapins ou sapinière,3180,2.284036,47.252083
2021-266609,2021-05-18,000001,Vente,1212000,,,LES DANJONS,B118,18110,18004,Allogny,18,,,180040000A0726,,,,,,,,,,,,,0,,,,,BS,taillis sous futaie,,,10685,2.285052,47.243618
2021-266609,2021-05-18,000001,Vente,1212000,,,LA PLURE BONJOUR,B236,18110,18004,Allogny,18,,,180040000A0727,,,,,,,,,,,,,0,,,,,BS,taillis sous futaie,,,15370,2.284997,47.244723
2021-266609,2021-05-18,000001,Vente,1212000,,,CHAMP DU PUITS,B075,18110,18004,Allogny,18,,,180040000A0867,,,,,,,,,,,,,0,,,,,L,landes,,,57376,2.291273,47.25529
2021-266609,2021-05-18,000001,Vente,1212000,,,CHAMP DU PUITS,B075,18110,18004,Allogny,18,,,180040000A0867,,,,,,,,,,,,,0,,,,,T,terres,,,138280,2.291273,47.25529
2021-266609,2021-05-18,000001,Vente,1212000,,,CHAMP DU PUITS,B075,18110,18004,Allogny,18,,,180040000A0867,,,,,,,,,,,,,0,,,,,BS,taillis sous futaie,,,33685,2.291273,47.25529
2021-266904,2021-06-02,000001,Vente,28500,1,,RTE VIERZON,0015,18110,18004,Allogny,18,,,180040000D1686,,,,,,,,,,,,,0,,,,,AG,terrains d'agrément,,,1315,2.313003,47.224944
2021-266904,2021-06-02,000001,Vente,28500,1,,RTE VIERZON,0015,18110,18004,Allogny,18,,,180040000D1687,,,,,,,,,,,,,0,,,,,BS,taillis sous futaie,,,486,2.312656,47.225051
2021-266930,2021-06-01,000001,Vente,200000,9,G,CHE DE LA MILLETERIE,0030,18110,18004,Allogny,18,,,180040000C0986,,,,,,,,,,,,,0,1,Maison,118,4,AG,terrains d'agrément,,,995,2.324147,47.220438
2021-266930,2021-06-01,000001,Vente,200000,9,G,CHE DE LA MILLETERIE,0030,18110,18004,Allogny,18,,,180040000C0986,,,,,,,,,,,,,0,1,Maison,118,4,S,sols,,,500,2.324147,47.220438
2021-267502,2021-07-15,000001,Vente,185000,4,,LA FONTAINE SAINT-SULPICE,B127,18110,18004,Allogny,18,,,180040000B0872,,,,,,,,,,,,,0,1,Maison,110,5,S,sols,,,610,2.318373,47.230463
2021-267502,2021-07-15,000001,Vente,185000,4,,LA FONTAINE SAINT-SULPICE,B127,18110,18004,Allogny,18,,,180040000B0872,,,,,,,,,,,,,0,1,Maison,110,5,AG,terrains d'agrément,,,1125,2.318373,47.230463
2021-267876,2021-07-21,000001,Vente,286800,17,,CHE DE MEHUN SUR YEVRE,0031,18110,18004,Allogny,18,,,180040000C0226,,,,,,,,,,,,,0,1,Maison,221,4,S,sols,,,500,2.315646,47.22244
2021-267876,2021-07-21,000001,Vente,286800,17,,CHE DE MEHUN SUR YEVRE,0031,18110,18004,Allogny,18,,,180040000C0226,,,,,,,,,,,,,0,1,Maison,221,4,AG,terrains d'agrément,,,2000,2.315646,47.22244
2021-267876,2021-07-21,000001,Vente,286800,17,,CHE DE MEHUN SUR YEVRE,0031,18110,18004,Allogny,18,,,180040000C0226,,,,,,,,,,,,,0,1,Maison,221,4,P,prés,,,4420,2.315646,47.22244
2021-267988,2021-08-06,000001,Vente,170000,2,,ALL DU BOIS DES ROIS,0010,18110,18004,Allogny,18,,,180040000B0567,,,,,,,,,,,,,0,1,Maison,79,3,J,jardins,,,750,2.321685,47.229964
2021-267988,2021-08-06,000001,Vente,170000,2,,ALL DU BOIS DES ROIS,0010,18110,18004,Allogny,18,,,180040000B0567,,,,,,,,,,,,,0,1,Maison,79,3,S,sols,,,500,2.321685,47.229964
2021-267988,2021-08-06,000001,Vente,170000,,,ALL DU BOIS DES ROIS,0010,18110,18004,Allogny,18,,,180040000B0574,,,,,,,,,,,,,0,,,,,S,sols,,,1084,2.321956,47.22985
2021-268019,2021-08-05,000001,Vente,90000,,,LE BOURG,B031,18110,18004,Allogny,18,,,180040000C0184,,,,,,,,,,,,,0,,,,,J,jardins,,,60,2.318516,47.225254
2021-268019,2021-08-05,000001,Vente,90000,,,LE BOURG,B031,18110,18004,Allogny,18,,,180040000C0548,,,,,,,,,,,,,0,,,,,S,sols,,,30,2.319071,47.225536
2021-268019,2021-08-05,000001,Vente,90000,1,,RUE DE L ABREUVOIR,0025,18110,18004,Allogny,18,,,180040000C0694,,,,,,,,,,,,,0,1,Maison,118,3,S,sols,,,685,2.318995,47.225414
2021-268019,2021-08-05,000001,Vente,90000,1,,RUE DE L ABREUVOIR,0025,18110,18004,Allogny,18,,,180040000C0694,,,,,,,,,,,,,0,3,Dépendance,,0,S,sols,,,685,2.318995,47.225414
2021-268051,2021-08-31,000001,Vente,250000,,,NOUE RALE,B204,18110,18004,Allogny,18,,,180040000D1525,,,,,,,,,,,,,0,,,,,P,prés,,,46554,2.269343,47.232502
2021-268051,2021-08-31,000001,Vente,250000,,,NOUE RALE,B204,18110,18004,Allogny,18,,,180040000D1525,,,,,,,,,,,,,0,,,,,BR,futaies résineuses,SAPIN,Sapins ou sapinière,43586,2.269343,47.232502
2021-268051,2021-08-31,000001,Vente,250000,,,LE TREMBLAI,B320,18110,18004,Allogny,18,,,180040000D1547,,,,,,,,,,,,,0,,,,,BS,taillis sous futaie,,,20390,2.26773,47.229099
2021-268051,2021-08-31,000001,Vente,250000,,,LE TREMBLAI,B320,18110,18004,Allogny,18,,,180040000D1547,,,,,,,,,,,,,0,,,,,BS,taillis sous futaie,,,29543,2.26773,47.229099
2021-268051,2021-08-31,000001,Vente,250000,,,LES TERRES NETTES,B318,18110,18004,Allogny,18,,,180040000D1554,,,,,,,,,,,,,0,,,,,BS,taillis sous futaie,,,1742,2.267236,47.23071
2021-268051,2021-08-31,000001,Vente,250000,,,LES TERRES NETTES,B318,18110,18004,Allogny,18,,,180040000D1556,,,,,,,,,,,,,0,,,,,BS,taillis sous futaie,,,59940,2.268833,47.23172
2021-268051,2021-08-31,000001,Vente,250000,,,LES TERRES NETTES,B318,18110,18004,Allogny,18,,,180040000D1556,,,,,,,,,,,,,0,,,,,BS,taillis sous futaie,,,1018,2.268833,47.23172
2021-268051,2021-08-31,000001,Vente,250000,,,LA BOURGETTE,B032,18110,18004,Allogny,18,,,180040000D1627,,,,,,,,,,,,,0,,,,,BS,taillis sous futaie,,,270,2.265627,47.233485
2021-268051,2021-08-31,000001,Vente,250000,,,LA RUE NEUVE,B275,18110,18004,Allogny,18,,,180040000D1630,,,,,,,,,,,,,0,,,,,T,terres,,,1075,2.264671,47.232717
2021-268051,2021-08-31,000001,Vente,250000,,,LA RUE NEUVE,B275,18110,18004,Allogny,18,,,180040000D1631,,,,,,,,,,,,,0,,,,,T,terres,,,1190,2.264893,47.231732
2021-268051,2021-08-31,000001,Vente,250000,,,LE PONTET,B239,18110,18004,Allogny,18,,,180040000D1632,,,,,,,,,,,,,0,,,,,T,terres,,,926,2.263021,47.231836
2021-268051,2021-08-31,000001,Vente,250000,,,LE PONTET,B239,18110,18004,Allogny,18,,,180040000D1677,,,,,,,,,,,,,0,,,,,BS,taillis sous futaie,,,3290,2.265676,47.229001
2021-268051,2021-08-31,000001,Vente,250000,,,LE PONTET,B239,18110,18004,Allogny,18,,,180040000D1677,,,,,,,,,,,,,0,,,,,T,terres,,,170822,2.265676,47.229001
2021-268128,2021-08-25,000001,Vente,220000,,,LA GRANDE NOUE,B156,18110,18004,Allogny,18,,,180040000B0344,,,,,,,,,,,,,0,,,,,T,terres,,,3325,2.333011,47.226727
2021-268128,2021-08-25,000001,Vente,220000,,,LA GRANDE NOUE,B156,18110,18004,Allogny,18,,,180040000B0353,,,,,,,,,,,,,0,,,,,BS,taillis sous futaie,,,1120,2.337003,47.226596
2021-268128,2021-08-25,000001,Vente,220000,6,,CHE DES FOUGERES,0023,18110,18004,Allogny,18,,,180040000B0354,,,,,,,,,,,,,0,1,Maison,125,3,S,sols,,,800,2.335716,47.228001
2021-268128,2021-08-25,000001,Vente,220000,6,,CHE DES FOUGERES,0023,18110,18004,Allogny,18,,,180040000B0354,,,,,,,,,,,,,0,3,Dépendance,,0,S,sols,,,800,2.335716,47.228001
2021-268128,2021-08-25,000001,Vente,220000,6,,CHE DES FOUGERES,0023,18110,18004,Allogny,18,,,180040000B0354,,,,,,,,,,,,,0,3,Dépendance,,0,T,terres,,,9400,2.335716,47.228001
2021-268128,2021-08-25,000001,Vente,220000,6,,CHE DES FOUGERES,0023,18110,18004,Allogny,18,,,180040000B0354,,,,,,,,,,,,,0,1,Maison,125,3,T,terres,,,9400,2.335716,47.228001
2021-268128,2021-08-25,000001,Vente,220000,6,,CHE DES FOUGERES,0023,18110,18004,Allogny,18,,,180040000B0354,,,,,,,,,,,,,0,1,Maison,125,3,T,terres,,,9400,2.335716,47.228001
2021-268128,2021-08-25,000001,Vente,220000,6,,CHE DES FOUGERES,0023,18110,18004,Allogny,18,,,180040000B0354,,,,,,,,,,,,,0,3,Dépendance,,0,T,terres,,,9400,2.335716,47.228001
2021-268128,2021-08-25,000001,Vente,220000,6,,CHE DES FOUGERES,0023,18110,18004,Allogny,18,,,180040000B0354,,,,,,,,,,,,,0,1,Maison,125,3,E,eaux,PECH,Etangs pêchables,1090,2.335716,47.228001
2021-268128,2021-08-25,000001,Vente,220000,6,,CHE DES FOUGERES,0023,18110,18004,Allogny,18,,,180040000B0354,,,,,,,,,,,,,0,3,Dépendance,,0,E,eaux,PECH,Etangs pêchables,1090,2.335716,47.228001
2021-268128,2021-08-25,000001,Vente,220000,,,LA GRANDE NOUE,B156,18110,18004,Allogny,18,,,180040000B0355,,,,,,,,,,,,,0,,,,,AG,terrains d'agrément,,,728,2.334606,47.229077
2021-268128,2021-08-25,000001,Vente,220000,,,LA GRANDE NOUE,B156,18110,18004,Allogny,18,,,180040000B0355,,,,,,,,,,,,,0,,,,,S,sols,,,112,2.334606,47.229077
2021-268217,2021-08-27,000001,Vente,243480,18,,CHE DE BOURSAC,0050,18110,18004,Allogny,18,,,180040000D0843,,,,,,,,,,,,,0,1,Maison,156,5,AG,terrains d'agrément,,,4067,2.291209,47.209266
2021-268217,2021-08-27,000001,Vente,243480,18,,CHE DE BOURSAC,0050,18110,18004,Allogny,18,,,180040000D0843,,,,,,,,,,,,,0,3,Dépendance,,0,S,sols,,,573,2.291209,47.209266
2021-268217,2021-08-27,000001,Vente,243480,18,,CHE DE BOURSAC,0050,18110,18004,Allogny,18,,,180040000D0843,,,,,,,,,,,,,0,3,Dépendance,,0,S,sols,,,573,2.291209,47.209266
2021-268217,2021-08-27,000001,Vente,243480,18,,CHE DE BOURSAC,0050,18110,18004,Allogny,18,,,180040000D0843,,,,,,,,,,,,,0,1,Maison,156,5,S,sols,,,573,2.291209,47.209266
2021-268217,2021-08-27,000001,Vente,243480,18,,CHE DE BOURSAC,0050,18110,18004,Allogny,18,,,180040000D0843,,,,,,,,,,,,,0,3,Dépendance,,0,AG,terrains d'agrément,,,4067,2.291209,47.209266
2021-268217,2021-08-27,000001,Vente,243480,18,,CHE DE BOURSAC,0050,18110,18004,Allogny,18,,,180040000D0843,,,,,,,,,,,,,0,3,Dépendance,,0,AG,terrains d'agrément,,,4067,2.291209,47.209266
2021-268239,2021-08-30,000001,Vente,73600,,,LE BOURG,B031,18110,18004,Allogny,18,,,180040000C0099,,,,,,,,,,,,,0,,,,,J,jardins,,,395,2.3198,47.224362
2021-268239,2021-08-30,000001,Vente,73600,6,,RTE DE ST MARTIN D AUXIGNY,0024,18110,18004,Allogny,18,,,180040000C0100,,,,,,,,,,,,,0,1,Maison,155,6,S,sols,,,205,2.319986,47.224706
2021-268239,2021-08-30,000001,Vente,73600,4,,RTE DE ST MARTIN D AUXIGNY,0024,18110,18004,Allogny,18,,,180040000C0857,,,,,,,,,,,,,0,,,,,S,sols,,,26,2.319967,47.224778
2021-268339,2021-09-07,000001,Vente,637425,,,LE RABILLON,B258,18110,18004,Allogny,18,,,180040000D0058,,,,,,,,,,,,,0,,,,,T,terres,,,9200,2.280791,47.224598
2021-268339,2021-09-07,000001,Vente,637425,,,LE RABILLON,B258,18110,18004,Allogny,18,,,180040000D0058,,,,,,,,,,,,,0,,,,,S,sols,,,5600,2.280791,47.224598