id_mutation,date_mutation,numero_disposition,nature_mutation,valeur_fonciere,adresse_numero,adresse_suffixe,adresse_nom_voie,adresse_code_voie,code_postal,code_commune,nom_commune,code_departement,ancien_code_commune,ancien_nom_commune,id_parcelle,ancien_id_parcelle,numero_volume,lot1_numero,lot1_surface_carrez,lot2_numero,lot2_surface_carrez,lot3_numero,lot3_surface_carrez,lot4_numero,lot4_surface_carrez,lot5_numero,lot5_surface_carrez,nombre_lots,code_type_local,type_local,surface_reelle_bati,nombre_pieces_principales,code_nature_culture,nature_culture,code_nature_culture_speciale,nature_culture_speciale,surface_terrain,longitude,latitude
2021-268168,2021-09-03,000001,Vente,58025,9,,IMP LES GENIEVRES,0310,18160,18043,La Celle-Condé,18,,,18043000ZL0053,,,,,,,,,,,,,0,1,Maison,82,4,S,sols,,,256,2.181771,46.789286
2021-268168,2021-09-03,000001,Vente,58025,9,,IMP LES GENIEVRES,0310,18160,18043,La Celle-Condé,18,,,18043000ZL0053,,,,,,,,,,,,,0,1,Maison,82,4,AG,terrains d'agrément,,,1236,2.181771,46.789286
2021-269547,2021-10-27,000001,Vente,180000,,,PRES D HAUTERIVE,B290,18160,18043,La Celle-Condé,18,,,180430000A0564,,,,,,,,,,,,,0,,,,,T,terres,,,185,2.195065,46.798331
2021-269547,2021-10-27,000001,Vente,180000,,,PRES D HAUTERIVE,B290,18160,18043,La Celle-Condé,18,,,180430000A0565,,,,,,,,,,,,,0,,,,,T,terres,,,169,2.194693,46.797932
2021-269547,2021-10-27,000001,Vente,180000,,,CHAMP DU BOIS,B068,18160,18043,La Celle-Condé,18,,,180430000C0116,,,,,,,,,,,,,0,,,,,T,terres,,,1541,2.196329,46.793756
2021-269547,2021-10-27,000001,Vente,180000,,,CHAMP DU BOIS,B068,18160,18043,La Celle-Condé,18,,,180430000C0117,,,,,,,,,,,,,0,,,,,T,terres,,,4886,2.196523,46.794076
2021-269547,2021-10-27,000001,Vente,180000,,,CHAMP DU BOIS,B068,18160,18043,La Celle-Condé,18,,,180430000C0118,,,,,,,,,,,,,0,,,,,T,terres,,,33657,2.195771,46.794722
2021-269547,2021-10-27,000001,Vente,180000,,,L ARRACHIS,B005,18160,18043,La Celle-Condé,18,,,180430000C0121,,,,,,,,,,,,,0,,,,,T,terres,,,1717,2.195043,46.795992
2021-269547,2021-10-27,000001,Vente,180000,,,L ARRACHIS,B005,18160,18043,La Celle-Condé,18,,,180430000C0122,,,,,,,,,,,,,0,,,,,T,terres,,,30650,2.193517,46.794831
2021-269547,2021-10-27,000001,Vente,180000,,,PRE PREVOST,B311,18160,18043,La Celle-Condé,18,,,180430000C0123,,,,,,,,,,,,,0,,,,,P,prés,,,10020,2.192279,46.794782
2021-269547,2021-10-27,000001,Vente,180000,,,PRE PREVOST,B311,18160,18043,La Celle-Condé,18,,,180430000C0124,,,,,,,,,,,,,0,,,,,E,eaux,MARE,Mare,891,2.193406,46.795365
2021-269547,2021-10-27,000001,Vente,180000,,,PRE PREVOST,B311,18160,18043,La Celle-Condé,18,,,180430000C0125,,,,,,,,,,,,,0,,,,,T,terres,,,5365,2.194219,46.795988
2021-269547,2021-10-27,000001,Vente,180000,,,HTE RIVE,B230,18160,18043,La Celle-Condé,18,,,180430000C0126,,,,,,,,,,,,,0,,,,,T,terres,,,1830,2.195028,46.796417
2021-269547,2021-10-27,000001,Vente,180000,,,HTE RIVE,B230,18160,18043,La Celle-Condé,18,,,180430000C0127,,,,,,,,,,,,,0,,,,,S,sols,,,87,2.194836,46.796612
2021-269547,2021-10-27,000001,Vente,180000,,,HTE RIVE,B230,18160,18043,La Celle-Condé,18,,,180430000C0128,,,,,,,,,,,,,0,,,,,P,prés,,,5640,2.195235,46.796568
2021-269547,2021-10-27,000001,Vente,180000,,,LE PARC,B256,18160,18043,La Celle-Condé,18,,,180430000C0132,,,,,,,,,,,,,0,,,,,P,prés,,,16760,2.195529,46.797193
2021-269547,2021-10-27,000001,Vente,180000,,,LE PARC,B256,18160,18043,La Celle-Condé,18,,,180430000C0133,,,,,,,,,,,,,0,,,,,T,terres,,,16610,2.196151,46.798599
2021-269547,2021-10-27,000001,Vente,180000,,,LE PARC,B256,18160,18043,La Celle-Condé,18,,,180430000C0134,,,,,,,,,,,,,0,,,,,L,landes,,,1292,2.196954,46.7979
2021-269547,2021-10-27,000001,Vente,180000,,,CHAMPS D EN BAS,B092,18160,18043,La Celle-Condé,18,,,180430000C0146,,,,,,,,,,,,,0,,,,,T,terres,,,18870,2.200482,46.79972
2021-269547,2021-10-27,000001,Vente,180000,,,CHAMPS D EN BAS,B092,18160,18043,La Celle-Condé,18,,,180430000C0147,,,,,,,,,,,,,0,,,,,T,terres,,,30100,2.200647,46.798173
2021-269547,2021-10-27,000001,Vente,180000,,,CHAMPS D EN BAS,B092,18160,18043,La Celle-Condé,18,,,180430000C0148,,,,,,,,,,,,,0,,,,,T,terres,,,22860,2.200873,46.796533
2021-269547,2021-10-27,000001,Vente,180000,,,CHAMPS DE LA PORTE,B109,18160,18043,La Celle-Condé,18,,,180430000C0149,,,,,,,,,,,,,0,,,,,T,terres,,,32390,2.198253,46.798782
2021-269547,2021-10-27,000001,Vente,180000,,,CHAMPS DE LA PORTE,B109,18160,18043,La Celle-Condé,18,,,180430000C0150,,,,,,,,,,,,,0,,,,,T,terres,,,29254,2.197861,46.796846
2021-269547,2021-10-27,000001,Vente,180000,,,LES VERGNES,B360,18160,18043,La Celle-Condé,18,,,180430000C0151,,,,,,,,,,,,,0,,,,,T,terres,,,49122,2.198955,46.7952
2021-269547,2021-10-27,000001,Vente,180000,,,LES VERGNES,B360,18160,18043,La Celle-Condé,18,,,180430000C0152,,,,,,,,,,,,,0,,,,,T,terres,,,15940,2.201783,46.795353
2021-269547,2021-10-27,000001,Vente,180000,,,CHAMP DE LA CROIX,B053,18160,18043,La Celle-Condé,18,,,180430000C0154,,,,,,,,,,,,,0,,,,,T,terres,,,7955,2.198159,46.794104
2021-269547,2021-10-27,000001,Vente,180000,,,LA BARAUDERIE,B011,18160,18043,La Celle-Condé,18,,,18043000ZH0008,,,,,,,,,,,,,0,,,,,T,terres,,,5050,2.198921,46.800637
2021-269547,2021-10-27,000001,Vente,180000,,,LA BARAUDERIE,B011,18160,18043,La Celle-Condé,18,,,18043000ZH0009,,,,,,,,,,,,,0,,,,,T,terres,,,8520,2.198409,46.800615
2021-269547,2021-10-27,000001,Vente,180000,,,CHAMPS DU MOULIN,B129,18160,18043,La Celle-Condé,18,,,18043000ZI0005,,,,,,,,,,,,,0,,,,,P,prés,,,26790,2.194226,46.798646
2021-269547,2021-10-27,000001,Vente,180000,,,CHAMPS DU MOULIN,B129,18160,18043,La Celle-Condé,18,,,18043000ZI0005,,,,,,,,,,,,,0,,,,,P,prés,,,26790,2.194226,46.798646
2021-269547,2021-10-27,000001,Vente,180000,,,CHAMPS DU MOULIN,B129,18160,18043,La Celle-Condé,18,,,18043000ZI0006,,,,,,,,,,,,,0,,,,,P,prés,,,46100,2.192117,46.795646
2021-269547,2021-10-27,000001,Vente,180000,,,LES VERGNES,B360,18160,18043,La Celle-Condé,18,,,18043000ZI0009,,,,,,,,,,,,,0,,,,,T,terres,,,16100,2.201106,46.794509
2021-269718,2021-11-05,000001,Vente,8912,,,BRANDE DE ROSSINE,B026,18160,18043,La Celle-Condé,18,,,18043000ZP0005,,,,,,,,,,,,,0,,,,,T,terres,,,22280,2.148158,46.777858
2021-269791,2021-11-08,000001,Vente,4000,,,LES LANDES,B235,18160,18043,La Celle-Condé,18,,,18043000ZO0024,,,,,,,,,,,,,0,,,,,S,sols,,,20,2.159544,46.763266
2021-269791,2021-11-08,000001,Vente,4000,,,LES LANDES,B235,18160,18043,La Celle-Condé,18,,,18043000ZO0024,,,,,,,,,,,,,0,,,,,T,terres,,,4650,2.159544,46.763266
2021-270682,2021-12-15,000001,Vente,71000,,,LES MAGNOUX,B241,18160,18043,La Celle-Condé,18,,,180430000A0514,,,,,,,,,,,,,0,,,,,T,terres,,,1714,2.190853,46.806291
2021-270682,2021-12-15,000001,Vente,71000,,,LES MAGNOUX,B241,18160,18043,La Celle-Condé,18,,,180430000A0515,,,,,,,,,,,,,0,,,,,T,terres,,,2736,2.190584,46.805961
2021-270682,2021-12-15,000001,Vente,71000,,,LES MAGNOUX,B241,18160,18043,La Celle-Condé,18,,,180430000A0516,,,,,,,,,,,,,0,,,,,T,terres,,,1548,2.190995,46.805905
2021-270682,2021-12-15,000001,Vente,71000,,,LES MAGNOUX,B241,18160,18043,La Celle-Condé,18,,,180430000A0517,,,,,,,,,,,,,0,,,,,T,terres,,,1240,2.191242,46.805711
2021-270682,2021-12-15,000001,Vente,71000,3,,LES MAGNOUX,B241,18160,18043,La Celle-Condé,18,,,180430000A0518,,,,,,,,,,,,,0,1,Maison,75,2,S,sols,,,1490,2.191232,46.806182
2021-270682,2021-12-15,000001,Vente,71000,,,LES MAGNOUX,B241,18160,18043,La Celle-Condé,18,,,180430000A0519,,,,,,,,,,,,,0,,,,,J,jardins,,,726,2.191449,46.805964
2021-271472,2021-01-04,000001,Vente,60000,5,,IMP LES GENIEVRES,0310,18160,18043,La Celle-Condé,18,,,18043000ZL0049,,,,,,,,,,,,,0,1,Maison,73,3,S,sols,,,257,2.180876,46.789031
2021-271472,2021-01-04,000001,Vente,60000,5,,IMP LES GENIEVRES,0310,18160,18043,La Celle-Condé,18,,,18043000ZL0049,,,,,,,,,,,,,0,1,Maison,73,3,AG,terrains d'agrément,,,1013,2.180876,46.789031
2021-271472,2021-01-04,000001,Vente,60000,,,RUE DES GENIEVRES,0300,18160,18043,La Celle-Condé,18,,,18043000ZL0057,,,,,,,,,,,,,0,,,,,T,terres,,,145,2.181067,46.788911
2021-271479,2021-01-12,000001,Vente,25000,1,,BRANDE DE SAINTE MARIE,B027,18160,18043,La Celle-Condé,18,,,18043000ZC0025,,,,,,,,,,,,,0,1,Maison,65,3,J,jardins,,,554,2.171134,46.802219
2021-271479,2021-01-12,000001,Vente,25000,1,,BRANDE DE SAINTE MARIE,B027,18160,18043,La Celle-Condé,18,,,18043000ZC0025,,,,,,,,,,,,,0,1,Maison,65,3,S,sols,,,1247,2.171134,46.802219
2021-271572,2021-02-03,000001,Vente,21000,,,LA GRANDE TAILLE,B214,18160,18043,La Celle-Condé,18,,,180430000B0151,,,,,,,,,,,,,0,,,,,BS,taillis sous futaie,,,66560,2.169464,46.796128
2021-271572,2021-02-03,000001,Vente,21000,,,LA GRANDE TAILLE,B214,18160,18043,La Celle-Condé,18,,,180430000B1094,,,,,,,,,,,,,0,,,,,BS,taillis sous futaie,,,745,2.170685,46.797871
2021-271805,2021-03-12,000001,Vente,36635,,,CHAMP DU CORMIER,B072,18160,18043,La Celle-Condé,18,,,180430000A0470,,,,,,,,,,,,,0,,,,,T,terres,,,5704,2.188631,46.809853
2021-271805,2021-03-12,000001,Vente,36635,,,LES ANDREAUX,B002,18160,18043,La Celle-Condé,18,,,18043000ZD0023,,,,,,,,,,,,,0,,,,,T,terres,,,73000,2.18625,46.809958
2021-271805,2021-03-12,000001,Vente,36635,,,LES ANDREAUX,B002,18160,18043,La Celle-Condé,18,,,18043000ZD0023,,,,,,,,,,,,,0,,,,,T,terres,,,36500,2.18625,46.809958
2021-271969,2021-03-25,000001,Vente,104500,,,LES ANDREAUX,B002,18160,18043,La Celle-Condé,18,,,18043000ZD0024,,,,,,,,,,,,,0,,,,,T,terres,,,3440,2.187314,46.808273
2021-271969,2021-03-25,000001,Vente,104500,,,LES ANDREAUX,B002,18160,18043,La Celle-Condé,18,,,18043000ZD0024,,,,,,,,,,,,,0,,,,,S,sols,,,100,2.187314,46.808273
2021-271969,2021-03-25,000001,Vente,104500,,,LES ANDREAUX,B002,18160,18043,La Celle-Condé,18,,,18043000ZD0066,,,,,,,,,,,,,0,,,,,T,terres,,,244,2.187888,46.808005
2021-271969,2021-03-25,000001,Vente,104500,,,LES ANDREAUX,B002,18160,18043,La Celle-Condé,18,,,18043000ZD0068,,,,,,,,,,,,,0,,,,,T,terres,,,2277,2.18792,46.808453
2021-271969,2021-03-25,000001,Vente,104500,4,,LES ANDREAUX,B002,18160,18043,La Celle-Condé,18,,,18043000ZD0069,,,,,,,,,,,,,0,1,Maison,139,4,S,sols,,,1565,2.187404,46.80803
2021-272001,2021-04-17,000001,Vente,108000,1,,LA FOLIE,B195,18160,18043,La Celle-Condé,18,,,18043000ZA0018,,,,,,,,,,,,,0,1,Maison,73,3,S,sols,,,143,2.142346,46.791023
2021-272001,2021-04-17,000001,Vente,108000,1,,LA FOLIE,B195,18160,18043,La Celle-Condé,18,,,18043000ZA0018,,,,,,,,,,,,,0,1,Maison,73,3,T,terres,,,2240,2.142346,46.791023
2021-272001,2021-04-17,000001,Vente,108000,110,,LA FOLIE,B195,18160,18043,La Celle-Condé,18,,,18043000ZA0019,,,,,,,,,,,,,0,1,Maison,20,0,T,terres,,,1240,2.142182,46.791371
2021-272001,2021-04-17,000001,Vente,108000,110,,LA FOLIE,B195,18160,18043,La Celle-Condé,18,,,18043000ZA0019,,,,,,,,,,,,,0,1,Maison,20,0,S,sols,,,360,2.142182,46.791371
2021-272433,2021-07-08,000001,Vente,7618,,,PRE DE LA CURE,B292,18160,18043,La Celle-Condé,18,,,180430000A0733,,,,,,,,,,,,,0,,,,,P,prés,,,16930,2.188042,46.79474
2021-272603,2021-08-03,000001,Vente,70000,,,LA CHAUME,B143,18160,18043,La Celle-Condé,18,,,18043000ZH0125,,,,,,,,,,,,,0,,,,,T,terres,,,75,2.209229,46.79955
2021-272603,2021-08-03,000001,Vente,70000,,,LA CHAUME,B143,18160,18043,La Celle-Condé,18,,,18043000ZH0125,,,,,,,,,,,,,0,,,,,T,terres,,,75,2.209229,46.79955
2021-272603,2021-08-03,000001,Vente,70000,152,,LA CHAUME,B143,18160,18043,La Celle-Condé,18,,,18043000ZH0126,,,,,,,,,,,,,0,1,Maison,90,4,T,terres,,,3248,2.207017,46.800949
2021-272603,2021-08-03,000001,Vente,70000,152,,LA CHAUME,B143,18160,18043,La Celle-Condé,18,,,18043000ZH0126,,,,,,,,,,,,,0,1,Maison,90,4,S,sols,,,500,2.207017,46.800949
2021-272603,2021-08-03,000001,Vente,70000,152,,LA CHAUME,B143,18160,18043,La Celle-Condé,18,,,18043000ZH0126,,,,,,,,,,,,,0,1,Maison,90,4,T,terres,,,2909,2.207017,46.800949
2021-272614,2021-08-05,000001,Vente,55000,12,,RTE ANCIENNE GARE,0050,18160,18043,La Celle-Condé,18,,,180430000A0832,,,,,,,,,,,,,0,1,Maison,66,3,S,sols,,,672,2.185497,46.79422
2021-272614,2021-08-05,000001,Vente,55000,12,,RTE ANCIENNE GARE,0050,18160,18043,La Celle-Condé,18,,,180430000A0832,,,,,,,,,,,,,0,3,Dépendance,,0,S,sols,,,672,2.185497,46.79422
2021-272614,2021-08-05,000001,Vente,55000,12,,RTE ANCIENNE GARE,0050,18160,18043,La Celle-Condé,18,,,180430000A0832,,,,,,,,,,,,,0,3,Dépendance,,0,S,sols,,,672,2.185497,46.79422
2021-272614,2021-08-05,000001,Vente,55000,,,LE BOURG,B024,18160,18043,La Celle-Condé,18,,,180430000A0884,,,,,,,,,,,,,0,,,,,J,jardins,,,81,2.185718,46.794131
2021-272614,2021-08-05,000001,Vente,55000,,,LE BOURG,B024,18160,18043,La Celle-Condé,18,,,180430000A0885,,,,,,,,,,,,,0,,,,,J,jardins,,,100,2.185546,46.794007
2021-272724,2021-08-31,000001,Vente,169000,1,,LES MAGNOUX,B241,18160,18043,La Celle-Condé,18,,,180430000A0534,,,,,,,,,,,,,0,3,Dépendance,,0,S,sols,,,525,2.193115,46.807015
2021-272724,2021-08-31,000001,Vente,169000,1,,LES MAGNOUX,B241,18160,18043,La Celle-Condé,18,,,180430000A0534,,,,,,,,,,,,,0,1,Maison,58,2,S,sols,,,525,2.193115,46.807015
2021-272724,2021-08-31,000001,Vente,169000,,,LES MAGNOUX,B241,18160,18043,La Celle-Condé,18,,,180430000A0535,,,,,,,,,,,,,0,,,,,J,jardins,,,642,2.192959,46.807121
2021-272724,2021-08-31,000001,Vente,169000,,,LES MAGNOUX,B241,18160,18043,La Celle-Condé,18,,,180430000A0536,,,,,,,,,,,,,0,,,,,S,sols,,,100,2.193237,46.807328
2021-272724,2021-08-31,000001,Vente,169000,,,LES MAGNOUX,B241,18160,18043,La Celle-Condé,18,,,180430000A0536,,,,,,,,,,,,,0,,,,,T,terres,,,906,2.193237,46.807328
