id_mutation,date_mutation,numero_disposition,nature_mutation,valeur_fonciere,adresse_numero,adresse_suffixe,adresse_nom_voie,adresse_code_voie,code_postal,code_commune,nom_commune,code_departement,ancien_code_commune,ancien_nom_commune,id_parcelle,ancien_id_parcelle,numero_volume,lot1_numero,lot1_surface_carrez,lot2_numero,lot2_surface_carrez,lot3_numero,lot3_surface_carrez,lot4_numero,lot4_surface_carrez,lot5_numero,lot5_surface_carrez,nombre_lots,code_type_local,type_local,surface_reelle_bati,nombre_pieces_principales,code_nature_culture,nature_culture,code_nature_culture_speciale,nature_culture_speciale,surface_terrain,longitude,latitude
2021-268212,2021-08-14,000001,Vente,85000,,,BOIS DE CONQUES,B017,18250,18111,Humbligny,18,,,181110000B0851,,,,,,,,,,,,,0,,,,,BS,taillis sous futaie,,,118,2.63312,47.236614
2021-268212,2021-08-14,000001,Vente,85000,,,CONQUES BAS VILLAGE,B100,18250,18111,Humbligny,18,,,181110000B0990,,,,,,,,,,,,,0,,,,,P,prés,,,4269,2.629655,47.236168
2021-268212,2021-08-14,000001,Vente,85000,,,CONQUES BAS VILLAGE,B100,18250,18111,Humbligny,18,,,181110000B1008,,,,,,,,,,,,,0,,,,,T,terres,,,99,2.629132,47.237011
2021-268212,2021-08-14,000001,Vente,85000,,,CONQUES BAS VILLAGE,B100,18250,18111,Humbligny,18,,,181110000B1009,,,,,,,,,,,,,0,,,,,J,jardins,,,108,2.629339,47.237042
2021-268212,2021-08-14,000001,Vente,85000,107,,CONQUES BAS VILLAGE,B100,18250,18111,Humbligny,18,,,181110000B1010,,,,,,,,,,,,,0,1,Maison,107,3,S,sols,,,2090,2.629389,47.236752
2021-268212,2021-08-14,000001,Vente,85000,,,CONQUES BAS VILLAGE,B100,18250,18111,Humbligny,18,,,181110000B1011,,,,,,,,,,,,,0,,,,,J,jardins,,,1570,2.62951,47.236869
2021-268212,2021-08-14,000001,Vente,85000,,,CONQUES BAS VILLAGE,B100,18250,18111,Humbligny,18,,,181110000B1012,,,,,,,,,,,,,0,,,,,T,terres,,,882,2.630184,47.23597
2021-268212,2021-08-14,000001,Vente,85000,,,CONQUES BAS VILLAGE,B100,18250,18111,Humbligny,18,,,181110000B1013,,,,,,,,,,,,,0,,,,,T,terres,,,12750,2.630809,47.236758
2021-268212,2021-08-14,000001,Vente,85000,,,BOIS MORIN,B020,18250,18111,Humbligny,18,,,18111000ZO0035,,,,,,,,,,,,,0,,,,,BS,taillis sous futaie,,,980,2.631973,47.233886
2021-268872,2021-09-30,000001,Vente,560000,,,BOURG,B026,18250,18111,Humbligny,18,,,181110000F0095,,,,,,,,,,,,,0,,,,,T,terres,,,12557,2.663157,47.252702
2021-268872,2021-09-30,000001,Vente,560000,,,BOURG,B026,18250,18111,Humbligny,18,,,181110000F0124,,,,,,,,,,,,,0,,,,,AG,terrains d'agrément,,,37670,2.662246,47.252416
2021-268872,2021-09-30,000001,Vente,560000,20,,BOURG,B026,18250,18111,Humbligny,18,,,181110000F0911,,,,,,,,,,,,,0,1,Maison,262,6,S,sols,,,597,2.661743,47.253579
2021-268872,2021-09-30,000001,Vente,560000,20,,BOURG,B026,18250,18111,Humbligny,18,,,181110000F0911,,,,,,,,,,,,,0,1,Maison,262,6,J,jardins,,,416,2.661743,47.253579
2021-268872,2021-09-30,000001,Vente,560000,20,,BOURG,B026,18250,18111,Humbligny,18,,,181110000F0911,,,,,,,,,,,,,0,1,Maison,80,3,AG,terrains d'agrément,,,3648,2.661743,47.253579
2021-268872,2021-09-30,000001,Vente,560000,20,,BOURG,B026,18250,18111,Humbligny,18,,,181110000F0911,,,,,,,,,,,,,0,1,Maison,262,6,AG,terrains d'agrément,,,3648,2.661743,47.253579
2021-268872,2021-09-30,000001,Vente,560000,20,,BOURG,B026,18250,18111,Humbligny,18,,,181110000F0911,,,,,,,,,,,,,0,1,Maison,80,3,J,jardins,,,416,2.661743,47.253579
2021-268872,2021-09-30,000001,Vente,560000,20,,BOURG,B026,18250,18111,Humbligny,18,,,181110000F0911,,,,,,,,,,,,,0,1,Maison,80,3,S,sols,,,597,2.661743,47.253579
2021-269055,2021-10-08,000001,Vente,96000,94,,LE MOULIN A VENT,B160,18250,18111,Humbligny,18,,,181110000E0216,,,,,,,,,,,,,0,1,Maison,39,1,S,sols,,,762,2.670587,47.245345
2021-269055,2021-10-08,000001,Vente,96000,94,,LE MOULIN A VENT,B160,18250,18111,Humbligny,18,,,181110000E0216,,,,,,,,,,,,,0,3,Dépendance,,0,S,sols,,,762,2.670587,47.245345
2021-272930,2021-02-25,000002,Vente,39000,,,LE BUISSON DES CORNEUILLON,B031,18250,18111,Humbligny,18,,,181110000A0481,,,,,,,,,,,,,0,,,,,BT,taillis simples,,,1440,2.640118,47.274755
2021-272930,2021-02-25,000002,Vente,39000,,,LE BUISSON DES CORNEUILLON,B031,18250,18111,Humbligny,18,,,181110000A0492,,,,,,,,,,,,,0,,,,,BT,taillis simples,,,416,2.637646,47.274347
2021-272930,2021-02-25,000002,Vente,39000,68,,LES BARONS,B005,18250,18111,Humbligny,18,,,18111000ZH0051,,,,,,,,,,,,,0,1,Maison,44,2,S,sols,,,450,2.640969,47.271326
2021-272930,2021-02-25,000002,Vente,39000,68,,LES BARONS,B005,18250,18111,Humbligny,18,,,18111000ZH0051,,,,,,,,,,,,,0,1,Maison,44,2,P,prés,,,735,2.640969,47.271326
2021-272930,2021-02-25,000002,Vente,39000,68,,LES BARONS,B005,18250,18111,Humbligny,18,,,18111000ZH0051,,,,,,,,,,,,,0,1,Maison,44,2,BS,taillis sous futaie,,,695,2.640969,47.271326
2021-273230,2021-05-17,000001,Vente,718.43,,,VIGNES DE CHANTENAIS,B262,18250,18111,Humbligny,18,,,181110000E0369,,,,,,,,,,,,,0,,,,,T,terres,,,530,2.69019,47.253416
2021-273230,2021-05-17,000001,Vente,718.43,,,VIGNES DE CHANTENAIS,B262,18250,18111,Humbligny,18,,,181110000E0379,,,,,,,,,,,,,0,,,,,T,terres,,,1138,2.691511,47.252104
2021-273230,2021-05-17,000001,Vente,718.43,,,VIGNES DE CHANTENAIS,B262,18250,18111,Humbligny,18,,,181110000E0421,,,,,,,,,,,,,0,,,,,T,terres,,,1310,2.69207,47.254737
2021-273600,2021-08-03,000001,Vente,245300,91,,LES CHOPARTS,B093,18250,18111,Humbligny,18,,,181110000E0148,,,,,,,,,,,,,0,1,Maison,151,4,S,sols,,,1290,2.692797,47.248061
2021-273600,2021-08-03,000001,Vente,245300,91,,LES CHOPARTS,B093,18250,18111,Humbligny,18,,,181110000E0148,,,,,,,,,,,,,0,3,Dépendance,,0,S,sols,,,1290,2.692797,47.248061
2021-273600,2021-08-03,000001,Vente,245300,,,LES CHOPARTS,B093,18250,18111,Humbligny,18,,,181110000E0513,,,,,,,,,,,,,0,,,,,P,prés,,,578,2.692957,47.248298
2021-273600,2021-08-03,000001,Vente,245300,,,LES CHOPARTS,B093,18250,18111,Humbligny,18,,,181110000E0517,,,,,,,,,,,,,0,,,,,T,terres,,,2030,2.692631,47.248198
2021-273600,2021-08-03,000001,Vente,245300,,,LES CHOPARTS,B093,18250,18111,Humbligny,18,,,181110000E0518,,,,,,,,,,,,,0,,,,,T,terres,,,28,2.69269,47.247913
