id_mutation,date_mutation,numero_disposition,nature_mutation,valeur_fonciere,adresse_numero,adresse_suffixe,adresse_nom_voie,adresse_code_voie,code_postal,code_commune,nom_commune,code_departement,ancien_code_commune,ancien_nom_commune,id_parcelle,ancien_id_parcelle,numero_volume,lot1_numero,lot1_surface_carrez,lot2_numero,lot2_surface_carrez,lot3_numero,lot3_surface_carrez,lot4_numero,lot4_surface_carrez,lot5_numero,lot5_surface_carrez,nombre_lots,code_type_local,type_local,surface_reelle_bati,nombre_pieces_principales,code_nature_culture,nature_culture,code_nature_culture_speciale,nature_culture_speciale,surface_terrain,longitude,latitude
2021-268840,2021-09-17,000001,Vente,52000,141,,CHE DES POIRIERS,0305,18250,18162,Neuilly-en-Sancerre,18,,,18162000ZH0081,,,,,,,,,,,,,0,1,Maison,53,2,S,sols,,,142,2.655763,47.311331
2021-268840,2021-09-17,000001,Vente,52000,141,,CHE DES POIRIERS,0305,18250,18162,Neuilly-en-Sancerre,18,,,18162000ZH0081,,,,,,,,,,,,,0,3,Dépendance,,0,S,sols,,,142,2.655763,47.311331
2021-268840,2021-09-17,000001,Vente,52000,141,,CHE DES POIRIERS,0305,18250,18162,Neuilly-en-Sancerre,18,,,18162000ZH0081,,,,,,,,,,,,,0,1,Maison,53,2,T,terres,,,732,2.655763,47.311331
2021-268840,2021-09-17,000001,Vente,52000,141,,CHE DES POIRIERS,0305,18250,18162,Neuilly-en-Sancerre,18,,,18162000ZH0081,,,,,,,,,,,,,0,3,Dépendance,,0,T,terres,,,732,2.655763,47.311331
2021-269236,2021-09-27,000001,Vente,504410,,,BOIS PINARD,B026,18250,18162,Neuilly-en-Sancerre,18,,,181620000C0279,,,,,,,,,,,,,0,,,,,T,terres,,,4080,2.673879,47.293491
2021-269236,2021-09-27,000001,Vente,504410,126,,BOIS PINARD,B026,18250,18162,Neuilly-en-Sancerre,18,,,181620000C0280,,,,,,,,,,,,,0,1,Maison,180,5,S,sols,,,1080,2.67391,47.293777
2021-269236,2021-09-27,000001,Vente,504410,,,BOIS PINARD,B026,18250,18162,Neuilly-en-Sancerre,18,,,181620000C0282,,,,,,,,,,,,,0,,,,,J,jardins,,,682,2.674538,47.293438
2021-269236,2021-09-27,000001,Vente,504410,,,LE PARC,B247,18250,18162,Neuilly-en-Sancerre,18,,,181620000C0977,,,,,,,,,,,,,0,,,,,T,terres,,,8636,2.67349,47.294115
2021-269236,2021-09-27,000001,Vente,504410,336,,CHE DE L AVOINERIE,0010,18250,18162,Neuilly-en-Sancerre,18,,,181620000C0979,,,,,,,,,,,,,0,4,Local industriel. commercial ou assimilé,270,0,S,sols,,,1344,2.6744,47.293822
2021-269236,2021-09-27,000001,Vente,504410,,,L AVOINERIE,B008,18250,18162,Neuilly-en-Sancerre,18,,,181620000C0981,,,,,,,,,,,,,0,,,,,T,terres,,,155,2.674422,47.293977
2021-269236,2021-09-27,000001,Vente,504410,,,BOIS PINARD,B026,18250,18162,Neuilly-en-Sancerre,18,,,181620000C0983,,,,,,,,,,,,,0,,,,,T,terres,,,1771,2.67443,47.293093
2021-269488,2021-09-30,000001,Vente,1500,,,LES PETITS,B265,18250,18162,Neuilly-en-Sancerre,18,,,18162000ZH0066,,,,,,,,,,,,,0,,,,,J,jardins,,,402,2.654834,47.311979
2021-269488,2021-09-30,000001,Vente,1500,,,LES PETITS,B265,18250,18162,Neuilly-en-Sancerre,18,,,18162000ZH0069,,,,,,,,,,,,,0,,,,,P,prés,,,455,2.654766,47.311812
2021-269913,2021-10-20,000001,Vente,20000,70,,RUE DU LAVOIR,0225,18250,18162,Neuilly-en-Sancerre,18,,,18162000AB0087,,,,,,,,,,,,,0,1,Maison,80,4,S,sols,,,554,2.686814,47.303021
2021-269913,2021-10-20,000001,Vente,20000,22,,LE BOURG,B034,18250,18162,Neuilly-en-Sancerre,18,,,18162000AB0088,,,,,,,,,,,,,0,3,Dépendance,,0,S,sols,,,88,2.686883,47.303089
2021-269913,2021-10-20,000001,Vente,20000,,,LE BOURG,B034,18250,18162,Neuilly-en-Sancerre,18,,,18162000AB0089,,,,,,,,,,,,,0,,,,,S,sols,,,12,2.686858,47.303124
2021-269913,2021-10-20,000001,Vente,20000,,,LE BOURG,B034,18250,18162,Neuilly-en-Sancerre,18,,,18162000AB0090,,,,,,,,,,,,,0,,,,,S,sols,,,1,2.686929,47.303151
2021-269913,2021-10-20,000001,Vente,20000,,,LE BOURG,B034,18250,18162,Neuilly-en-Sancerre,18,,,18162000AB0091,,,,,,,,,,,,,0,,,,,J,jardins,,,143,2.686858,47.303181
2021-270630,2021-11-29,000001,Vente,120000,,,CHAMP CAPITAINE,B057,18250,18162,Neuilly-en-Sancerre,18,,,181620000A0316,,,,,,,,,,,,,0,,,,,BS,taillis sous futaie,,,11930,2.665911,47.308915
2021-270630,2021-11-29,000001,Vente,120000,,,CHAMP CAPITAINE,B057,18250,18162,Neuilly-en-Sancerre,18,,,181620000A0316,,,,,,,,,,,,,0,,,,,BS,taillis sous futaie,,,11930,2.665911,47.308915
2021-270630,2021-11-29,000001,Vente,120000,,,LES FLAGOTTERIES,B174,18250,18162,Neuilly-en-Sancerre,18,,,181620000A0317,,,,,,,,,,,,,0,,,,,BS,taillis sous futaie,,,31340,2.66722,47.31187
2021-270630,2021-11-29,000001,Vente,120000,,,TAILLE DE LA CURE,B355,18250,18162,Neuilly-en-Sancerre,18,,,181620000A0323,,,,,,,,,,,,,0,,,,,BS,taillis sous futaie,,,32820,2.664305,47.310011
2021-270630,2021-11-29,000001,Vente,120000,,,TAILLE DE LA CURE,B355,18250,18162,Neuilly-en-Sancerre,18,,,181620000A0323,,,,,,,,,,,,,0,,,,,BS,taillis sous futaie,,,32820,2.664305,47.310011
2021-270630,2021-11-29,000001,Vente,120000,,,TAILLE DES PLAUDINS,B358,18250,18162,Neuilly-en-Sancerre,18,,,181620000A0328,,,,,,,,,,,,,0,,,,,BS,taillis sous futaie,,,39080,2.66155,47.310123
2021-270731,2021-12-10,000001,Vente,99747,,,LE BOURG,B034,18250,18162,Neuilly-en-Sancerre,18,,,18162000AB0052,,,,,,,,,,,,,0,,,,,VE,vergers,,,795,2.685269,47.302907
2021-270731,2021-12-10,000001,Vente,99747,65,,LE BOURG,B034,18250,18162,Neuilly-en-Sancerre,18,,,18162000AB0053,,,,,,,,,,,,,0,3,Dépendance,,0,S,sols,,,18,2.685443,47.302892
2021-270731,2021-12-10,000001,Vente,99747,,,LE BOURG,B034,18250,18162,Neuilly-en-Sancerre,18,,,18162000AB0054,,,,,,,,,,,,,0,,,,,J,jardins,,,747,2.685623,47.302772
2021-270731,2021-12-10,000001,Vente,99747,12,,RTE D HENRICHEMONT,0210,18250,18162,Neuilly-en-Sancerre,18,,,18162000AB0055,,,,,,,,,,,,,0,1,Maison,217,6,S,sols,,,542,2.685901,47.30273
2021-270957,2021-12-17,000001,Vente,150000,,,LES FERTIS,B172,18250,18162,Neuilly-en-Sancerre,18,,,18162000ZE0036,,,,,,,,,,,,,0,,,,,T,terres,,,15320,2.665655,47.303694
2021-270957,2021-12-17,000001,Vente,150000,,,PRES D EN HAUT,B322,18250,18162,Neuilly-en-Sancerre,18,,,18162000ZE0037,,,,,,,,,,,,,0,,,,,T,terres,,,10340,2.664193,47.304938
2021-270957,2021-12-17,000001,Vente,150000,,,PRES D EN HAUT,B322,18250,18162,Neuilly-en-Sancerre,18,,,18162000ZE0037,,,,,,,,,,,,,0,,,,,T,terres,,,31020,2.664193,47.304938
2021-270957,2021-12-17,000001,Vente,150000,,,PRES D EN HAUT,B322,18250,18162,Neuilly-en-Sancerre,18,,,18162000ZE0038,,,,,,,,,,,,,0,,,,,P,prés,,,11560,2.666554,47.305493
2021-270957,2021-12-17,000001,Vente,150000,,,PRES D EN HAUT,B322,18250,18162,Neuilly-en-Sancerre,18,,,18162000ZE0038,,,,,,,,,,,,,0,,,,,P,prés,,,23120,2.666554,47.305493
2021-270957,2021-12-17,000001,Vente,150000,,,LA FRELERIE,B182,18250,18162,Neuilly-en-Sancerre,18,,,18162000ZH0015,,,,,,,,,,,,,0,,,,,P,prés,,,26380,2.661176,47.301854
2021-270957,2021-12-17,000001,Vente,150000,,,LA FRELERIE,B182,18250,18162,Neuilly-en-Sancerre,18,,,18162000ZH0015,,,,,,,,,,,,,0,,,,,T,terres,,,5902,2.661176,47.301854
2021-270957,2021-12-17,000001,Vente,150000,,,LA FRELERIE,B182,18250,18162,Neuilly-en-Sancerre,18,,,18162000ZH0015,,,,,,,,,,,,,0,,,,,S,sols,,,42,2.661176,47.301854
2021-270957,2021-12-17,000001,Vente,150000,,,LA FRELERIE,B182,18250,18162,Neuilly-en-Sancerre,18,,,18162000ZH0015,,,,,,,,,,,,,0,,,,,P,prés,,,13190,2.661176,47.301854
2021-270957,2021-12-17,000001,Vente,150000,,,LA FRELERIE,B182,18250,18162,Neuilly-en-Sancerre,18,,,18162000ZH0015,,,,,,,,,,,,,0,,,,,T,terres,,,11806,2.661176,47.301854
2021-270957,2021-12-17,000001,Vente,150000,441,,CHE DU BOIS BROSSARD,0035,18250,18162,Neuilly-en-Sancerre,18,,,18162000ZH0034,,,,,,,,,,,,,0,1,Maison,60,2,P,prés,,,12490,2.663705,47.30317
2021-270957,2021-12-17,000001,Vente,150000,441,,CHE DU BOIS BROSSARD,0035,18250,18162,Neuilly-en-Sancerre,18,,,18162000ZH0034,,,,,,,,,,,,,0,3,Dépendance,,0,P,prés,,,12490,2.663705,47.30317
2021-270957,2021-12-17,000001,Vente,150000,441,,CHE DU BOIS BROSSARD,0035,18250,18162,Neuilly-en-Sancerre,18,,,18162000ZH0034,,,,,,,,,,,,,0,3,Dépendance,,0,BS,taillis sous futaie,,,26000,2.663705,47.30317
2021-270957,2021-12-17,000001,Vente,150000,441,,CHE DU BOIS BROSSARD,0035,18250,18162,Neuilly-en-Sancerre,18,,,18162000ZH0034,,,,,,,,,,,,,0,1,Maison,60,2,P,prés,,,4090,2.663705,47.30317
2021-270957,2021-12-17,000001,Vente,150000,441,,CHE DU BOIS BROSSARD,0035,18250,18162,Neuilly-en-Sancerre,18,,,18162000ZH0034,,,,,,,,,,,,,0,3,Dépendance,,0,P,prés,,,4090,2.663705,47.30317
2021-270957,2021-12-17,000001,Vente,150000,441,,CHE DU BOIS BROSSARD,0035,18250,18162,Neuilly-en-Sancerre,18,,,18162000ZH0034,,,,,,,,,,,,,0,1,Maison,60,2,S,sols,,,1293,2.663705,47.30317
2021-270957,2021-12-17,000001,Vente,150000,441,,CHE DU BOIS BROSSARD,0035,18250,18162,Neuilly-en-Sancerre,18,,,18162000ZH0034,,,,,,,,,,,,,0,3,Dépendance,,0,BS,taillis sous futaie,,,26000,2.663705,47.30317
2021-270957,2021-12-17,000001,Vente,150000,441,,CHE DU BOIS BROSSARD,0035,18250,18162,Neuilly-en-Sancerre,18,,,18162000ZH0034,,,,,,,,,,,,,0,1,Maison,60,2,BS,taillis sous futaie,,,26000,2.663705,47.30317
2021-270957,2021-12-17,000001,Vente,150000,441,,CHE DU BOIS BROSSARD,0035,18250,18162,Neuilly-en-Sancerre,18,,,18162000ZH0034,,,,,,,,,,,,,0,3,Dépendance,,0,P,prés,,,7790,2.663705,47.30317
2021-270957,2021-12-17,000001,Vente,150000,441,,CHE DU BOIS BROSSARD,0035,18250,18162,Neuilly-en-Sancerre,18,,,18162000ZH0034,,,,,,,,,,,,,0,3,Dépendance,,0,P,prés,,,7790,2.663705,47.30317
2021-270957,2021-12-17,000001,Vente,150000,441,,CHE DU BOIS BROSSARD,0035,18250,18162,Neuilly-en-Sancerre,18,,,18162000ZH0034,,,,,,,,,,,,,0,1,Maison,60,2,P,prés,,,7790,2.663705,47.30317
2021-270957,2021-12-17,000001,Vente,150000,441,,CHE DU BOIS BROSSARD,0035,18250,18162,Neuilly-en-Sancerre,18,,,18162000ZH0034,,,,,,,,,,,,,0,3,Dépendance,,0,P,prés,,,12490,2.663705,47.30317
2021-270957,2021-12-17,000001,Vente,150000,441,,CHE DU BOIS BROSSARD,0035,18250,18162,Neuilly-en-Sancerre,18,,,18162000ZH0034,,,,,,,,,,,,,0,3,Dépendance,,0,P,prés,,,4090,2.663705,47.30317
2021-270957,2021-12-17,000001,Vente,150000,441,,CHE DU BOIS BROSSARD,0035,18250,18162,Neuilly-en-Sancerre,18,,,18162000ZH0034,,,,,,,,,,,,,0,3,Dépendance,,0,S,sols,,,1293,2.663705,47.30317
2021-270957,2021-12-17,000001,Vente,150000,441,,CHE DU BOIS BROSSARD,0035,18250,18162,Neuilly-en-Sancerre,18,,,18162000ZH0034,,,,,,,,,,,,,0,3,Dépendance,,0,S,sols,,,1293,2.663705,47.30317
2021-270957,2021-12-17,000001,Vente,150000,,,LES SIMONETTES,B349,18250,18162,Neuilly-en-Sancerre,18,,,18162000ZH0035,,,,,,,,,,,,,0,,,,,BS,taillis sous futaie,,,15335,2.663004,47.301048
2021-270957,2021-12-17,000001,Vente,150000,,,LES PETITES SIMONETTES,B264,18250,18162,Neuilly-en-Sancerre,18,,,18162000ZH0036,,,,,,,,,,,,,0,,,,,T,terres,,,2760,2.661884,47.300352
2021-271446,2021-11-10,000001,Adjudication,21000,,,LES CHATELETS,B144,18250,18162,Neuilly-en-Sancerre,18,,,18162000ZM0049,,,,,,,,,,,,,0,,,,,T,terres,,,59,2.621571,47.304934
2021-271446,2021-11-10,000001,Adjudication,21000,5544,,RTE D HENRICHEMONT,0210,18250,18162,Neuilly-en-Sancerre,18,,,18162000ZM0050,,,,,,,,,,,,,0,1,Maison,60,2,S,sols,,,424,2.621236,47.304761
2021-271446,2021-11-10,000001,Adjudication,21000,5544,,RTE D HENRICHEMONT,0210,18250,18162,Neuilly-en-Sancerre,18,,,18162000ZM0050,,,,,,,,,,,,,0,1,Maison,60,2,T,terres,,,1081,2.621236,47.304761
2021-271446,2021-11-10,000001,Adjudication,21000,,,LES CHATELETS,B144,18250,18162,Neuilly-en-Sancerre,18,,,18162000ZM0051,,,,,,,,,,,,,0,,,,,T,terres,,,860,2.620921,47.304527
2021-273168,2021-04-28,000001,Vente,22000,,,LES NIGAUTIERS,B237,18250,18162,Neuilly-en-Sancerre,18,,,18162000ZC0021,,,,,,,,,,,,,0,,,,,E,eaux,PECH,Etangs pêchables,1380,2.69321,47.302021
2021-273168,2021-04-28,000001,Vente,22000,,,LES NIGAUTIERS,B237,18250,18162,Neuilly-en-Sancerre,18,,,18162000ZC0021,,,,,,,,,,,,,0,,,,,P,prés,,,840,2.69321,47.302021
2021-273168,2021-04-28,000001,Vente,22000,,,LES NIGAUTIERS,B237,18250,18162,Neuilly-en-Sancerre,18,,,18162000ZC0036,,,,,,,,,,,,,0,,,,,E,eaux,PECH,Etangs pêchables,460,2.693483,47.301966
2021-273168,2021-04-28,000001,Vente,22000,,,LES NIGAUTIERS,B237,18250,18162,Neuilly-en-Sancerre,18,,,18162000ZC0036,,,,,,,,,,,,,0,,,,,P,prés,,,747,2.693483,47.301966
2021-273271,2021-05-25,000001,Vente,70000,48,,CHE DU CHAMP BEAUPIED,0085,18250,18162,Neuilly-en-Sancerre,18,,,181620000C1003,,,,,,,,,,,,,0,1,Maison,70,3,S,sols,,,500,2.670263,47.292136
2021-273271,2021-05-25,000001,Vente,70000,48,,CHE DU CHAMP BEAUPIED,0085,18250,18162,Neuilly-en-Sancerre,18,,,181620000C1003,,,,,,,,,,,,,0,3,Dépendance,,0,J,jardins,,,604,2.670263,47.292136
2021-273271,2021-05-25,000001,Vente,70000,48,,CHE DU CHAMP BEAUPIED,0085,18250,18162,Neuilly-en-Sancerre,18,,,181620000C1003,,,,,,,,,,,,,0,1,Maison,70,3,J,jardins,,,604,2.670263,47.292136
2021-273271,2021-05-25,000001,Vente,70000,48,,CHE DU CHAMP BEAUPIED,0085,18250,18162,Neuilly-en-Sancerre,18,,,181620000C1003,,,,,,,,,,,,,0,3,Dépendance,,0,S,sols,,,500,2.670263,47.292136
2021-273572,2021-07-23,000001,Vente,15000,23,,IMP DES CHAMPS SORRES,0115,18250,18162,Neuilly-en-Sancerre,18,,,18162000ZB0017,,,,,,,,,,,,,0,1,Maison,40,3,T,terres,,,3115,2.676251,47.316867
2021-273572,2021-07-23,000001,Vente,15000,23,,IMP DES CHAMPS SORRES,0115,18250,18162,Neuilly-en-Sancerre,18,,,18162000ZB0017,,,,,,,,,,,,,0,1,Maison,40,3,S,sols,,,45,2.676251,47.316867
2021-273589,2021-07-20,000001,Vente,112220,233,,CHE DES TERTOUS,0400,18250,18162,Neuilly-en-Sancerre,18,,,181620000B0165,,,,,,,,,,,,,0,3,Dépendance,,0,S,sols,,,832,2.682273,47.307052
2021-273589,2021-07-20,000001,Vente,112220,233,,CHE DES TERTOUS,0400,18250,18162,Neuilly-en-Sancerre,18,,,181620000B0165,,,,,,,,,,,,,0,1,Maison,85,4,S,sols,,,832,2.682273,47.307052
