id_mutation,date_mutation,numero_disposition,nature_mutation,valeur_fonciere,adresse_numero,adresse_suffixe,adresse_nom_voie,adresse_code_voie,code_postal,code_commune,nom_commune,code_departement,ancien_code_commune,ancien_nom_commune,id_parcelle,ancien_id_parcelle,numero_volume,lot1_numero,lot1_surface_carrez,lot2_numero,lot2_surface_carrez,lot3_numero,lot3_surface_carrez,lot4_numero,lot4_surface_carrez,lot5_numero,lot5_surface_carrez,nombre_lots,code_type_local,type_local,surface_reelle_bati,nombre_pieces_principales,code_nature_culture,nature_culture,code_nature_culture_speciale,nature_culture_speciale,surface_terrain,longitude,latitude
2021-265452,2021-02-13,000001,Vente,188910,24,,RTE DE VIGNOUX,0200,18220,18253,Soulangis,18,,,18253000ZD0123,,,,,,,,,,,,,0,1,Maison,93,3,S,sols,,,500,2.509255,47.188048
2021-265452,2021-02-13,000001,Vente,188910,24,,RTE DE VIGNOUX,0200,18220,18253,Soulangis,18,,,18253000ZD0123,,,,,,,,,,,,,0,1,Maison,93,3,AG,terrains d'agrément,,,760,2.509255,47.188048
2021-266746,2021-05-29,000001,Vente,204625,9,B,RTE JACQUES COEUR,0070,18220,18253,Soulangis,18,,,18253000ZK0148,,,,,,,,,,,,,0,1,Maison,145,6,AG,terrains d'agrément,,,1605,2.532114,47.174579
2021-266746,2021-05-29,000001,Vente,204625,9,B,RTE JACQUES COEUR,0070,18220,18253,Soulangis,18,,,18253000ZK0148,,,,,,,,,,,,,0,1,Maison,145,6,S,sols,,,500,2.532114,47.174579
2021-267249,2021-07-07,000001,Vente,15000,,,VILLAGE DU BOIS DE VEVES,B134,18220,18253,Soulangis,18,,,18253000AA0048,,,,,,,,,,,,,0,,,,,S,sols,,,681,2.498822,47.189939
2021-267249,2021-07-07,000001,Vente,15000,50,,RTE DE VIGNOUX,0200,18220,18253,Soulangis,18,,,18253000AA0103,,,,,,,,,,,,,0,,,,,T,terres,,,10726,2.494862,47.189263
2021-267249,2021-07-07,000001,Vente,15000,,,LES CHETIFS BOIS,B047,18220,18253,Soulangis,18,,,18253000ZC0037,,,,,,,,,,,,,0,,,,,BS,taillis sous futaie,,,5750,2.498567,47.193296
2021-267249,2021-07-07,000001,Vente,15000,,,LES CRIATS,B055,18220,18253,Soulangis,18,,,18253000ZO0008,,,,,,,,,,,,,0,,,,,T,terres,,,18500,2.503711,47.182698
2021-268221,2021-08-25,000001,Vente,120100,24,,RTE DE L ORME ENSEIGNE,0100,18220,18253,Soulangis,18,,,18253000AB0072,,,,,,,,,,,,,0,1,Maison,96,5,S,sols,,,502,2.502504,47.186727
2021-268221,2021-08-25,000001,Vente,120100,24,,RTE DE L ORME ENSEIGNE,0100,18220,18253,Soulangis,18,,,18253000AB0072,,,,,,,,,,,,,0,1,Maison,96,5,J,jardins,,,965,2.502504,47.186727
2021-268261,2021-09-03,000001,Vente,183000,1,,IMP DES ACACIAS,0005,18220,18253,Soulangis,18,,,18253000AA0055,,,,,,,,,,,,,0,3,Dépendance,,0,S,sols,,,790,2.498272,47.189186
2021-268261,2021-09-03,000001,Vente,183000,1,,IMP DES ACACIAS,0005,18220,18253,Soulangis,18,,,18253000AA0055,,,,,,,,,,,,,0,3,Dépendance,,0,S,sols,,,790,2.498272,47.189186
2021-268261,2021-09-03,000001,Vente,183000,1,,IMP DES ACACIAS,0005,18220,18253,Soulangis,18,,,18253000AA0055,,,,,,,,,,,,,0,1,Maison,90,5,S,sols,,,790,2.498272,47.189186
2021-268261,2021-09-03,000001,Vente,183000,1,,IMP DES ACACIAS,0005,18220,18253,Soulangis,18,,,18253000AA0055,,,,,,,,,,,,,0,3,Dépendance,,0,S,sols,,,790,2.498272,47.189186
2021-268290,2021-09-06,000001,Vente,11000,,,LES CHAMBARBOTS,B015,18220,18253,Soulangis,18,,,18253000ZC0001,,,,,,,,,,,,,0,,,,,T,terres,,,6480,2.498163,47.19791
2021-268290,2021-09-06,000001,Vente,11000,,,LES CHAMBARBOTS,B015,18220,18253,Soulangis,18,,,18253000ZC0002,,,,,,,,,,,,,0,,,,,T,terres,,,10620,2.497534,47.197233
2021-268290,2021-09-06,000001,Vente,11000,,,LES CHETIFS BOIS,B047,18220,18253,Soulangis,18,,,18253000ZC0032,,,,,,,,,,,,,0,,,,,BS,taillis sous futaie,,,3050,2.49776,47.196824
2021-268315,2021-09-09,000001,Vente,3000,2,,IMP DU LAVOIR,0080,18220,18253,Soulangis,18,,,18253000AC0080,,,,,,,,,,,,,0,1,Maison,59,4,S,sols,,,197,2.515592,47.187555
2021-268315,2021-09-09,000001,Vente,3000,2,,IMP DU LAVOIR,0080,18220,18253,Soulangis,18,,,18253000AC0080,,,,,,,,,,,,,0,3,Dépendance,,0,S,sols,,,197,2.515592,47.187555
2021-268315,2021-09-09,000001,Vente,3000,2,,IMP DU LAVOIR,0080,18220,18253,Soulangis,18,,,18253000AC0080,,,,,,,,,,,,,0,3,Dépendance,,0,S,sols,,,197,2.515592,47.187555
2021-268316,2021-09-09,000002,Vente,47000,,,BOURG DE SOULANGIS,B010,18220,18253,Soulangis,18,,,18253000AC0058,,,,,,,,,,,,,0,,,,,J,jardins,,,1681,2.514926,47.187631
2021-268316,2021-09-09,000002,Vente,47000,4,,IMP DU LAVOIR,0080,18220,18253,Soulangis,18,,,18253000AC0081,,,,,,,,,,,,,0,1,Maison,38,2,S,sols,,,326,2.51573,47.187458
2021-269469,2021-10-20,000002,Vente,97000,2,,RTE DU GENETOIS,0055,18220,18253,Soulangis,18,,,18253000ZH0125,,,,,,,,,,,,,0,1,Maison,108,3,,,,,,2.532051,47.181235
