id_mutation,date_mutation,numero_disposition,nature_mutation,valeur_fonciere,adresse_numero,adresse_suffixe,adresse_nom_voie,adresse_code_voie,code_postal,code_commune,nom_commune,code_departement,ancien_code_commune,ancien_nom_commune,id_parcelle,ancien_id_parcelle,numero_volume,lot1_numero,lot1_surface_carrez,lot2_numero,lot2_surface_carrez,lot3_numero,lot3_surface_carrez,lot4_numero,lot4_surface_carrez,lot5_numero,lot5_surface_carrez,nombre_lots,code_type_local,type_local,surface_reelle_bati,nombre_pieces_principales,code_nature_culture,nature_culture,code_nature_culture_speciale,nature_culture_speciale,surface_terrain,longitude,latitude
2021-269512,2021-10-21,000001,Vente,68919,10,,RTE DE LA BRANDE,0005,18160,18283,Villecelin,18,,,18283000ZA0079,,,,,,,,,,,,,0,1,Maison,66,4,S,sols,,,880,2.179542,46.824751
2021-269512,2021-10-21,000001,Vente,68919,10,,RTE DE LA BRANDE,0005,18160,18283,Villecelin,18,,,18283000ZA0079,,,,,,,,,,,,,0,1,Maison,66,4,J,jardins,,,1260,2.179542,46.824751
2021-272272,2021-05-21,000001,Vente,244000,,,LES CRES,B015,18160,18283,Villecelin,18,,,18283000ZC0053,,,,,,,,,,,,,0,,,,,S,sols,,,601,2.202101,46.820457
2021-272272,2021-05-21,000001,Vente,244000,,,PRAIRIE DE BEAUVOIR,B023,18160,18283,Villecelin,18,,,18283000ZE0049,,,,,,,,,,,,,0,,,,,P,prés,,,3668,2.202264,46.820173
2021-272272,2021-05-21,000001,Vente,244000,,,PRAIRIE DE BEAUVOIR,B023,18160,18283,Villecelin,18,,,18283000ZE0049,,,,,,,,,,,,,0,,,,,E,eaux,PECH,Etangs pêchables,3850,2.202264,46.820173
2021-272272,2021-05-21,000001,Vente,244000,,,PRAIRIE DE BEAUVOIR,B023,18160,18283,Villecelin,18,,,18283000ZE0054,,,,,,,,,,,,,0,,,,,P,prés,,,249,2.202867,46.820076
2021-272272,2021-05-21,000001,Vente,244000,14,,HAM DE BEAUVOIR,A001,18160,18283,Villecelin,18,,,18283000ZE0056,,,,,,,,,,,,,0,3,Dépendance,,0,S,sols,,,1653,2.20303,46.820492
2021-272272,2021-05-21,000001,Vente,244000,14,,HAM DE BEAUVOIR,A001,18160,18283,Villecelin,18,,,18283000ZE0056,,,,,,,,,,,,,0,3,Dépendance,,0,S,sols,,,1653,2.20303,46.820492
2021-272272,2021-05-21,000001,Vente,244000,14,,HAM DE BEAUVOIR,A001,18160,18283,Villecelin,18,,,18283000ZE0056,,,,,,,,,,,,,0,3,Dépendance,,0,S,sols,,,1653,2.20303,46.820492
2021-272272,2021-05-21,000001,Vente,244000,14,,HAM DE BEAUVOIR,A001,18160,18283,Villecelin,18,,,18283000ZE0056,,,,,,,,,,,,,0,1,Maison,260,4,S,sols,,,1653,2.20303,46.820492
2021-272337,2021-06-24,000001,Vente,20000,,,LA BRANDE,B007,18160,18283,Villecelin,18,,,18283000ZB0048,,,,,,,,,,,,,0,,,,,P,prés,,,1503,2.181815,46.823026
2021-272337,2021-06-24,000001,Vente,20000,,,LA BRANDE,B007,18160,18283,Villecelin,18,,,18283000ZB0050,,,,,,,,,,,,,0,,,,,P,prés,,,345,2.182045,46.823138
2021-272337,2021-06-24,000001,Vente,20000,30,A,LA BRANDE,B007,18160,18283,Villecelin,18,,,18283000ZB0052,,,,,,,,,,,,,0,1,Maison,70,2,S,sols,,,420,2.181841,46.822833
2021-272337,2021-06-24,000001,Vente,20000,30,A,LA BRANDE,B007,18160,18283,Villecelin,18,,,18283000ZB0052,,,,,,,,,,,,,0,1,Maison,70,2,J,jardins,,,732,2.181841,46.822833
2021-272353,2021-06-02,000002,Echange,168000,,,LAUZON,B019,18160,18283,Villecelin,18,,,182830000B0364,,,,,,,,,,,,,0,,,,,T,terres,,,351,2.231865,46.829387
2021-272353,2021-06-02,000003,Echange,168000,,,GRANDE CHAUME,B017,18160,18283,Villecelin,18,,,18283000ZD0005,,,,,,,,,,,,,0,,,,,T,terres,,,55773,2.223092,46.823649
2021-272353,2021-06-02,000003,Echange,168000,,,GRANDE CHAUME,B017,18160,18283,Villecelin,18,,,18283000ZD0005,,,,,,,,,,,,,0,,,,,T,terres,,,111547,2.223092,46.823649
2021-272353,2021-06-02,000003,Echange,168000,,,LA BREUILLE,B011,18160,18283,Villecelin,18,,,18283000ZI0004,,,,,,,,,,,,,0,,,,,T,terres,,,47300,2.225165,46.822808
2021-272563,2021-07-26,000001,Vente,120000,9011,F,LA BRANDE,B007,18160,18283,Villecelin,18,,,18283000ZB0011,,,,,,,,,,,,,0,3,Dépendance,,0,T,terres,,,6080,2.183308,46.825767
2021-272563,2021-07-26,000001,Vente,120000,9011,F,LA BRANDE,B007,18160,18283,Villecelin,18,,,18283000ZB0011,,,,,,,,,,,,,0,3,Dépendance,,0,T,terres,,,6080,2.183308,46.825767
2021-272563,2021-07-26,000001,Vente,120000,9011,F,LA BRANDE,B007,18160,18283,Villecelin,18,,,18283000ZB0011,,,,,,,,,,,,,0,3,Dépendance,,0,S,sols,,,1000,2.183308,46.825767
2021-272563,2021-07-26,000001,Vente,120000,9011,F,LA BRANDE,B007,18160,18283,Villecelin,18,,,18283000ZB0011,,,,,,,,,,,,,0,3,Dépendance,,0,S,sols,,,1000,2.183308,46.825767
2021-272563,2021-07-26,000001,Vente,120000,9011,F,LA BRANDE,B007,18160,18283,Villecelin,18,,,18283000ZB0011,,,,,,,,,,,,,0,3,Dépendance,,0,S,sols,,,1000,2.183308,46.825767
2021-272563,2021-07-26,000001,Vente,120000,9011,F,LA BRANDE,B007,18160,18283,Villecelin,18,,,18283000ZB0011,,,,,,,,,,,,,0,3,Dépendance,,0,T,terres,,,6080,2.183308,46.825767
2021-272563,2021-07-26,000001,Vente,120000,34,,LA BRANDE,B007,18160,18283,Villecelin,18,,,18283000ZB0044,,,,,,,,,,,,,0,1,Maison,86,1,S,sols,,,210,2.182767,46.82595
2021-272563,2021-07-26,000001,Vente,120000,34,,LA BRANDE,B007,18160,18283,Villecelin,18,,,18283000ZB0044,,,,,,,,,,,,,0,1,Maison,86,1,J,jardins,,,510,2.182767,46.82595
2021-272563,2021-07-26,000001,Vente,120000,34,,LA BRANDE,B007,18160,18283,Villecelin,18,,,18283000ZB0044,,,,,,,,,,,,,0,1,Maison,86,1,T,terres,,,805,2.182767,46.82595
2021-272563,2021-07-26,000001,Vente,120000,,,LA BRANDE,B007,18160,18283,Villecelin,18,,,18283000ZB0064,,,,,,,,,,,,,0,,,,,VI,vignes,,,56,2.182761,46.825792
2021-272563,2021-07-26,000001,Vente,120000,5,,RTE DE LA BRANDE,0005,18160,18283,Villecelin,18,,,18283000ZB0066,,,,,,,,,,,,,0,,,,,S,sols,,,15,2.182781,46.825711
