id_mutation,date_mutation,numero_disposition,nature_mutation,valeur_fonciere,adresse_numero,adresse_suffixe,adresse_nom_voie,adresse_code_voie,code_postal,code_commune,nom_commune,code_departement,ancien_code_commune,ancien_nom_commune,id_parcelle,ancien_id_parcelle,numero_volume,lot1_numero,lot1_surface_carrez,lot2_numero,lot2_surface_carrez,lot3_numero,lot3_surface_carrez,lot4_numero,lot4_surface_carrez,lot5_numero,lot5_surface_carrez,nombre_lots,code_type_local,type_local,surface_reelle_bati,nombre_pieces_principales,code_nature_culture,nature_culture,code_nature_culture_speciale,nature_culture_speciale,surface_terrain,longitude,latitude
2021-281758,2021-02-01,000001,Vente,163650,21,,RUE RENAUD,0300,21320,21062,Bellenot-sous-Pouilly,21,,,21062000AA0018,,,,,,,,,,,,,0,1,Maison,187,4,S,sols,,,367,4.549161,47.286278
2021-281758,2021-02-01,000001,Vente,163650,21,,RUE RENAUD,0300,21320,21062,Bellenot-sous-Pouilly,21,,,21062000AA0018,,,,,,,,,,,,,0,3,Dépendance,,0,S,sols,,,367,4.549161,47.286278
2021-282817,2021-03-01,000001,Vente,55000,17,,RUE HAUTE,0130,21320,21062,Bellenot-sous-Pouilly,21,,,21062000AA0057,,,,,,,,,,,,,0,1,Maison,105,3,S,sols,,,476,4.552303,47.286656
2021-282817,2021-03-01,000001,Vente,55000,,,LE VILLAGE,B147,21320,21062,Bellenot-sous-Pouilly,21,,,21062000AA0058,,,,,,,,,,,,,0,,,,,T,terres,,,175,4.552203,47.28669
2021-286498,2021-05-17,000001,Vente,120000,8,,RUE RENAUD,0300,21320,21062,Bellenot-sous-Pouilly,21,,,21062000ZD0097,,,,,,,,,,,,,0,3,Dépendance,,0,P,prés,,,1504,4.547678,47.28557
2021-286498,2021-05-17,000001,Vente,120000,8,,RUE RENAUD,0300,21320,21062,Bellenot-sous-Pouilly,21,,,21062000ZD0097,,,,,,,,,,,,,0,3,Dépendance,,0,S,sols,,,500,4.547678,47.28557
2021-286498,2021-05-17,000001,Vente,120000,8,,RUE RENAUD,0300,21320,21062,Bellenot-sous-Pouilly,21,,,21062000ZD0097,,,,,,,,,,,,,0,1,Maison,74,4,S,sols,,,500,4.547678,47.28557
2021-286498,2021-05-17,000001,Vente,120000,8,,RUE RENAUD,0300,21320,21062,Bellenot-sous-Pouilly,21,,,21062000ZD0097,,,,,,,,,,,,,0,1,Maison,74,4,P,prés,,,1504,4.547678,47.28557
2021-287128,2021-06-14,000001,Vente,184000,,,LE VILLAGE,B147,21320,21062,Bellenot-sous-Pouilly,21,,,21062000AB0064,,,,,,,,,,,,,0,,,,,S,sols,,,659,4.544727,47.281619
2021-287128,2021-06-14,000001,Vente,184000,1,,RUE BASSE,0045,21320,21062,Bellenot-sous-Pouilly,21,,,21062000AB0065,,,,,,,,,,,,,0,1,Maison,90,3,S,sols,,,257,4.544975,47.281704
2021-291181,2021-07-13,000002,Vente,110000,5,,RUE BASSE,0045,21320,21062,Bellenot-sous-Pouilly,21,,,21062000AB0045,,,,,,,,,,,,,0,1,Maison,84,3,S,sols,,,894,4.544526,47.282009
2021-291181,2021-07-13,000002,Vente,110000,5,,RUE BASSE,0045,21320,21062,Bellenot-sous-Pouilly,21,,,21062000AB0045,,,,,,,,,,,,,0,3,Dépendance,,0,S,sols,,,894,4.544526,47.282009
2021-291181,2021-07-13,000002,Vente,110000,,,LE VILLAGE,B147,21320,21062,Bellenot-sous-Pouilly,21,,,21062000AB0048,,,,,,,,,,,,,0,,,,,J,jardins,,,253,4.544358,47.28183
2021-291181,2021-07-13,000002,Vente,110000,,,AUX EAUX DE L OUCHE,B054,21320,21062,Bellenot-sous-Pouilly,21,,,21062000ZC0077,,,,,,,,,,,,,0,,,,,P,prés,,,1264,4.544295,47.282152
2021-291876,2021-09-14,000001,Vente,250000,,,SOUS LES BOIS,B138,21320,21062,Bellenot-sous-Pouilly,21,,,21062000ZB0029,,,,,,,,,,,,,0,,,,,T,terres,,,11366,4.513987,47.286593
2021-291876,2021-09-14,000001,Vente,250000,,,SOUS LES BOIS,B138,21320,21062,Bellenot-sous-Pouilly,21,,,21062000ZB0029,,,,,,,,,,,,,0,,,,,T,terres,,,11367,4.513987,47.286593
2021-291876,2021-09-14,000001,Vente,250000,,,SOUS LES BOIS,B138,21320,21062,Bellenot-sous-Pouilly,21,,,21062000ZB0029,,,,,,,,,,,,,0,,,,,T,terres,,,11367,4.513987,47.286593
2021-291876,2021-09-14,000001,Vente,250000,,,SOUS LES BOIS,B138,21320,21062,Bellenot-sous-Pouilly,21,,,21062000ZB0030,,,,,,,,,,,,,0,,,,,T,terres,,,12750,4.515446,47.285975
2021-291876,2021-09-14,000001,Vente,250000,,,SOUS LES BOIS,B138,21320,21062,Bellenot-sous-Pouilly,21,,,21062000ZB0031,,,,,,,,,,,,,0,,,,,T,terres,,,22980,4.513891,47.284249
2021-291876,2021-09-14,000001,Vente,250000,,,SOUS LES BOIS,B138,21320,21062,Bellenot-sous-Pouilly,21,,,21062000ZB0031,,,,,,,,,,,,,0,,,,,T,terres,,,22980,4.513891,47.284249
2021-291876,2021-09-14,000001,Vente,250000,,,SOUS LES BOIS,B138,21320,21062,Bellenot-sous-Pouilly,21,,,21062000ZN0016,,,,,,,,,,,,,0,,,,,T,terres,,,8465,4.514363,47.280261
2021-291876,2021-09-14,000001,Vente,250000,,,SOUS LES BOIS,B138,21320,21062,Bellenot-sous-Pouilly,21,,,21062000ZN0017,,,,,,,,,,,,,0,,,,,T,terres,,,34255,4.513711,47.281639
2021-295089,2021-10-27,000001,Vente,744,,,LE GRAND PRE,B066,21320,21062,Bellenot-sous-Pouilly,21,,,210620000A0043,,,,,,,,,,,,,0,,,,,BS,taillis sous futaie,,,7440,4.520278,47.299128
2021-296250,2021-11-29,000001,Vente,225000,,,LE VILLAGE,B147,21320,21062,Bellenot-sous-Pouilly,21,,,21062000AB0082,,,,,,,,,,,,,0,,,,,S,sols,,,670,4.546125,47.280865
2021-296250,2021-11-29,000001,Vente,225000,13,,RTE DE POUILLY,0285,21320,21062,Bellenot-sous-Pouilly,21,,,21062000AB0084,,,,,,,,,,,,,0,1,Maison,180,4,S,sols,,,149,4.545949,47.281017
2021-296250,2021-11-29,000001,Vente,225000,,,LE VILLAGE,B147,21320,21062,Bellenot-sous-Pouilly,21,,,21062000AB0087,,,,,,,,,,,,,0,,,,,S,sols,,,38,4.54594,47.28116
