id_mutation,date_mutation,numero_disposition,nature_mutation,valeur_fonciere,adresse_numero,adresse_suffixe,adresse_nom_voie,adresse_code_voie,code_postal,code_commune,nom_commune,code_departement,ancien_code_commune,ancien_nom_commune,id_parcelle,ancien_id_parcelle,numero_volume,lot1_numero,lot1_surface_carrez,lot2_numero,lot2_surface_carrez,lot3_numero,lot3_surface_carrez,lot4_numero,lot4_surface_carrez,lot5_numero,lot5_surface_carrez,nombre_lots,code_type_local,type_local,surface_reelle_bati,nombre_pieces_principales,code_nature_culture,nature_culture,code_nature_culture_speciale,nature_culture_speciale,surface_terrain,longitude,latitude
2021-286877,2021-06-04,000001,Vente,20000,5094,,LE CLOSEAU,B061,21230,21274,Foissy,21,,,212740000D0495,,,,,,,,,,,,,0,4,Local industriel. commercial ou assimilé,192,0,L,landes,PATIS,Patis,1989,4.529045,47.121529
2021-286877,2021-06-04,000001,Vente,20000,5094,,LE CLOSEAU,B061,21230,21274,Foissy,21,,,212740000D0495,,,,,,,,,,,,,0,4,Local industriel. commercial ou assimilé,,0,L,landes,PATIS,Patis,1989,4.529045,47.121529
2021-289441,2021-06-28,000001,Vente,97000,,,LA MOLIERE,B140,21230,21274,Foissy,21,,,212740000D0480,,,,,,,,,,,,,0,,,,,T,terres,,,149300,4.535708,47.10303
2021-292831,2021-09-27,000002,Vente,70000,,,COME GUIGNAN,B065,21230,21274,Foissy,21,,,212740000D0453,,,,,,,,,,,,,0,,,,,BS,taillis sous futaie,,,13910,4.535145,47.110569
2021-292831,2021-09-27,000002,Vente,70000,,,COME GUIGNAN,B065,21230,21274,Foissy,21,,,212740000D0454,,,,,,,,,,,,,0,,,,,S,sols,,,50,4.533242,47.110023
2021-292831,2021-09-27,000002,Vente,70000,,,COME GUIGNAN,B065,21230,21274,Foissy,21,,,212740000D0579,,,,,,,,,,,,,0,,,,,PA,pâtures,,,10216,4.53481,47.110716
2021-292831,2021-09-27,000002,Vente,70000,,,COME GUIGNAN,B065,21230,21274,Foissy,21,,,212740000D0581,,,,,,,,,,,,,0,,,,,L,landes,PATIS,Patis,3360,4.536914,47.111128
2021-293743,2021-10-07,000001,Vente,13700,,,LA LOUERE,B135,21230,21274,Foissy,21,,,212740000D0139,,,,,,,,,,,,,0,,,,,T,terres,,,2330,4.525321,47.113643
