id_mutation,date_mutation,numero_disposition,nature_mutation,valeur_fonciere,adresse_numero,adresse_suffixe,adresse_nom_voie,adresse_code_voie,code_postal,code_commune,nom_commune,code_departement,ancien_code_commune,ancien_nom_commune,id_parcelle,ancien_id_parcelle,numero_volume,lot1_numero,lot1_surface_carrez,lot2_numero,lot2_surface_carrez,lot3_numero,lot3_surface_carrez,lot4_numero,lot4_surface_carrez,lot5_numero,lot5_surface_carrez,nombre_lots,code_type_local,type_local,surface_reelle_bati,nombre_pieces_principales,code_nature_culture,nature_culture,code_nature_culture_speciale,nature_culture_speciale,surface_terrain,longitude,latitude
2021-281648,2021-01-11,000001,Vente,1867,,,VAUMONT,B212,21430,21375,Manlay,21,,,213750000C0123,,,,,,,,,,,,,0,,,,,BR,futaies résineuses,,,2483,4.330774,47.107462
2021-281648,2021-01-11,000001,Vente,1867,,,COMME CHEVROTTE,B064,21430,21375,Manlay,21,,,213750000C0181,,,,,,,,,,,,,0,,,,,BR,futaies résineuses,,,628,4.331853,47.107481
2021-281648,2021-01-11,000001,Vente,1867,,,COMME CHEVROTTE,B064,21430,21375,Manlay,21,,,213750000C0182,,,,,,,,,,,,,0,,,,,T,terres,,,3614,4.331274,47.107203
2021-281648,2021-01-11,000001,Vente,1867,,,COMME CHEVROTTE,B064,21430,21375,Manlay,21,,,213750000C0183,,,,,,,,,,,,,0,,,,,BR,futaies résineuses,,,2403,4.330062,47.107158
2021-281648,2021-01-11,000001,Vente,1867,,,COMME CHEVROTTE,B064,21430,21375,Manlay,21,,,213750000C0184,,,,,,,,,,,,,0,,,,,T,terres,,,9550,4.33069,47.106652
2021-282639,2021-01-30,000001,Vente,30000,,,LA CUREE DES BORDES,B081,21430,21375,Manlay,21,,,213750000A0002,,,,,,,,,,,,,0,,,,,P,prés,,,14150,4.353559,47.135066
2021-282639,2021-01-30,000001,Vente,30000,,,LA CUREE DES BORDES,B081,21430,21375,Manlay,21,,,213750000A0341,,,,,,,,,,,,,0,,,,,P,prés,,,18273,4.351856,47.135033
2021-282639,2021-01-30,000001,Vente,30000,,,PATURES DE LA MONTAGNE,B145,21430,21375,Manlay,21,,,213750000F0017,,,,,,,,,,,,,0,,,,,PA,pâtures,,,18072,4.337144,47.140199
2021-282639,2021-01-30,000001,Vente,30000,,,PATURES DE LA MONTAGNE,B145,21430,21375,Manlay,21,,,213750000F0019,,,,,,,,,,,,,0,,,,,PA,pâtures,,,120,4.338794,47.140523
2021-282639,2021-01-30,000001,Vente,30000,,,LA MAISIERE,B221,21430,21375,Manlay,21,,,21375000ZA0022,,,,,,,,,,,,,0,,,,,T,terres,,,8480,4.349302,47.134455
2021-282639,2021-01-30,000001,Vente,30000,,,LA MAISIERE,B221,21430,21375,Manlay,21,,,21375000ZA0023,,,,,,,,,,,,,0,,,,,T,terres,,,4240,4.349496,47.134209
2021-282655,2021-02-11,000001,Vente,300,,,LES GRANDES RAIES,B101,21430,21375,Manlay,21,,,213750000F0192,,,,,,,,,,,,,0,,,,,T,terres,,,1158,4.327458,47.13386
2021-282995,2021-02-11,000001,Vente,15000,,,PATURES DE CHAMPS LONGS,B144,21430,21375,Manlay,21,,,213750000B0341,,,,,,,,,,,,,0,,,,,BS,taillis sous futaie,,,20380,4.344577,47.105616
2021-282995,2021-02-11,000001,Vente,15000,,,PATURES DE CHAMPS LONGS,B144,21430,21375,Manlay,21,,,213750000B0342,,,,,,,,,,,,,0,,,,,BS,taillis sous futaie,,,21700,4.344611,47.106575
2021-283384,2021-03-02,000001,Vente,2160,,,LES CLOSEAUX,B057,21430,21375,Manlay,21,,,213750000C0099,,,,,,,,,,,,,0,,,,,P,prés,,,5320,4.326985,47.110658
2021-283384,2021-03-02,000001,Vente,2160,,,LES CLOSEAUX,B057,21430,21375,Manlay,21,,,213750000C0282,,,,,,,,,,,,,0,,,,,P,prés,,,430,4.32704,47.111479
2021-283384,2021-03-02,000001,Vente,2160,,,SUR LA VELLE,B214,21430,21375,Manlay,21,,,213750000D0092,,,,,,,,,,,,,0,,,,,T,terres,,,6330,4.323313,47.113228
2021-283384,2021-03-02,000001,Vente,2160,,,SUR LA VELLE,B214,21430,21375,Manlay,21,,,213750000D0093,,,,,,,,,,,,,0,,,,,P,prés,,,4420,4.323564,47.111821
2021-287083,2021-06-11,000001,Vente,211000,,,LES OUCHOTTES,B136,21430,21375,Manlay,21,,,213750000A0028,,,,,,,,,,,,,0,,,,,T,terres,,,3832,4.353886,47.127773
2021-287083,2021-06-11,000001,Vente,211000,,,LES OUCHOTTES,B136,21430,21375,Manlay,21,,,213750000A0029,,,,,,,,,,,,,0,,,,,J,jardins,,,353,4.353373,47.127299
2021-287083,2021-06-11,000001,Vente,211000,5055,,LES OUCHOTTES,B136,21430,21375,Manlay,21,,,213750000A0030,,,,,,,,,,,,,0,3,Dépendance,,0,S,sols,,,665,4.353693,47.127248
2021-287083,2021-06-11,000001,Vente,211000,5055,,LES OUCHOTTES,B136,21430,21375,Manlay,21,,,213750000A0030,,,,,,,,,,,,,0,1,Maison,157,5,S,sols,,,665,4.353693,47.127248
2021-287083,2021-06-11,000001,Vente,211000,,,CHAMP DE LA RIVIERE,B035,21430,21375,Manlay,21,,,213750000A0113,,,,,,,,,,,,,0,,,,,P,prés,,,1390,4.353202,47.127415
2021-290105,2021-07-23,000001,Vente,40000,,,LA COMMEE,B073,21430,21375,Manlay,21,,,213750000E0113,,,,,,,,,,,,,0,,,,,L,landes,,,605,4.322702,47.139576
2021-290105,2021-07-23,000001,Vente,40000,,,DERRIERE LES ATES,B082,21430,21375,Manlay,21,,,213750000E0316,,,,,,,,,,,,,0,,,,,BT,taillis simples,,,4580,4.31592,47.125212
2021-290105,2021-07-23,000001,Vente,40000,,,BOIS JEAN MATHEY,B020,21430,21375,Manlay,21,,,213750000E0434,,,,,,,,,,,,,0,,,,,BT,taillis simples,,,2735,4.304436,47.127816
2021-290274,2021-07-23,000001,Vente,38000,,,LE VILLAGE,B218,21430,21375,Manlay,21,,,213750000B0107,,,,,,,,,,,,,0,,,,,J,jardins,,,385,4.342885,47.129249
2021-290274,2021-07-23,000001,Vente,38000,9001,,RUE DE L OUCHE LA PIERRE,0114,21430,21375,Manlay,21,,,213750000B0541,,,,,,,,,,,,,0,3,Dépendance,,0,S,sols,,,379,4.342644,47.12904
2021-291462,2021-08-12,000001,Vente,770,,,MONT LA VELLE,B119,21430,21375,Manlay,21,,,213750000B0514,,,,,,,,,,,,,0,,,,,T,terres,,,2827,4.338378,47.128021
2021-291702,2021-08-03,000001,Vente,500,,,MONT LA VELLE,B119,21430,21375,Manlay,21,,,213750000B0021,,,,,,,,,,,,,0,,,,,L,landes,,,215,4.339113,47.127912
2021-292524,2021-09-06,000001,Vente,38000,5000,,MONT LA VELLE,B119,21430,21375,Manlay,21,,,213750000B0035,,,,,,,,,,,,,0,3,Dépendance,,0,J,jardins,,,217,4.339841,47.127059
2021-292524,2021-09-06,000001,Vente,38000,5104,,MONT LA VELLE,B119,21430,21375,Manlay,21,,,213750000B0036,,,,,,,,,,,,,0,1,Maison,34,2,S,sols,,,190,4.340078,47.12707
2021-292524,2021-09-06,000001,Vente,38000,,,MONT LA VELLE,B119,21430,21375,Manlay,21,,,213750000B0042,,,,,,,,,,,,,0,,,,,P,prés,,,9219,4.340267,47.126778
2021-293043,2021-09-17,000001,Vente,46500,,,LE VILLAGE,B218,21430,21375,Manlay,21,,,213750000B0115,,,,,,,,,,,,,0,,,,,S,sols,,,33,4.342363,47.129824
2021-293043,2021-09-17,000001,Vente,46500,5068,,LE VILLAGE,B218,21430,21375,Manlay,21,,,213750000B0116,,,,,,,,,,,,,0,1,Maison,40,3,S,sols,,,207,4.342485,47.130096
2021-293043,2021-09-17,000001,Vente,46500,,,LE VILLAGE,B218,21430,21375,Manlay,21,,,213750000B0526,,,,,,,,,,,,,0,,,,,S,sols,,,305,4.342438,47.12995
2021-293043,2021-09-17,000001,Vente,46500,,,LE VILLAGE,B218,21430,21375,Manlay,21,,,213750000B0527,,,,,,,,,,,,,0,,,,,S,sols,,,1,4.342736,47.130132
2021-293043,2021-09-17,000001,Vente,46500,,,LE VILLAGE,B218,21430,21375,Manlay,21,,,213750000B0530,,,,,,,,,,,,,0,,,,,J,jardins,,,99,4.342642,47.130104
2021-293123,2021-09-16,000001,Vente,60000,5038,,LES CHAUMES,B055,21430,21375,Manlay,21,,,213750000A0431,,,,,,,,,,,,,0,1,Maison,113,6,S,sols,,,395,4.355569,47.124549
2021-293123,2021-09-16,000001,Vente,60000,5038,,LES CHAUMES,B055,21430,21375,Manlay,21,,,213750000A0431,,,,,,,,,,,,,0,3,Dépendance,,0,S,sols,,,395,4.355569,47.124549
2021-293123,2021-09-16,000001,Vente,60000,,,LES CHAUMES,B055,21430,21375,Manlay,21,,,213750000A0433,,,,,,,,,,,,,0,,,,,J,jardins,,,239,4.355326,47.124705
2021-293123,2021-09-16,000001,Vente,60000,,,LES CHAUMES,B055,21430,21375,Manlay,21,,,213750000A0434,,,,,,,,,,,,,0,,,,,J,jardins,,,161,4.355422,47.124662
2021-294235,2021-10-15,000001,Vente,45000,,,MONT LA VELLE,B119,21430,21375,Manlay,21,,,213750000B0028,,,,,,,,,,,,,0,,,,,T,terres,,,1490,4.34033,47.128097
2021-294235,2021-10-15,000001,Vente,45000,5107,,MONT LA VELLE,B119,21430,21375,Manlay,21,,,213750000B0029,,,,,,,,,,,,,0,1,Maison,56,4,S,sols,,,476,4.339854,47.127687
2021-294275,2021-10-25,000001,Vente,2000,,,SUR PROISE,B193,21430,21375,Manlay,21,,,213750000E0221,,,,,,,,,,,,,0,,,,,L,landes,,,2640,4.318748,47.13592
2021-294275,2021-10-25,000001,Vente,2000,,,COMME GUILLEMOT,B070,21430,21375,Manlay,21,,,213750000E0284,,,,,,,,,,,,,0,,,,,BT,taillis simples,,,3010,4.315077,47.131063
2021-294275,2021-10-25,000001,Vente,2000,,,COMME DES CHAROTS,B066,21430,21375,Manlay,21,,,213750000E0376,,,,,,,,,,,,,0,,,,,L,landes,,,3330,4.312819,47.129336
2021-294275,2021-10-25,000001,Vente,2000,,,DEVANT LES LIETTES,B084,21430,21375,Manlay,21,,,213750000E0380,,,,,,,,,,,,,0,,,,,T,terres,,,8000,4.310768,47.129185
2021-294275,2021-10-25,000001,Vente,2000,,,BOIS JEAN MATHEY,B020,21430,21375,Manlay,21,,,213750000E0426,,,,,,,,,,,,,0,,,,,BT,taillis simples,,,1465,4.306158,47.12857
2021-294275,2021-10-25,000001,Vente,2000,,,BOIS JEAN MATHEY,B020,21430,21375,Manlay,21,,,213750000E0437,,,,,,,,,,,,,0,,,,,BT,taillis simples,,,1665,4.303191,47.127297
2021-294542,2021-10-30,000001,Vente,45000,,,SAINT BAZILE,B204,21430,21375,Manlay,21,,,213750000A0187,,,,,,,,,,,,,0,,,,,S,sols,,,258,4.365323,47.121375
2021-294542,2021-10-30,000001,Vente,45000,,,SAINT BAZILE,B204,21430,21375,Manlay,21,,,213750000A0188,,,,,,,,,,,,,0,,,,,S,sols,,,418,4.365467,47.121424
2021-294542,2021-10-30,000001,Vente,45000,5041,,SAINT BAZILE,B204,21430,21375,Manlay,21,,,213750000A0189,,,,,,,,,,,,,0,1,Maison,100,6,S,sols,,,56,4.365269,47.121465
2021-294542,2021-10-30,000001,Vente,45000,,,SAINT BAZILE,B204,21430,21375,Manlay,21,,,213750000A0190,,,,,,,,,,,,,0,,,,,P,prés,,,888,4.365361,47.12179
2021-294542,2021-10-30,000001,Vente,45000,,,SAINT BAZILE,B204,21430,21375,Manlay,21,,,213750000A0190,,,,,,,,,,,,,0,,,,,S,sols,,,305,4.365361,47.12179
2021-294542,2021-10-30,000001,Vente,45000,,,SAINT BAZILE,B204,21430,21375,Manlay,21,,,213750000A0191,,,,,,,,,,,,,0,,,,,J,jardins,,,318,4.365461,47.12156
2021-294542,2021-10-30,000001,Vente,45000,,,SAINT BAZILE,B204,21430,21375,Manlay,21,,,213750000A0192,,,,,,,,,,,,,0,,,,,T,terres,,,919,4.365695,47.121744
2021-296225,2021-11-24,000001,Vente,23000,,,LE BOIS COUPE,B012,21430,21375,Manlay,21,,,213750000D0053,,,,,,,,,,,,,0,,,,,BT,taillis simples,,,21005,4.310446,47.116404
2021-296580,2021-12-16,000001,Vente,25000,,,SAINT BAZILE,B204,21430,21375,Manlay,21,,,213750000A0184,,,,,,,,,,,,,0,,,,,P,prés,,,10947,4.364763,47.121434
2021-296580,2021-12-16,000001,Vente,25000,,,SAINT BAZILE,B204,21430,21375,Manlay,21,,,213750000A0186,,,,,,,,,,,,,0,,,,,S,sols,,,1272,4.365417,47.121036
2021-296580,2021-12-16,000001,Vente,25000,,,SAINT BAZILE,B204,21430,21375,Manlay,21,,,213750000A0193,,,,,,,,,,,,,0,,,,,T,terres,,,340,4.365983,47.121553
2021-296580,2021-12-16,000001,Vente,25000,,,SAINT BAZILE,B204,21430,21375,Manlay,21,,,213750000A0194,,,,,,,,,,,,,0,,,,,T,terres,,,3409,4.365785,47.121162
2021-297757,2021-12-27,000001,Vente,89000,6,,RTE DE MARCHESEUIL,0102,21430,21375,Manlay,21,,,213750000B0102,,,,,,,,,,,,,0,1,Maison,162,5,S,sols,,,1546,4.342827,47.129599
2021-297757,2021-12-27,000001,Vente,89000,6,,RTE DE MARCHESEUIL,0102,21430,21375,Manlay,21,,,213750000B0102,,,,,,,,,,,,,0,3,Dépendance,,0,S,sols,,,1546,4.342827,47.129599
2021-297757,2021-12-27,000001,Vente,89000,6,,RTE DE MARCHESEUIL,0102,21430,21375,Manlay,21,,,213750000B0102,,,,,,,,,,,,,0,3,Dépendance,,0,S,sols,,,1546,4.342827,47.129599
2021-297757,2021-12-27,000001,Vente,89000,6,,RTE DE MARCHESEUIL,0102,21430,21375,Manlay,21,,,213750000B0102,,,,,,,,,,,,,0,3,Dépendance,,0,S,sols,,,1546,4.342827,47.129599
2021-297757,2021-12-27,000001,Vente,89000,,,LE VILLAGE,B218,21430,21375,Manlay,21,,,213750000B0104,,,,,,,,,,,,,0,,,,,J,jardins,,,207,4.342612,47.12948
2021-297757,2021-12-27,000001,Vente,89000,,,LE VILLAGE,B218,21430,21375,Manlay,21,,,213750000B0111,,,,,,,,,,,,,0,,,,,J,jardins,,,1318,4.343108,47.129454
