id_mutation,date_mutation,numero_disposition,nature_mutation,valeur_fonciere,adresse_numero,adresse_suffixe,adresse_nom_voie,adresse_code_voie,code_postal,code_commune,nom_commune,code_departement,ancien_code_commune,ancien_nom_commune,id_parcelle,ancien_id_parcelle,numero_volume,lot1_numero,lot1_surface_carrez,lot2_numero,lot2_surface_carrez,lot3_numero,lot3_surface_carrez,lot4_numero,lot4_surface_carrez,lot5_numero,lot5_surface_carrez,nombre_lots,code_type_local,type_local,surface_reelle_bati,nombre_pieces_principales,code_nature_culture,nature_culture,code_nature_culture_speciale,nature_culture_speciale,surface_terrain,longitude,latitude
2021-281952,2021-01-22,000001,Vente,500,,,LES CERTAUX,B001,21430,21403,Ménessaire,21,,,214030000A0459,,,,,,,,,,,,,0,,,,,T,terres,,,2630,4.143333,47.137272
2021-282253,2021-01-25,000002,Echange,100,,,LE VILLAGE,B012,21430,21403,Ménessaire,21,,,21403000AB0216,,,,,,,,,,,,,0,,,,,S,sols,,,11,4.146785,47.135479
2021-286787,2021-05-11,000001,Vente,400,,,SUR LA RENTE DES BUIS,B106,21430,21403,Ménessaire,21,,,214030000B0275,,,,,,,,,,,,,0,,,,,BR,futaies résineuses,SAPIN,Sapins ou sapinière,3888,4.163533,47.125131
2021-287192,2021-05-21,000001,Vente,89815,,,LE VILLAGE,B012,21430,21403,Ménessaire,21,,,21403000AB0109,,,,,,,,,,,,,0,,,,,P,prés,,,3528,4.146776,47.134254
2021-287192,2021-05-21,000001,Vente,89815,5070,,LE VILLAGE,B012,21430,21403,Ménessaire,21,,,21403000AB0111,,,,,,,,,,,,,0,3,Dépendance,,0,S,sols,,,720,4.146856,47.134588
2021-287192,2021-05-21,000001,Vente,89815,5070,,LE VILLAGE,B012,21430,21403,Ménessaire,21,,,21403000AB0111,,,,,,,,,,,,,0,1,Maison,97,4,S,sols,,,720,4.146856,47.134588
2021-287394,2021-05-26,000001,Vente,88300,,,LE VILLAGE,B012,21430,21403,Ménessaire,21,,,21403000AB0037,,,,,,,,,,,,,0,,,,,S,sols,,,174,4.150104,47.135695
2021-287394,2021-05-26,000001,Vente,88300,5004,,LE VILLAGE,B012,21430,21403,Ménessaire,21,,,21403000AB0042,,,,,,,,,,,,,0,1,Maison,90,3,J,jardins,,,824,4.150538,47.135881
2021-287394,2021-05-26,000001,Vente,88300,5004,,LE VILLAGE,B012,21430,21403,Ménessaire,21,,,21403000AB0042,,,,,,,,,,,,,0,1,Maison,90,3,S,sols,,,326,4.150538,47.135881
2021-287394,2021-05-26,000001,Vente,88300,5005,,LE VILLAGE,B012,21430,21403,Ménessaire,21,,,21403000AB0043,,,,,,,,,,,,,0,1,Maison,80,3,S,sols,,,147,4.150765,47.135851
2021-290593,2021-08-10,000001,Vente,2120,,,LE GOUSSET,B006,21430,21403,Ménessaire,21,,,214030000C0108,,,,,,,,,,,,,0,,,,,BR,futaies résineuses,,,16380,4.107875,47.129964
2021-294445,2021-10-15,000001,Vente,163960,5073,,LE VILLAGE,B012,21430,21403,Ménessaire,21,,,21403000AB0101,,,,,,,,,,,,,0,1,Maison,130,4,J,jardins,,,1242,4.147408,47.134743
2021-294445,2021-10-15,000001,Vente,163960,5073,,LE VILLAGE,B012,21430,21403,Ménessaire,21,,,21403000AB0101,,,,,,,,,,,,,0,3,Dépendance,,0,J,jardins,,,1242,4.147408,47.134743
2021-294445,2021-10-15,000001,Vente,163960,5073,,LE VILLAGE,B012,21430,21403,Ménessaire,21,,,21403000AB0101,,,,,,,,,,,,,0,3,Dépendance,,0,S,sols,,,670,4.147408,47.134743
2021-294445,2021-10-15,000001,Vente,163960,5073,,LE VILLAGE,B012,21430,21403,Ménessaire,21,,,21403000AB0101,,,,,,,,,,,,,0,3,Dépendance,,0,J,jardins,,,1242,4.147408,47.134743
2021-294445,2021-10-15,000001,Vente,163960,5073,,LE VILLAGE,B012,21430,21403,Ménessaire,21,,,21403000AB0101,,,,,,,,,,,,,0,1,Maison,130,4,S,sols,,,670,4.147408,47.134743
2021-294445,2021-10-15,000001,Vente,163960,5073,,LE VILLAGE,B012,21430,21403,Ménessaire,21,,,21403000AB0101,,,,,,,,,,,,,0,3,Dépendance,,0,S,sols,,,670,4.147408,47.134743
2021-294445,2021-10-15,000001,Vente,163960,,,LE VILLAGE,B012,21430,21403,Ménessaire,21,,,21403000AB0108,,,,,,,,,,,,,0,,,,,L,landes,,,398,4.147112,47.133927
2021-294578,2021-11-05,000001,Vente,2000,,,BOIS DE LA MAISON CHENET,B023,21430,21403,Ménessaire,21,,,214030000B0209,,,,,,,,,,,,,0,,,,,BT,taillis simples,,,9214,4.155658,47.118005
2021-295417,2021-11-26,000001,Vente,112000,5012,,LE VILLAGE,B012,21430,21403,Ménessaire,21,,,21403000AB0013,,,,,,,,,,,,,0,1,Maison,48,2,S,sols,,,700,4.147226,47.135469
2021-295417,2021-11-26,000001,Vente,112000,5013,,LE VILLAGE,B012,21430,21403,Ménessaire,21,,,21403000AB0014,,,,,,,,,,,,,0,1,Maison,23,2,S,sols,,,110,4.146936,47.135383
2021-297691,2021-12-23,000001,Vente,155000,5118,,EN VALAISON,B011,21430,21403,Ménessaire,21,,,214030000A0555,,,,,,,,,,,,,0,1,Maison,110,4,S,sols,,,500,4.18101,47.146538
2021-297691,2021-12-23,000001,Vente,155000,5118,,EN VALAISON,B011,21430,21403,Ménessaire,21,,,214030000A0555,,,,,,,,,,,,,0,3,Dépendance,,0,S,sols,,,500,4.18101,47.146538
2021-297691,2021-12-23,000001,Vente,155000,5118,,EN VALAISON,B011,21430,21403,Ménessaire,21,,,214030000A0555,,,,,,,,,,,,,0,3,Dépendance,,0,S,sols,,,500,4.18101,47.146538
2021-297691,2021-12-23,000001,Vente,155000,5118,,EN VALAISON,B011,21430,21403,Ménessaire,21,,,214030000A0555,,,,,,,,,,,,,0,3,Dépendance,,0,J,jardins,,,1606,4.18101,47.146538
2021-297691,2021-12-23,000001,Vente,155000,5118,,EN VALAISON,B011,21430,21403,Ménessaire,21,,,214030000A0555,,,,,,,,,,,,,0,3,Dépendance,,0,J,jardins,,,1606,4.18101,47.146538
2021-297691,2021-12-23,000001,Vente,155000,5118,,EN VALAISON,B011,21430,21403,Ménessaire,21,,,214030000A0555,,,,,,,,,,,,,0,1,Maison,110,4,J,jardins,,,1606,4.18101,47.146538
2021-297691,2021-12-23,000001,Vente,155000,5118,A,EN VALAISON,B011,21430,21403,Ménessaire,21,,,214030000A0557,,,,,,,,,,,,,0,3,Dépendance,,0,S,sols,,,3538,4.181584,47.146264
2021-297691,2021-12-23,000001,Vente,155000,5118,A,EN VALAISON,B011,21430,21403,Ménessaire,21,,,214030000A0557,,,,,,,,,,,,,0,3,Dépendance,,0,S,sols,,,3538,4.181584,47.146264
2021-297691,2021-12-23,000001,Vente,155000,,,EN VALAISON,B011,21430,21403,Ménessaire,21,,,214030000A0558,,,,,,,,,,,,,0,,,,,T,terres,,,26504,4.179837,47.145352
