id_mutation,date_mutation,numero_disposition,nature_mutation,valeur_fonciere,adresse_numero,adresse_suffixe,adresse_nom_voie,adresse_code_voie,code_postal,code_commune,nom_commune,code_departement,ancien_code_commune,ancien_nom_commune,id_parcelle,ancien_id_parcelle,numero_volume,lot1_numero,lot1_surface_carrez,lot2_numero,lot2_surface_carrez,lot3_numero,lot3_surface_carrez,lot4_numero,lot4_surface_carrez,lot5_numero,lot5_surface_carrez,nombre_lots,code_type_local,type_local,surface_reelle_bati,nombre_pieces_principales,code_nature_culture,nature_culture,code_nature_culture_speciale,nature_culture_speciale,surface_terrain,longitude,latitude
2021-285812,2021-04-26,000001,Vente,41000,2,,RUE DU GRILLOT,0055,21520,21432,Montigny-sur-Aube,21,,,21432000AB0202,,,,,,,,,,,,,0,1,Maison,76,3,S,sols,,,880,4.774157,47.952015
2021-285976,2021-04-15,000001,Vente,30000,17,,RUE HENRI CHAMBON,0050,21520,21432,Montigny-sur-Aube,21,,,21432000AB0320,,,,,,,,,,,,,0,1,Maison,135,6,S,sols,,,740,4.77767,47.953591
2021-288196,2021-06-01,000001,Vente,1100,,,LES SABLES,B026,21520,21432,Montigny-sur-Aube,21,,,21432000ZE0005,,,,,,,,,,,,,0,,,,,T,terres,,,4390,4.78216,47.952009
2021-288283,2021-06-11,000001,Vente,800,,,LE VILLAGE,B030,21520,21432,Montigny-sur-Aube,21,,,21432000AB0330,,,,,,,,,,,,,0,,,,,J,jardins,,,148,4.77728,47.954326
2021-288283,2021-06-11,000001,Vente,800,,,LE VILLAGE,B030,21520,21432,Montigny-sur-Aube,21,,,21432000AB0331,,,,,,,,,,,,,0,,,,,J,jardins,,,124,4.777404,47.954416
2021-288476,2021-06-16,000001,Vente,250,15,,RUE DE LA POTELLE,0095,21520,21432,Montigny-sur-Aube,21,,,21432000AB0078,,,,,,,,,,,,,0,3,Dépendance,,0,S,sols,,,49,4.780512,47.95309
2021-290149,2021-07-08,000001,Vente,109140,2,,RUE DE VERDUN,0130,21520,21432,Montigny-sur-Aube,21,,,21432000AB0025,,,,,,,,,,,,,0,1,Maison,201,7,S,sols,,,578,4.779477,47.953903
2021-290149,2021-07-08,000001,Vente,109140,,,LE VILLAGE,B030,21520,21432,Montigny-sur-Aube,21,,,21432000AB0344,,,,,,,,,,,,,0,,,,,T,terres,,,15,4.779359,47.95364
2021-290934,2021-07-13,000001,Vente,7000,1,,RLE CARON,0016,21520,21432,Montigny-sur-Aube,21,,,21432000AB0435,,,,,,,,,,,,,0,1,Maison,75,3,S,sols,,,89,4.780418,47.953532
2021-291383,2021-08-19,000001,Vente,400,,,MAUGRAS,B022,21520,21432,Montigny-sur-Aube,21,,,21432000ZX0005,,,,,,,,,,,,,0,,,,,T,terres,,,548,4.762332,47.945152
2021-291383,2021-08-19,000001,Vente,400,,,MAUGRAS,B022,21520,21432,Montigny-sur-Aube,21,,,21432000ZX0005,,,,,,,,,,,,,0,,,,,BT,taillis simples,,,3225,4.762332,47.945152
2021-291384,2021-08-18,000001,Vente,10000,9014,,RUE DE LA POTELLE,0095,21520,21432,Montigny-sur-Aube,21,,,21432000AB0137,,,,,,,,,,,,,0,3,Dépendance,,0,S,sols,,,330,4.780111,47.953078
2021-291384,2021-08-18,000001,Vente,10000,9014,,RUE DE LA POTELLE,0095,21520,21432,Montigny-sur-Aube,21,,,21432000AB0137,,,,,,,,,,,,,0,1,Maison,100,3,S,sols,,,330,4.780111,47.953078
2021-294645,2021-10-16,000001,Vente,20000,,,LE VILLAGE,B030,21520,21432,Montigny-sur-Aube,21,,,21432000AB0053,,,,,,,,,,,,,0,,,,,J,jardins,,,445,4.781345,47.953358
2021-294645,2021-10-16,000001,Vente,20000,6,,RUE DE LA POTELLE,0095,21520,21432,Montigny-sur-Aube,21,,,21432000AB0138,,,,,,,,,,,,,0,3,Dépendance,,0,S,sols,,,675,4.779949,47.953155
2021-294645,2021-10-16,000001,Vente,20000,6,,RUE DE LA POTELLE,0095,21520,21432,Montigny-sur-Aube,21,,,21432000AB0138,,,,,,,,,,,,,0,2,Appartement,81,4,S,sols,,,675,4.779949,47.953155
2021-294645,2021-10-16,000001,Vente,20000,6,,RUE DE LA POTELLE,0095,21520,21432,Montigny-sur-Aube,21,,,21432000AB0138,,,,,,,,,,,,,0,3,Dépendance,,0,S,sols,,,675,4.779949,47.953155
2021-294645,2021-10-16,000001,Vente,20000,6,,RUE DE LA POTELLE,0095,21520,21432,Montigny-sur-Aube,21,,,21432000AB0138,,,,,,,,,,,,,0,3,Dépendance,,0,S,sols,,,675,4.779949,47.953155
2021-294645,2021-10-16,000001,Vente,20000,6,,RUE DE LA POTELLE,0095,21520,21432,Montigny-sur-Aube,21,,,21432000AB0138,,,,,,,,,,,,,0,3,Dépendance,,0,S,sols,,,675,4.779949,47.953155
2021-294645,2021-10-16,000001,Vente,20000,6,,RUE DE LA POTELLE,0095,21520,21432,Montigny-sur-Aube,21,,,21432000AB0138,,,,,,,,,,,,,0,3,Dépendance,,0,S,sols,,,675,4.779949,47.953155
2021-294645,2021-10-16,000001,Vente,20000,6,,RUE DE LA POTELLE,0095,21520,21432,Montigny-sur-Aube,21,,,21432000AB0138,,,,,,,,,,,,,0,3,Dépendance,,0,S,sols,,,675,4.779949,47.953155
2021-294645,2021-10-16,000001,Vente,20000,6,,RUE DE LA POTELLE,0095,21520,21432,Montigny-sur-Aube,21,,,21432000AB0138,,,,,,,,,,,,,0,2,Appartement,68,3,S,sols,,,675,4.779949,47.953155
2021-294645,2021-10-16,000001,Vente,20000,,,LE VILLAGE,B030,21520,21432,Montigny-sur-Aube,21,,,21432000AB0139,,,,,,,,,,,,,0,,,,,S,sols,,,91,4.779988,47.953302
2021-295442,2021-11-02,000001,Vente,10000,,,LE VILLAGE,B030,21520,21432,Montigny-sur-Aube,21,,,21432000AB0244,,,,,,,,,,,,,0,,,,,S,sols,,,82,4.775442,47.953805
2021-295442,2021-11-02,000001,Vente,10000,,,LE VILLAGE,B030,21520,21432,Montigny-sur-Aube,21,,,21432000AB0245,,,,,,,,,,,,,0,,,,,S,sols,,,1600,4.775021,47.953837
2021-296450,2021-11-19,000001,Vente,20000,3,,VIEILLE ROUTE DE DIJON,0025,21520,21432,Montigny-sur-Aube,21,,,21432000AB0196,,,,,,,,,,,,,0,1,Maison,96,3,S,sols,,,108,4.7739,47.951667
