id_mutation,date_mutation,numero_disposition,nature_mutation,valeur_fonciere,adresse_numero,adresse_suffixe,adresse_nom_voie,adresse_code_voie,code_postal,code_commune,nom_commune,code_departement,ancien_code_commune,ancien_nom_commune,id_parcelle,ancien_id_parcelle,numero_volume,lot1_numero,lot1_surface_carrez,lot2_numero,lot2_surface_carrez,lot3_numero,lot3_surface_carrez,lot4_numero,lot4_surface_carrez,lot5_numero,lot5_surface_carrez,nombre_lots,code_type_local,type_local,surface_reelle_bati,nombre_pieces_principales,code_nature_culture,nature_culture,code_nature_culture_speciale,nature_culture_speciale,surface_terrain,longitude,latitude
2021-304334,2021-09-23,000001,Vente,200,1,,TRAOU RICHARD,B952,22140,22018,Brélidy,22,,,220180000A1252,,,,,,,,,,,,,0,,,,,S,sols,,,8,-3.226424,48.663048
2021-308348,2021-11-23,000001,Vente,1200,,,PARC AN MESQUEN,B497,22140,22018,Brélidy,22,,,220180000A0879,,,,,,,,,,,,,0,,,,,T,terres,,,2440,-3.22387,48.664632
2021-308650,2021-12-13,000001,Vente,1000,,,KER LASIOU,B159,22140,22018,Brélidy,22,,,220180000A0263,,,,,,,,,,,,,0,,,,,T,terres,,,2160,-3.22455,48.658502
2021-314231,2021-01-07,000001,Vente,35320,,,PARC HAS,B612,22140,22018,Brélidy,22,,,220180000A0049,,,,,,,,,,,,,0,,,,,T,terres,,,36470,-3.230108,48.666374
2021-314231,2021-01-07,000001,Vente,35320,,,LE VERGER,B968,22140,22018,Brélidy,22,,,220180000A0063,,,,,,,,,,,,,0,,,,,T,terres,,,7680,-3.230991,48.667911
2021-314238,2021-01-07,000001,Vente,99680,,,PARC HIR,B617,22140,22018,Brélidy,22,,,220180000A0005,,,,,,,,,,,,,0,,,,,T,terres,,,8250,-3.23274,48.67197
2021-314238,2021-01-07,000001,Vente,99680,,,PARC MEIN,B661,22140,22018,Brélidy,22,,,220180000A0006,,,,,,,,,,,,,0,,,,,T,terres,,,3850,-3.232372,48.672319
2021-314238,2021-01-07,000001,Vente,99680,,,PARC HAS EN COAT,B613,22140,22018,Brélidy,22,,,220180000A0007,,,,,,,,,,,,,0,,,,,T,terres,,,6325,-3.23184,48.671665
2021-314238,2021-01-07,000001,Vente,99680,,,PARC AN CASTEL,B469,22140,22018,Brélidy,22,,,220180000A0010,,,,,,,,,,,,,0,,,,,T,terres,,,16775,-3.230402,48.67162
2021-314238,2021-01-07,000001,Vente,99680,,,PARC QUADRAM CORNEC,B716,22140,22018,Brélidy,22,,,220180000A0011,,,,,,,,,,,,,0,,,,,T,terres,,,13555,-3.230503,48.672525
2021-314238,2021-01-07,000001,Vente,99680,,,PARC EN MARER,B575,22140,22018,Brélidy,22,,,220180000A0023,,,,,,,,,,,,,0,,,,,T,terres,,,9890,-3.228716,48.669398
2021-314238,2021-01-07,000001,Vente,99680,,,PARC JARIC,B621,22140,22018,Brélidy,22,,,220180000A0032,,,,,,,,,,,,,0,,,,,L,landes,,,700,-3.226963,48.669037
2021-314238,2021-01-07,000001,Vente,99680,,,PARC JARIC,B621,22140,22018,Brélidy,22,,,220180000A0033,,,,,,,,,,,,,0,,,,,T,terres,,,6050,-3.226561,48.669335
2021-314238,2021-01-07,000001,Vente,99680,,,L ALLEE,B003,22140,22018,Brélidy,22,,,220180000A0034,,,,,,,,,,,,,0,,,,,L,landes,,,610,-3.226646,48.668605
2021-314238,2021-01-07,000001,Vente,99680,,,L ALLEE,B003,22140,22018,Brélidy,22,,,220180000A0054,,,,,,,,,,,,,0,,,,,L,landes,,,4750,-3.227892,48.668539
2021-314238,2021-01-07,000001,Vente,99680,,,PARC AN MARER,B494,22140,22018,Brélidy,22,,,220180000A0055,,,,,,,,,,,,,0,,,,,T,terres,,,7850,-3.22794,48.66884
2021-314238,2021-01-07,000001,Vente,99680,,,MES COM,B045,22140,22018,Brélidy,22,,,220180000A0064,,,,,,,,,,,,,0,,,,,T,terres,,,8810,-3.232243,48.667668
2021-314238,2021-01-07,000001,Vente,99680,,,PARC BIHAN,B530,22140,22018,Brélidy,22,,,220180000A0073,,,,,,,,,,,,,0,,,,,T,terres,,,8470,-3.231479,48.669922
2021-314238,2021-01-07,000001,Vente,99680,,,BOIS HUELIN,B025,22140,22018,Brélidy,22,,,220180000A0074,,,,,,,,,,,,,0,,,,,T,terres,,,8345,-3.232276,48.67068
2021-314238,2021-01-07,000001,Vente,99680,,,LOGUEL TREFRONT,B400,22140,22018,Brélidy,22,,,220180000A0135,,,,,,,,,,,,,0,,,,,P,prés,,,4400,-3.224847,48.669162
2021-314238,2021-01-07,000001,Vente,99680,,,PRAJOU LUYER,B773,22140,22018,Brélidy,22,,,220180000A0851,,,,,,,,,,,,,0,,,,,T,terres,,,960,-3.227239,48.669736
2021-314238,2021-01-07,000001,Vente,99680,,,LIORS AN COULDRY,B237,22140,22018,Brélidy,22,,,220180000A0972,,,,,,,,,,,,,0,,,,,T,terres,,,12013,-3.228606,48.668056
2021-314306,2021-01-18,000001,Vente,123000,2,B,SAINT TUGDUAL,B934,22140,22018,Brélidy,22,,,220180000B0603,,,,,,,,,,,,,0,3,Dépendance,,0,S,sols,,,70,-3.236984,48.643974
2021-314306,2021-01-18,000001,Vente,123000,,,SAINT TUGDUAL,B934,22140,22018,Brélidy,22,,,220180000B0604,,,,,,,,,,,,,0,,,,,S,sols,,,155,-3.236978,48.643867
2021-314306,2021-01-18,000001,Vente,123000,2,,SAINT TUGDUAL,B934,22140,22018,Brélidy,22,,,220180000B0809,,,,,,,,,,,,,0,1,Maison,116,4,S,sols,,,166,-3.236968,48.643935
2021-314306,2021-01-18,000001,Vente,123000,,,SAINT TUGDUAL,B934,22140,22018,Brélidy,22,,,220180000B0811,,,,,,,,,,,,,0,,,,,S,sols,,,27,-3.237207,48.644034
2021-314306,2021-01-18,000001,Vente,123000,5194,,SAINT TUGDUAL,B934,22140,22018,Brélidy,22,,,220180000B0837,,,,,,,,,,,,,0,3,Dépendance,,0,S,sols,,,148,-3.237051,48.644094
2021-314306,2021-01-18,000001,Vente,123000,5194,,SAINT TUGDUAL,B934,22140,22018,Brélidy,22,,,220180000B0837,,,,,,,,,,,,,0,3,Dépendance,,0,T,terres,,,637,-3.237051,48.644094
2021-314306,2021-01-18,000001,Vente,123000,,,TOUL PRIX,B948,22140,22018,Brélidy,22,,,220180000B0935,,,,,,,,,,,,,0,,,,,T,terres,,,1252,-3.236786,48.644265
2021-314390,2021-01-28,000002,Vente,170350,1,,TRAOU RICHARD,B952,22140,22018,Brélidy,22,,,220180000A1251,,,,,,,,,,,,,0,1,Maison,61,3,,,,,,-3.225743,48.663163
2021-314481,2021-02-19,000001,Vente,83000,6,,LOCMARIA,B989,22140,22018,Brélidy,22,,,220180000A0625,,,,,,,,,,,,,0,1,Maison,99,3,S,sols,,,640,-3.217446,48.659662
2021-314481,2021-02-19,000001,Vente,83000,,,TRAOU BRELIDY,B950,22140,22018,Brélidy,22,,,220180000A1246,,,,,,,,,,,,,0,,,,,S,sols,,,294,-3.21732,48.659721
2021-314481,2021-02-19,000001,Vente,83000,,,CROAS NAVALEN,B066,22140,22018,Brélidy,22,,,220180000A1249,,,,,,,,,,,,,0,,,,,S,sols,,,63,-3.217764,48.659739
2021-314514,2021-02-17,000001,Vente,20000,5193,,CANER,B987,22140,22018,Brélidy,22,,,220180000A0314,,,,,,,,,,,,,0,1,Maison,56,1,S,sols,,,1510,-3.227715,48.662148
2021-314514,2021-02-17,000001,Vente,20000,,,PARC BELLAN,B527,22140,22018,Brélidy,22,,,220180000A0315,,,,,,,,,,,,,0,,,,,T,terres,,,13040,-3.227599,48.661471
2021-314604,2021-02-25,000001,Vente,117500,,,LIORS VUES,B336,22140,22018,Brélidy,22,,,220180000B0991,,,,,,,,,,,,,0,,,,,T,terres,,,753,-3.220791,48.64491
2021-314604,2021-02-25,000001,Vente,117500,2,,PARC AN PORSE,B504,22140,22018,Brélidy,22,,,220180000B0993,,,,,,,,,,,,,0,1,Maison,45,2,S,sols,,,1543,-3.220768,48.645068
2021-314604,2021-02-25,000001,Vente,117500,,,PARC AN PORSE,B504,22140,22018,Brélidy,22,,,220180000B0998,,,,,,,,,,,,,0,,,,,T,terres,,,507,-3.220601,48.645201
2021-315268,2021-05-27,000001,Vente,200000,5181,,CROAS RU,B069,22140,22018,Brélidy,22,,,220180000A0929,,,,,,,,,,,,,0,3,Dépendance,,0,S,sols,,,298,-3.22221,48.660378
2021-315268,2021-05-27,000001,Vente,200000,9,,CROAS RU,B069,22140,22018,Brélidy,22,,,220180000A0976,,,,,,,,,,,,,0,1,Maison,130,7,T,terres,,,906,-3.22177,48.660166
2021-315268,2021-05-27,000001,Vente,200000,9,,CROAS RU,B069,22140,22018,Brélidy,22,,,220180000A0976,,,,,,,,,,,,,0,1,Maison,130,7,S,sols,,,750,-3.22177,48.660166
2021-315453,2021-05-17,000001,Vente,4500,,,TACHEN GUILLERN,B941,22140,22018,Brélidy,22,,,220180000A0430,,,,,,,,,,,,,0,,,,,BR,futaies résineuses,,,2700,-3.238062,48.658791
2021-315453,2021-05-17,000001,Vente,4500,,,TACHEN GUILLERN,B941,22140,22018,Brélidy,22,,,220180000A0431,,,,,,,,,,,,,0,,,,,BR,futaies résineuses,,,1815,-3.237444,48.658669
2021-315453,2021-05-17,000001,Vente,4500,,,ROS ALLAIN,B871,22140,22018,Brélidy,22,,,220180000A0432,,,,,,,,,,,,,0,,,,,BR,futaies résineuses,,,4150,-3.236943,48.658953
2021-316023,2021-07-30,000001,Vente,55000,3,,KERONAL,B175,22140,22018,Brélidy,22,,,220180000B0796,,,,,,,,,,,,,0,1,Maison,65,4,S,sols,,,300,-3.217677,48.646791
2021-316023,2021-07-30,000001,Vente,55000,,,PARC BONBONI,B533,22140,22018,Brélidy,22,,,220180000B1012,,,,,,,,,,,,,0,,,,,T,terres,,,548,-3.21778,48.646649
2021-316023,2021-07-30,000001,Vente,55000,,,PARC BONBONI,B533,22140,22018,Brélidy,22,,,220180000B1012,,,,,,,,,,,,,0,,,,,S,sols,,,128,-3.21778,48.646649
2021-316058,2021-08-24,000001,Vente,168000,,,KERGUEN,B170,22140,22018,Brélidy,22,,,220180000A0520,,,,,,,,,,,,,0,,,,,T,terres,,,2375,-3.223856,48.653227
2021-316058,2021-08-24,000001,Vente,168000,,,KERGUEN,B170,22140,22018,Brélidy,22,,,220180000A0520,,,,,,,,,,,,,0,,,,,S,sols,,,705,-3.223856,48.653227
2021-316058,2021-08-24,000001,Vente,168000,2,,KERGUEN,B170,22140,22018,Brélidy,22,,,220180000A0826,,,,,,,,,,,,,0,1,Maison,99,4,S,sols,,,265,-3.223653,48.653426
2021-316058,2021-08-24,000001,Vente,168000,2,,KERGUEN,B170,22140,22018,Brélidy,22,,,220180000A0826,,,,,,,,,,,,,0,3,Dépendance,,0,S,sols,,,265,-3.223653,48.653426
2021-316074,2021-08-25,000001,Vente,60000,3,,SAINT TUGDUAL,B934,22140,22018,Brélidy,22,,,220180000B0810,,,,,,,,,,,,,0,1,Maison,80,5,S,sols,,,300,-3.23725,48.643943
2021-316074,2021-08-25,000001,Vente,60000,,,SAINT TUGDUAL,B934,22140,22018,Brélidy,22,,,220180000B0838,,,,,,,,,,,,,0,,,,,T,terres,,,15,-3.237256,48.644041
