id_mutation,date_mutation,numero_disposition,nature_mutation,valeur_fonciere,adresse_numero,adresse_suffixe,adresse_nom_voie,adresse_code_voie,code_postal,code_commune,nom_commune,code_departement,ancien_code_commune,ancien_nom_commune,id_parcelle,ancien_id_parcelle,numero_volume,lot1_numero,lot1_surface_carrez,lot2_numero,lot2_surface_carrez,lot3_numero,lot3_surface_carrez,lot4_numero,lot4_surface_carrez,lot5_numero,lot5_surface_carrez,nombre_lots,code_type_local,type_local,surface_reelle_bati,nombre_pieces_principales,code_nature_culture,nature_culture,code_nature_culture_speciale,nature_culture_speciale,surface_terrain,longitude,latitude
2021-297878,2021-01-15,000001,Vente,1500,,,LOGUEL,B302,22290,22057,Le Faouët,22,,,220570000A0504,,,,,,,,,,,,,0,,,,,J,jardins,,,1150,-3.069977,48.68518
2021-298250,2021-01-21,000001,Vente,157000,,,TACHEN BOURBOUILLON,B789,22290,22057,Le Faouët,22,,,220570000B0237,,,,,,,,,,,,,0,,,,,T,terres,,,3830,-3.059423,48.675886
2021-298250,2021-01-21,000001,Vente,157000,,,NEVEZ HIR,B434,22290,22057,Le Faouët,22,,,220570000B0241,,,,,,,,,,,,,0,,,,,T,terres,,,2863,-3.062894,48.676875
2021-298250,2021-01-21,000001,Vente,157000,,,PRAT BRAS,B696,22290,22057,Le Faouët,22,,,220570000B0539,,,,,,,,,,,,,0,,,,,P,prés,,,5480,-3.073529,48.671056
2021-298250,2021-01-21,000001,Vente,157000,,,LE JARDIN,B127,22290,22057,Le Faouët,22,,,220570000B0808,,,,,,,,,,,,,0,,,,,S,sols,,,510,-3.07361,48.673158
2021-298250,2021-01-21,000001,Vente,157000,,,PARC BIAN,B456,22290,22057,Le Faouët,22,,,220570000B0810,,,,,,,,,,,,,0,,,,,S,sols,,,66,-3.073443,48.673056
2021-298250,2021-01-21,000001,Vente,157000,5127,,KERVIGNANT,B156,22290,22057,Le Faouët,22,,,220570000B0812,,,,,,,,,,,,,0,1,Maison,76,4,S,sols,,,1064,-3.073739,48.672985
2021-298250,2021-01-21,000001,Vente,157000,,,HOUAS LES TRAOU,B124,22290,22057,Le Faouët,22,,,220570000B0818,,,,,,,,,,,,,0,,,,,T,terres,,,287,-3.072965,48.672718
2021-298250,2021-01-21,000001,Vente,157000,,,LIORS KEREVEN,B256,22290,22057,Le Faouët,22,,,220570000B0821,,,,,,,,,,,,,0,,,,,S,sols,,,7023,-3.073265,48.672485
2021-298250,2021-01-21,000001,Vente,157000,,,PARC BIAN,B456,22290,22057,Le Faouët,22,,,220570000B0823,,,,,,,,,,,,,0,,,,,S,sols,,,438,-3.073017,48.672807
2021-298250,2021-01-21,000001,Vente,157000,,,KEROIGNAN,B149,22290,22057,Le Faouët,22,,,220570000B0824,,,,,,,,,,,,,0,,,,,S,sols,,,159,-3.073311,48.672839
2021-300236,2021-04-27,000001,Vente,6000,,,PARC LAN,B566,22290,22057,Le Faouët,22,,,220570000B0671,,,,,,,,,,,,,0,,,,,L,landes,,,5550,-3.064243,48.67667
2021-300928,2021-05-27,000001,Vente,190000,13,,RUE DU GOELO,0040,22290,22057,Le Faouët,22,,,220570000A0401,,,,,,,,,,,,,0,1,Maison,130,5,S,sols,,,500,-3.069173,48.687573
2021-300928,2021-05-27,000001,Vente,190000,13,,RUE DU GOELO,0040,22290,22057,Le Faouët,22,,,220570000A0401,,,,,,,,,,,,,0,1,Maison,130,5,T,terres,,,1800,-3.069173,48.687573
2021-301415,2021-06-15,000001,Echange,17000,,,LIORS HOSTIE,B248,22290,22057,Le Faouët,22,,,220570000C0407,,,,,,,,,,,,,0,,,,,T,terres,,,10795,-3.094468,48.669047
2021-301415,2021-06-15,000001,Echange,17000,,,PARCO MINUT,B657,22290,22057,Le Faouët,22,,,220570000C0408,,,,,,,,,,,,,0,,,,,T,terres,,,8410,-3.095861,48.668721
2021-301415,2021-06-15,000001,Echange,17000,,,ARVIN,B004,22290,22057,Le Faouët,22,,,220570000C0409,,,,,,,,,,,,,0,,,,,BT,taillis simples,,,2005,-3.095242,48.668349
2021-301415,2021-06-15,000001,Echange,17000,,,KERGOIN BIAN,B141,22290,22057,Le Faouët,22,,,220570000C0410,,,,,,,,,,,,,0,,,,,T,terres,,,4360,-3.096781,48.668028
2021-301415,2021-06-15,000001,Echange,17000,,,KERGOIN BRAS,B142,22290,22057,Le Faouët,22,,,220570000C0411,,,,,,,,,,,,,0,,,,,T,terres,,,10780,-3.097336,48.66851
2021-301415,2021-06-15,000001,Echange,17000,,,PRAT KERGOIN,B719,22290,22057,Le Faouët,22,,,220570000C0412,,,,,,,,,,,,,0,,,,,BT,taillis simples,,,1860,-3.098329,48.668013
2021-301415,2021-06-15,000001,Echange,17000,,,KERGOIN BRAS,B142,22290,22057,Le Faouët,22,,,220570000C0447,,,,,,,,,,,,,0,,,,,BT,taillis simples,,,1150,-3.098242,48.668141
2021-301618,2021-06-23,000001,Vente,15000,,,LIORS,B210,22290,22057,Le Faouët,22,,,220570000C0590,,,,,,,,,,,,,0,,,,,T,terres,,,914,-3.085426,48.677099
2021-302157,2021-07-02,000001,Vente,147000,9,,RUE DE PARC CORN,0070,22290,22057,Le Faouët,22,,,220570000A0804,,,,,,,,,,,,,0,1,Maison,86,4,S,sols,,,578,-3.07372,48.683159
2021-302511,2021-08-02,000001,Vente,45500,5,,RUE DU TREGOR,0120,22290,22057,Le Faouët,22,,,220570000A0628,,,,,,,,,,,,,0,3,Dépendance,,0,T,terres,,,2117,-3.075088,48.684262
2021-302846,2021-08-02,000001,Vente,5200,,,CRECH BIAN,B054,22290,22057,Le Faouët,22,,,220570000A0194,,,,,,,,,,,,,0,,,,,BT,taillis simples,,,1280,-3.052301,48.684889
2021-302846,2021-08-02,000001,Vente,5200,,,CRECH BIAN,B054,22290,22057,Le Faouët,22,,,220570000A0195,,,,,,,,,,,,,0,,,,,BT,taillis simples,,,2940,-3.052112,48.685194
2021-302846,2021-08-02,000001,Vente,5200,,,CRECH BIAN,B054,22290,22057,Le Faouët,22,,,220570000A0196,,,,,,,,,,,,,0,,,,,BT,taillis simples,,,1430,-3.051274,48.685281
2021-302846,2021-08-02,000001,Vente,5200,,,CRECH FAVET,B061,22290,22057,Le Faouët,22,,,220570000A0197,,,,,,,,,,,,,0,,,,,BT,taillis simples,,,1600,-3.050658,48.685566
2021-302846,2021-08-02,000001,Vente,5200,,,CRECH FAVET,B061,22290,22057,Le Faouët,22,,,220570000A0198,,,,,,,,,,,,,0,,,,,BT,taillis simples,,,1430,-3.049762,48.685466
2021-302846,2021-08-02,000001,Vente,5200,,,NENEZEN,B433,22290,22057,Le Faouët,22,,,220570000A0238,,,,,,,,,,,,,0,,,,,L,landes,,,4450,-3.049332,48.686675
2021-302846,2021-08-02,000001,Vente,5200,,,CRECH MEN GOIN,B069,22290,22057,Le Faouët,22,,,220570000A0241,,,,,,,,,,,,,0,,,,,BT,taillis simples,,,1520,-3.047706,48.685935
2021-302846,2021-08-02,000001,Vente,5200,,,CROIR GRIF,B095,22290,22057,Le Faouët,22,,,220570000A0242,,,,,,,,,,,,,0,,,,,L,landes,,,2550,-3.047734,48.685451
2021-302846,2021-08-02,000001,Vente,5200,,,PARCO CAM,B654,22290,22057,Le Faouët,22,,,220570000A0244,,,,,,,,,,,,,0,,,,,T,terres,,,4480,-3.048123,48.684945
2021-302846,2021-08-02,000001,Vente,5200,,,PRAT AREIN DEL,B689,22290,22057,Le Faouët,22,,,220570000A0253,,,,,,,,,,,,,0,,,,,BT,taillis simples,,,3500,-3.046963,48.683966
2021-302846,2021-08-02,000001,Vente,5200,,,CROIR LIORS,B096,22290,22057,Le Faouët,22,,,220570000A0254,,,,,,,,,,,,,0,,,,,BT,taillis simples,,,1470,-3.047376,48.684606
2021-302859,2021-08-02,000002,Vente,1,,,LIORS BIHAN,B217,22290,22057,Le Faouët,22,,,220570000C0579,,,,,,,,,,,,,0,,,,,T,terres,,,78,-3.087101,48.68202
2021-303291,2021-09-07,000001,Vente,70000,8,,KERLIVAN,B147,22290,22057,Le Faouët,22,,,220570000B0650,,,,,,,,,,,,,0,3,Dépendance,,0,S,sols,,,258,-3.067366,48.678827
2021-303291,2021-09-07,000001,Vente,70000,8,,KERLIVAN,B147,22290,22057,Le Faouët,22,,,220570000B0650,,,,,,,,,,,,,0,1,Maison,101,4,S,sols,,,258,-3.067366,48.678827
2021-303291,2021-09-07,000001,Vente,70000,,,LIORS OLIER,B277,22290,22057,Le Faouët,22,,,220570000B0688,,,,,,,,,,,,,0,,,,,S,sols,,,128,-3.068411,48.678487
2021-303291,2021-09-07,000001,Vente,70000,,,LIORS OLIER,B277,22290,22057,Le Faouët,22,,,220570000B0688,,,,,,,,,,,,,0,,,,,T,terres,,,2601,-3.068411,48.678487
2021-303387,2021-09-02,000001,Vente,145000,,,LEUR,B208,22290,22057,Le Faouët,22,,,220570000A0286,,,,,,,,,,,,,0,,,,,S,sols,,,1035,-3.047557,48.681278
2021-303387,2021-09-02,000001,Vente,145000,4,,KERVEGAN,B154,22290,22057,Le Faouët,22,,,220570000A0684,,,,,,,,,,,,,0,1,Maison,80,4,S,sols,,,418,-3.047552,48.68097
2021-303410,2021-09-16,000001,Vente,720,,,TACHEN BOURBOUILLON,B789,22290,22057,Le Faouët,22,,,220570000B0238,,,,,,,,,,,,,0,,,,,T,terres,,,1440,-3.059708,48.676215
2021-303896,2021-09-16,000001,Vente,266500,4,,KERGRIST,B143,22290,22057,Le Faouët,22,,,220570000C0288,,,,,,,,,,,,,0,3,Dépendance,,0,S,sols,,,1000,-3.08432,48.677559
2021-303896,2021-09-16,000001,Vente,266500,4,,KERGRIST,B143,22290,22057,Le Faouët,22,,,220570000C0288,,,,,,,,,,,,,0,1,Maison,200,8,S,sols,,,1000,-3.08432,48.677559
2021-303896,2021-09-16,000001,Vente,266500,4,,KERGRIST,B143,22290,22057,Le Faouët,22,,,220570000C0288,,,,,,,,,,,,,0,1,Maison,50,2,S,sols,,,1000,-3.08432,48.677559
2021-303896,2021-09-16,000001,Vente,266500,4,,KERGRIST,B143,22290,22057,Le Faouët,22,,,220570000C0288,,,,,,,,,,,,,0,3,Dépendance,,0,S,sols,,,1000,-3.08432,48.677559
2021-303896,2021-09-16,000001,Vente,266500,4,,KERGRIST,B143,22290,22057,Le Faouët,22,,,220570000C0288,,,,,,,,,,,,,0,3,Dépendance,,0,S,sols,,,1000,-3.08432,48.677559
2021-303896,2021-09-16,000001,Vente,266500,,,PAILLER,B435,22290,22057,Le Faouët,22,,,220570000C0446,,,,,,,,,,,,,0,,,,,S,sols,,,340,-3.084296,48.677706
2021-303896,2021-09-16,000001,Vente,266500,,,KERGRIST,B143,22290,22057,Le Faouët,22,,,220570000C0448,,,,,,,,,,,,,0,,,,,S,sols,,,807,-3.084758,48.677605
2021-303896,2021-09-16,000001,Vente,266500,,,LIORS,B210,22290,22057,Le Faouët,22,,,220570000C0457,,,,,,,,,,,,,0,,,,,S,sols,,,254,-3.08504,48.677556
2021-306600,2021-10-28,000002,Vente,80000,4,,RUE DES SAULES,0100,22290,22057,Le Faouët,22,,,220570000A0543,,,,,,,,,,,,,0,1,Maison,133,6,S,sols,,,145,-3.073813,48.684974
2021-306600,2021-10-28,000002,Vente,80000,4,,RUE DES SAULES,0100,22290,22057,Le Faouët,22,,,220570000A0543,,,,,,,,,,,,,0,3,Dépendance,,0,S,sols,,,145,-3.073813,48.684974
2021-306600,2021-10-28,000002,Vente,80000,4,,RUE DES SAULES,0100,22290,22057,Le Faouët,22,,,220570000A0543,,,,,,,,,,,,,0,1,Maison,70,2,S,sols,,,145,-3.073813,48.684974
2021-306600,2021-10-28,000002,Vente,80000,4,,RUE DES SAULES,0100,22290,22057,Le Faouët,22,,,220570000A0543,,,,,,,,,,,,,0,3,Dépendance,,0,S,sols,,,145,-3.073813,48.684974
2021-306600,2021-10-28,000002,Vente,80000,4,,RUE DES SAULES,0100,22290,22057,Le Faouët,22,,,220570000A0543,,,,,,,,,,,,,0,3,Dépendance,,0,S,sols,,,145,-3.073813,48.684974
2021-306600,2021-10-28,000002,Vente,80000,,,PARC PLACEN,B610,22290,22057,Le Faouët,22,,,220570000A0850,,,,,,,,,,,,,0,,,,,S,sols,,,56,-3.073827,48.685052
2021-307854,2021-11-22,000001,Vente,290000,12,,RUE DU GOELO,0040,22290,22057,Le Faouët,22,,,220570000A0625,,,,,,,,,,,,,0,1,Maison,105,4,S,sols,,,1777,-3.070669,48.685391
2021-307854,2021-11-22,000001,Vente,290000,12,,RUE DU GOELO,0040,22290,22057,Le Faouët,22,,,220570000A0625,,,,,,,,,,,,,0,3,Dépendance,,0,S,sols,,,1777,-3.070669,48.685391
2021-309101,2021-12-15,000001,Vente,3000,,,CRECH PRAT BRAS,B077,22290,22057,Le Faouët,22,,,220570000B0202,,,,,,,,,,,,,0,,,,,BT,taillis simples,,,6080,-3.0561,48.672176
2021-309101,2021-12-15,000001,Vente,3000,,,PRAT BRAS,B696,22290,22057,Le Faouët,22,,,220570000B0204,,,,,,,,,,,,,0,,,,,L,landes,,,1390,-3.056743,48.672054
2021-309127,2021-12-18,000001,Vente,180,,,PARC DE KERLIVAN,B491,22290,22057,Le Faouët,22,,,220570000B0208,,,,,,,,,,,,,0,,,,,L,landes,,,2430,-3.0587,48.672945
2021-309128,2021-12-18,000002,Vente,850,,,CRECH COURSON,B059,22290,22057,Le Faouët,22,,,220570000B0209,,,,,,,,,,,,,0,,,,,BT,taillis simples,,,1800,-3.05848,48.673174
2021-309128,2021-12-18,000002,Vente,850,,,PRE DE KERLIVAN,B759,22290,22057,Le Faouët,22,,,220570000B0211,,,,,,,,,,,,,0,,,,,L,landes,,,1720,-3.059556,48.673305
2021-309128,2021-12-18,000002,Vente,850,,,QUEFOYER BRAS,B762,22290,22057,Le Faouët,22,,,220570000B0215,,,,,,,,,,,,,0,,,,,L,landes,,,6600,-3.058722,48.673621
