id_mutation,date_mutation,numero_disposition,nature_mutation,valeur_fonciere,adresse_numero,adresse_suffixe,adresse_nom_voie,adresse_code_voie,code_postal,code_commune,nom_commune,code_departement,ancien_code_commune,ancien_nom_commune,id_parcelle,ancien_id_parcelle,numero_volume,lot1_numero,lot1_surface_carrez,lot2_numero,lot2_surface_carrez,lot3_numero,lot3_surface_carrez,lot4_numero,lot4_surface_carrez,lot5_numero,lot5_surface_carrez,nombre_lots,code_type_local,type_local,surface_reelle_bati,nombre_pieces_principales,code_nature_culture,nature_culture,code_nature_culture_speciale,nature_culture_speciale,surface_terrain,longitude,latitude
2021-303726,2021-09-01,000001,Vente,25000,,,LE VERGER,B449,22600,22075,Hémonstoir,22,,,22075000AA0037,,,,,,,,,,,,,0,,,,,T,terres,,,69,-2.829872,48.159701
2021-303726,2021-09-01,000001,Vente,25000,,,RUE DU GEN DE GAULLE,0025,22600,22075,Hémonstoir,22,,,22075000AA0038,,,,,,,,,,,,,0,,,,,S,sols,,,74,-2.829867,48.159798
2021-303726,2021-09-01,000001,Vente,25000,10,,RUE DU GEN DE GAULLE,0025,22600,22075,Hémonstoir,22,,,22075000AA0040,,,,,,,,,,,,,0,3,Dépendance,,0,S,sols,,,603,-2.82994,48.159981
2021-303726,2021-09-01,000001,Vente,25000,10,,RUE DU GEN DE GAULLE,0025,22600,22075,Hémonstoir,22,,,22075000AA0040,,,,,,,,,,,,,0,1,Maison,54,3,S,sols,,,603,-2.82994,48.159981
2021-303726,2021-09-01,000001,Vente,25000,10,,RUE DU GEN DE GAULLE,0025,22600,22075,Hémonstoir,22,,,22075000AA0040,,,,,,,,,,,,,0,3,Dépendance,,0,S,sols,,,603,-2.82994,48.159981
2021-303726,2021-09-01,000001,Vente,25000,,,LE COURTIL DE DERRIERE,B164,22600,22075,Hémonstoir,22,,,22075000AA0163,,,,,,,,,,,,,0,,,,,J,jardins,,,486,-2.829716,48.159896
2021-307316,2021-11-17,000001,Vente,12215,,,LE PLACIS,B322,22600,22075,Hémonstoir,22,,,22075000ZD0106,,,,,,,,,,,,,0,,,,,T,terres,,,14530,-2.829674,48.163508
2021-307316,2021-11-17,000001,Vente,12215,,,LE GRAND CLOS D EN BAS,B202,22600,22075,Hémonstoir,22,,,22075000ZD0139,,,,,,,,,,,,,0,,,,,T,terres,,,7570,-2.831607,48.164145
2021-307338,2021-11-17,000002,Vente,24216,,,LA PRINSE DES BOIS,B394,22600,22075,Hémonstoir,22,,,22075000ZD0055,,,,,,,,,,,,,0,,,,,T,terres,,,3389,-2.836905,48.165145
2021-307338,2021-11-17,000002,Vente,24216,,,LA PRINSE DES BOIS,B394,22600,22075,Hémonstoir,22,,,22075000ZD0055,,,,,,,,,,,,,0,,,,,S,sols,,,91,-2.836905,48.165145
2021-307338,2021-11-17,000002,Vente,24216,,,LE PETIT CLOS,B292,22600,22075,Hémonstoir,22,,,22075000ZD0137,,,,,,,,,,,,,0,,,,,T,terres,,,9685,-2.831626,48.163556
2021-307340,2021-11-17,000001,Vente,18176,,,LE PLACIS,B322,22600,22075,Hémonstoir,22,,,22075000ZD0135,,,,,,,,,,,,,0,,,,,T,terres,,,7390,-2.831877,48.1629
2021-307340,2021-11-17,000001,Vente,18176,,,LE PLACIS,B322,22600,22075,Hémonstoir,22,,,22075000ZD0261,,,,,,,,,,,,,0,,,,,T,terres,,,5747,-2.829243,48.162418
2021-307340,2021-11-17,000001,Vente,18176,,,VILLE MARIA,B461,22600,22075,Hémonstoir,22,,,22075000ZD0263,,,,,,,,,,,,,0,,,,,T,terres,,,19750,-2.830598,48.162573
2021-308933,2021-12-16,000001,Vente,97000,7,,COETMIZIAM,B150,22600,22075,Hémonstoir,22,,,220750000D0134,,,,,,,,,,,,,0,1,Maison,140,5,S,sols,,,1445,-2.846511,48.146332
2021-308933,2021-12-16,000001,Vente,97000,,,LE GRAND VERGER,B214,22600,22075,Hémonstoir,22,,,220750000D0253,,,,,,,,,,,,,0,,,,,S,sols,,,117,-2.846797,48.146386
2021-308933,2021-12-16,000001,Vente,97000,,,LES TROIS CHENES,B447,22600,22075,Hémonstoir,22,,,22075000ZK0084,,,,,,,,,,,,,0,,,,,S,sols,,,2359,-2.846189,48.146294
2021-308935,2021-12-16,000001,Vente,10741.13,5,,RUE DU CLOS DE LA LANDE,0012,22600,22075,Hémonstoir,22,,,22075000AB0106,,,,,,,,,,,,,0,1,Maison,80,5,S,sols,,,1003,-2.830844,48.156387
2021-319042,2021-02-26,000001,Vente,10000,,,LA LANDE DU HAMBOUT,B255,22600,22075,Hémonstoir,22,,,22075000ZI0107,,,,,,,,,,,,,0,,,,,T,terres,,,1257,-2.849773,48.156574
2021-319042,2021-02-26,000001,Vente,10000,,,LA LANDE DU HAMBOUT,B255,22600,22075,Hémonstoir,22,,,22075000ZI0107,,,,,,,,,,,,,0,,,,,S,sols,,,1840,-2.849773,48.156574
2021-319216,2021-04-16,000001,Vente,50,,,LA PETITE PRINSE,B314,22600,22075,Hémonstoir,22,,,22075000ZC0108,,,,,,,,,,,,,0,,,,,L,landes,,,180,-2.85219,48.163359
2021-319266,2021-04-06,000001,Vente,105000,4,,RUE DES 3 FRERES FRABOULET,0054,22600,22075,Hémonstoir,22,,,22075000AA0090,,,,,,,,,,,,,0,1,Maison,80,3,S,sols,,,156,-2.830319,48.159216
2021-319411,2021-05-10,000001,Vente,40691,,,LA PRINSE CARREE,B379,22600,22075,Hémonstoir,22,,,22075000ZC0037,,,,,,,,,,,,,0,,,,,T,terres,,,19280,-2.847899,48.163536
2021-319411,2021-05-10,000001,Vente,40691,,,LA BRIENNE,B044,22600,22075,Hémonstoir,22,,,22075000ZC0084,,,,,,,,,,,,,0,,,,,T,terres,,,2450,-2.850474,48.16338
2021-319411,2021-05-10,000001,Vente,40691,,,LA BRIENNE,B044,22600,22075,Hémonstoir,22,,,22075000ZC0085,,,,,,,,,,,,,0,,,,,T,terres,,,1960,-2.850719,48.162529
2021-319411,2021-05-10,000001,Vente,40691,,,LES PETITS BOIS,B317,22600,22075,Hémonstoir,22,,,22075000ZC0086,,,,,,,,,,,,,0,,,,,T,terres,,,2450,-2.850115,48.162335
2021-319411,2021-05-10,000001,Vente,40691,,,LES PETITS BOIS,B317,22600,22075,Hémonstoir,22,,,22075000ZC0087,,,,,,,,,,,,,0,,,,,T,terres,,,31990,-2.849137,48.163215
2021-319527,2021-06-01,000001,Vente,162000,8,,RUE PIERRE LE MAITRE,0046,22600,22075,Hémonstoir,22,,,22075000AB0004,,,,,,,,,,,,,0,1,Maison,73,2,S,sols,,,276,-2.834025,48.156768
2021-319527,2021-06-01,000001,Vente,162000,8,,RUE PIERRE LE MAITRE,0046,22600,22075,Hémonstoir,22,,,22075000AB0004,,,,,,,,,,,,,0,1,Maison,73,2,J,jardins,,,1000,-2.834025,48.156768
2021-319640,2021-06-15,000001,Vente,156000,8,,RUE PHILIPPE LE DUC,0044,22600,22075,Hémonstoir,22,,,22075000AB0096,,,,,,,,,,,,,0,1,Maison,98,4,S,sols,,,962,-2.829093,48.156845
2021-319640,2021-06-15,000001,Vente,156000,8,,RUE PHILIPPE LE DUC,0044,22600,22075,Hémonstoir,22,,,22075000AB0096,,,,,,,,,,,,,0,3,Dépendance,,0,S,sols,,,962,-2.829093,48.156845
2021-319695,2021-06-24,000001,Vente,46369.4,,,LE CLOS D EN BAS,B102,22600,22075,Hémonstoir,22,,,22075000ZC0021,,,,,,,,,,,,,0,,,,,T,terres,,,36550,-2.846069,48.16279
2021-319695,2021-06-24,000001,Vente,46369.4,,,LE BOIS D HIRGOUET,B020,22600,22075,Hémonstoir,22,,,22075000ZC0110,,,,,,,,,,,,,0,,,,,S,sols,,,362,-2.846411,48.16344
2021-319695,2021-06-24,000001,Vente,46369.4,,,LA PRINSE DU RAUT,B408,22600,22075,Hémonstoir,22,,,22075000ZI0005,,,,,,,,,,,,,0,,,,,T,terres,,,29330,-2.85285,48.161683
2021-319805,2021-07-17,000001,Vente terrain à bâtir,14415,8,,RUE DE L HILVERN,0033,22600,22075,Hémonstoir,22,,,22075000AA0008,,,,,,,,,,,,,0,,,,,AB,terrains a bâtir,,,961,-2.834282,48.161502
2021-320117,2021-08-05,000001,Vente,138000,25,,RUE DU GEN DE GAULLE,0025,22600,22075,Hémonstoir,22,,,22075000AA0028,,,,,,,,,,,,,0,3,Dépendance,,0,S,sols,,,859,-2.8318,48.160999
2021-320117,2021-08-05,000001,Vente,138000,25,,RUE DU GEN DE GAULLE,0025,22600,22075,Hémonstoir,22,,,22075000AA0028,,,,,,,,,,,,,0,1,Maison,100,5,S,sols,,,859,-2.8318,48.160999
