id_mutation,date_mutation,numero_disposition,nature_mutation,valeur_fonciere,adresse_numero,adresse_suffixe,adresse_nom_voie,adresse_code_voie,code_postal,code_commune,nom_commune,code_departement,ancien_code_commune,ancien_nom_commune,id_parcelle,ancien_id_parcelle,numero_volume,lot1_numero,lot1_surface_carrez,lot2_numero,lot2_surface_carrez,lot3_numero,lot3_surface_carrez,lot4_numero,lot4_surface_carrez,lot5_numero,lot5_surface_carrez,nombre_lots,code_type_local,type_local,surface_reelle_bati,nombre_pieces_principales,code_nature_culture,nature_culture,code_nature_culture_speciale,nature_culture_speciale,surface_terrain,longitude,latitude
2021-305185,2021-09-25,000001,Vente,104000,,,HOAS HIOL,B506,22480,22092,Kerpert,22,,,220920000D1365,,,,,,,,,,,,,0,,,,,L,landes,,,15472,-3.159661,48.404343
2021-305185,2021-09-25,000001,Vente,104000,,,HOAS HIOL,B506,22480,22092,Kerpert,22,,,220920000D1366,,,,,,,,,,,,,0,,,,,BT,taillis simples,,,2743,-3.160341,48.403867
2021-305185,2021-09-25,000001,Vente,104000,,,HENT PARC VUR,B403,22480,22092,Kerpert,22,,,220920000D1370,,,,,,,,,,,,,0,,,,,BT,taillis simples,,,1029,-3.159118,48.404922
2021-305185,2021-09-25,000001,Vente,104000,,,PAR VUR,B725,22480,22092,Kerpert,22,,,220920000D1371,,,,,,,,,,,,,0,,,,,L,landes,,,8914,-3.158636,48.404799
2021-305185,2021-09-25,000001,Vente,104000,,,CABIOL,C715,22480,22092,Kerpert,22,,,22092000ZS0002,,,,,,,,,,,,,0,,,,,T,terres,,,38260,-3.151617,48.408765
2021-305185,2021-09-25,000001,Vente,104000,,,CABIOL,C715,22480,22092,Kerpert,22,,,22092000ZS0002,,,,,,,,,,,,,0,,,,,BF,futaies feuillues,,,14760,-3.151617,48.408765
2021-305185,2021-09-25,000001,Vente,104000,,,CABIOL,C715,22480,22092,Kerpert,22,,,22092000ZS0002,,,,,,,,,,,,,0,,,,,T,terres,,,38260,-3.151617,48.408765
2021-308842,2021-12-01,000001,Vente,49800,39,,AU BOURG,B047,22480,22092,Kerpert,22,,,220920000D1500,,,,,,,,,,,,,0,1,Maison,88,4,S,sols,,,93,-3.135239,48.377497
2021-308842,2021-12-01,000001,Vente,49800,39,,AU BOURG,B047,22480,22092,Kerpert,22,,,220920000D1500,,,,,,,,,,,,,0,3,Dépendance,,0,S,sols,,,93,-3.135239,48.377497
2021-308842,2021-12-01,000001,Vente,49800,,,AU BOURG,B047,22480,22092,Kerpert,22,,,220920000D1732,,,,,,,,,,,,,0,,,,,J,jardins,,,153,-3.135863,48.377476
2021-309440,2021-12-16,000001,Vente,106000,57,,AU BOURG,B047,22480,22092,Kerpert,22,,,220920000D1559,,,,,,,,,,,,,0,1,Maison,60,2,S,sols,,,512,-3.133722,48.378651
2021-314257,2021-01-04,000001,Vente,60000,,,PRAT NEVOUILLET,C394,22480,22092,Kerpert,22,,,220920000A0539,,,,,,,,,,,,,0,,,,,P,prés,,,1674,-3.12489,48.40386
2021-314257,2021-01-04,000001,Vente,60000,,,HIORS STEPHAN,B495,22480,22092,Kerpert,22,,,220920000A0540,,,,,,,,,,,,,0,,,,,T,terres,,,2040,-3.124917,48.403519
2021-314257,2021-01-04,000001,Vente,60000,2,,COLDESQUIENT,B153,22480,22092,Kerpert,22,,,220920000A0682,,,,,,,,,,,,,0,1,Maison,70,4,S,sols,,,451,-3.125634,48.403093
2021-314257,2021-01-04,000001,Vente,60000,,,HIORS BRAS,B449,22480,22092,Kerpert,22,,,220920000A0690,,,,,,,,,,,,,0,,,,,T,terres,,,2848,-3.126065,48.403465
2021-314290,2021-01-13,000001,Vente,1500,2,,SAINT URNAN,C610,22480,22092,Kerpert,22,,,220920000D0421,,,,,,,,,,,,,0,,,,,T,terres,,,3860,-3.140097,48.393049
2021-314308,2021-01-13,000001,Vente,65000,3,,LE GUERNIOU,B329,22480,22092,Kerpert,22,,,22092000ZI0071,,,,,,,,,,,,,0,1,Maison,91,4,S,sols,,,260,-3.122376,48.367901
2021-314308,2021-01-13,000001,Vente,65000,4,,LE GUERNIOU,B329,22480,22092,Kerpert,22,,,22092000ZI0085,,,,,,,,,,,,,0,3,Dépendance,,0,S,sols,,,216,-3.122518,48.367777
2021-314308,2021-01-13,000001,Vente,65000,,,LE GUERNIOU,B329,22480,22092,Kerpert,22,,,22092000ZI0086,,,,,,,,,,,,,0,,,,,T,terres,,,944,-3.122108,48.367881
2021-314378,2021-01-21,000001,Vente,84000,45,,AU BOURG,B047,22480,22092,Kerpert,22,,,220920000D1654,,,,,,,,,,,,,0,1,Maison,120,4,S,sols,,,1051,-3.134486,48.377153
2021-314378,2021-01-21,000001,Vente,84000,,,VERGER,C672,22480,22092,Kerpert,22,,,220920000D1657,,,,,,,,,,,,,0,,,,,T,terres,,,3514,-3.134089,48.377487
2021-314697,2021-03-03,000001,Vente,1600,,,PRAJO AR VILIN,C192,22480,22092,Kerpert,22,,,220920000A0927,,,,,,,,,,,,,0,,,,,P,prés,,,5508,-3.121441,48.393208
2021-314727,2021-03-12,000001,Vente,51000,7,,SAINT URNAN,C610,22480,22092,Kerpert,22,,,220920000D0443,,,,,,,,,,,,,0,1,Maison,70,3,S,sols,,,333,-3.140494,48.391911
2021-314727,2021-03-12,000001,Vente,51000,,,ELLEUR DE COUECH,B255,22480,22092,Kerpert,22,,,220920000D0444,,,,,,,,,,,,,0,,,,,J,jardins,,,412,-3.140564,48.391766
2021-314727,2021-03-12,000001,Vente,51000,,,CANABEC,B057,22480,22092,Kerpert,22,,,22092000ZO0011,,,,,,,,,,,,,0,,,,,T,terres,,,2020,-3.140277,48.390947
2021-315004,2021-03-31,000001,Vente,523,,,PARC BRAS AN ILLIS,B777,22480,22092,Kerpert,22,,,220920000D1740,,,,,,,,,,,,,0,,,,,T,terres,,,190,-3.136739,48.376703
2021-315004,2021-03-31,000001,Vente,523,,,PARC BRAS AN ILLIS,B777,22480,22092,Kerpert,22,,,220920000D1741,,,,,,,,,,,,,0,,,,,T,terres,,,332,-3.136788,48.376858
2021-315037,2021-03-25,000001,Vente,108000,4,,KERBOURLES,B535,22480,22092,Kerpert,22,,,22092000ZN0080,,,,,,,,,,,,,0,1,Maison,97,3,S,sols,,,1225,-3.15918,48.387536
2021-315037,2021-03-25,000001,Vente,108000,4,,KERBOURLES,B535,22480,22092,Kerpert,22,,,22092000ZN0080,,,,,,,,,,,,,0,1,Maison,97,3,T,terres,,,1954,-3.15918,48.387536
2021-315037,2021-03-25,000001,Vente,108000,,,PARC KERBOULES,C788,22480,22092,Kerpert,22,,,22092000ZN0089,,,,,,,,,,,,,0,,,,,T,terres,,,4651,-3.160143,48.385641
2021-315037,2021-03-25,000001,Vente,108000,,,PARC KERBOULES,C788,22480,22092,Kerpert,22,,,22092000ZN0089,,,,,,,,,,,,,0,,,,,P,prés,,,3136,-3.160143,48.385641
2021-315037,2021-03-25,000001,Vente,108000,,,PARC KERBOULES,C788,22480,22092,Kerpert,22,,,22092000ZN0093,,,,,,,,,,,,,0,,,,,S,sols,,,281,-3.158836,48.387812
2021-315132,2021-04-20,000001,Vente,125000,,,TOUL BIAN,C654,22480,22092,Kerpert,22,,,220920000B0072,,,,,,,,,,,,,0,,,,,T,terres,,,330,-3.105796,48.403395
2021-315132,2021-04-20,000001,Vente,125000,,,ER GOLEC,B261,22480,22092,Kerpert,22,,,220920000B0073,,,,,,,,,,,,,0,,,,,J,jardins,,,1740,-3.105653,48.40314
2021-315132,2021-04-20,000001,Vente,125000,,,L ABBAYE,B001,22480,22092,Kerpert,22,,,220920000B0074,,,,,,,,,,,,,0,,,,,S,sols,,,507,-3.105843,48.402862
2021-315132,2021-04-20,000001,Vente,125000,1,,L ABBAYE,B001,22480,22092,Kerpert,22,,,220920000B0075,,,,,,,,,,,,,0,1,Maison,198,7,S,sols,,,489,-3.105571,48.402879
2021-315132,2021-04-20,000001,Vente,125000,,,LES PLANADES,C099,22480,22092,Kerpert,22,,,220920000B0638,,,,,,,,,,,,,0,,,,,L,landes,,,640,-3.106164,48.402725
2021-315211,2021-04-30,000001,Vente,600,,,AU BOURG,B047,22480,22092,Kerpert,22,,,220920000D0773,,,,,,,,,,,,,0,,,,,L,landes,,,152,-3.133867,48.37685
2021-315320,2021-05-26,000001,Vente,1500,,,GOAREM BIAN,B286,22480,22092,Kerpert,22,,,220920000A0768,,,,,,,,,,,,,0,,,,,T,terres,,,8776,-3.137265,48.400839
2021-315320,2021-05-26,000001,Vente,1500,,,PRAT HENT,C327,22480,22092,Kerpert,22,,,22092000ZB0030,,,,,,,,,,,,,0,,,,,P,prés,,,1860,-3.13402,48.406892
2021-315364,2021-05-20,000001,Vente,15000,,,PRAT BRAS,C243,22480,22092,Kerpert,22,,,22092000ZH0023,,,,,,,,,,,,,0,,,,,BF,futaies feuillues,,,12350,-3.120708,48.379898
2021-315454,2021-06-16,000001,Vente,56000,5,,KERANQUERE,B534,22480,22092,Kerpert,22,,,22092000ZA0109,,,,,,,,,,,,,0,1,Maison,50,2,T,terres,,,4240,-3.132685,48.411521
2021-315454,2021-06-16,000001,Vente,56000,5,,KERANQUERE,B534,22480,22092,Kerpert,22,,,22092000ZA0109,,,,,,,,,,,,,0,3,Dépendance,,0,T,terres,,,4240,-3.132685,48.411521
2021-315454,2021-06-16,000001,Vente,56000,5,,KERANQUERE,B534,22480,22092,Kerpert,22,,,22092000ZA0109,,,,,,,,,,,,,0,1,Maison,50,2,S,sols,,,800,-3.132685,48.411521
2021-315454,2021-06-16,000001,Vente,56000,5,,KERANQUERE,B534,22480,22092,Kerpert,22,,,22092000ZA0109,,,,,,,,,,,,,0,3,Dépendance,,0,S,sols,,,800,-3.132685,48.411521
2021-316056,2021-08-20,000001,Vente,64500,5135,,AU BOURG,B047,22480,22092,Kerpert,22,,,220920000D0795,,,,,,,,,,,,,0,3,Dépendance,,0,S,sols,,,32,-3.132639,48.376031
2021-316056,2021-08-20,000001,Vente,64500,67,,AU BOURG,B047,22480,22092,Kerpert,22,,,220920000D0796,,,,,,,,,,,,,0,3,Dépendance,,0,S,sols,,,66,-3.13266,48.375971
2021-316056,2021-08-20,000001,Vente,64500,67,,AU BOURG,B047,22480,22092,Kerpert,22,,,220920000D0796,,,,,,,,,,,,,0,1,Maison,95,3,S,sols,,,66,-3.13266,48.375971
2021-316056,2021-08-20,000001,Vente,64500,67,,AU BOURG,B047,22480,22092,Kerpert,22,,,220920000D0796,,,,,,,,,,,,,0,3,Dépendance,,0,S,sols,,,66,-3.13266,48.375971
2021-316056,2021-08-20,000001,Vente,64500,,,AU BOURG,B047,22480,22092,Kerpert,22,,,220920000D1711,,,,,,,,,,,,,0,,,,,S,sols,,,190,-3.132821,48.37607
2021-316057,2021-08-20,000001,Vente,1,5135,,AU BOURG,B047,22480,22092,Kerpert,22,,,220920000D0795,,,,,,,,,,,,,0,3,Dépendance,,0,S,sols,,,32,-3.132639,48.376031
2021-316172,2021-08-20,000001,Vente,42000,34,,AU BOURG,B047,22480,22092,Kerpert,22,,,220920000D0848,,,,,,,,,,,,,0,4,Local industriel. commercial ou assimilé,23,0,S,sols,,,319,-3.135603,48.377557
2021-316172,2021-08-20,000001,Vente,42000,34,,AU BOURG,B047,22480,22092,Kerpert,22,,,220920000D0848,,,,,,,,,,,,,0,1,Maison,130,4,S,sols,,,319,-3.135603,48.377557
2021-316178,2021-08-18,000001,Vente,125000,,,PARC AR STANG,B745,22480,22092,Kerpert,22,,,220920000C0215,,,,,,,,,,,,,0,,,,,T,terres,,,2423,-3.138372,48.374452
2021-316178,2021-08-18,000001,Vente,125000,,,PARC AR STANG,B745,22480,22092,Kerpert,22,,,220920000C0216,,,,,,,,,,,,,0,,,,,T,terres,,,4784,-3.138951,48.37424
2021-316178,2021-08-18,000001,Vente,125000,,,PARC AR STANG,B745,22480,22092,Kerpert,22,,,220920000C0217,,,,,,,,,,,,,0,,,,,T,terres,,,6328,-3.139512,48.373886
2021-316178,2021-08-18,000001,Vente,125000,,,MOULIN DE KERPERT,B675,22480,22092,Kerpert,22,,,220920000C0218,,,,,,,,,,,,,0,,,,,S,sols,,,108,-3.140083,48.373862
2021-316178,2021-08-18,000001,Vente,125000,1,,MOULIN DE KERPERT,B675,22480,22092,Kerpert,22,,,220920000C0219,,,,,,,,,,,,,0,3,Dépendance,,0,S,sols,,,379,-3.139326,48.373619
2021-316178,2021-08-18,000001,Vente,125000,1,,MOULIN DE KERPERT,B675,22480,22092,Kerpert,22,,,220920000C0219,,,,,,,,,,,,,0,1,Maison,108,6,S,sols,,,379,-3.139326,48.373619
2021-316328,2021-09-10,000001,Vente,55000,21,,AU BOURG,B047,22480,22092,Kerpert,22,,,220920000D1554,,,,,,,,,,,,,0,1,Maison,140,4,S,sols,,,128,-3.134236,48.377033
2021-316328,2021-09-10,000001,Vente,55000,21,,AU BOURG,B047,22480,22092,Kerpert,22,,,220920000D1555,,,,,,,,,,,,,0,,,,,S,sols,,,711,-3.134176,48.376902
