id_mutation,date_mutation,numero_disposition,nature_mutation,valeur_fonciere,adresse_numero,adresse_suffixe,adresse_nom_voie,adresse_code_voie,code_postal,code_commune,nom_commune,code_departement,ancien_code_commune,ancien_nom_commune,id_parcelle,ancien_id_parcelle,numero_volume,lot1_numero,lot1_surface_carrez,lot2_numero,lot2_surface_carrez,lot3_numero,lot3_surface_carrez,lot4_numero,lot4_surface_carrez,lot5_numero,lot5_surface_carrez,nombre_lots,code_type_local,type_local,surface_reelle_bati,nombre_pieces_principales,code_nature_culture,nature_culture,code_nature_culture_speciale,nature_culture_speciale,surface_terrain,longitude,latitude
2021-303542,2021-09-23,000001,Vente,399750,15,,RES RESIDENCE  KERAVEL,A090,22700,22134,Louannec,22,,,22134000AC0415,,,,,,,,,,,,,0,3,Dépendance,,0,AG,terrains d'agrément,,,846,-3.413712,48.797735
2021-303542,2021-09-23,000001,Vente,399750,15,,RES RESIDENCE  KERAVEL,A090,22700,22134,Louannec,22,,,22134000AC0415,,,,,,,,,,,,,0,1,Maison,135,5,S,sols,,,500,-3.413712,48.797735
2021-303542,2021-09-23,000001,Vente,399750,15,,RES RESIDENCE  KERAVEL,A090,22700,22134,Louannec,22,,,22134000AC0415,,,,,,,,,,,,,0,3,Dépendance,,0,S,sols,,,500,-3.413712,48.797735
2021-303542,2021-09-23,000001,Vente,399750,15,,RES RESIDENCE  KERAVEL,A090,22700,22134,Louannec,22,,,22134000AC0415,,,,,,,,,,,,,0,1,Maison,135,5,AG,terrains d'agrément,,,846,-3.413712,48.797735
2021-303993,2021-09-03,000001,Vente,420000,8,B,CHE DES GOEMONIERS,0017,22700,22134,Louannec,22,,,22134000AC0575,,,,,,,,,,,,,0,1,Maison,99,4,S,sols,,,395,-3.413051,48.796507
2021-303993,2021-09-03,000001,Vente,420000,,,PARC AR PORZ,B796,22700,22134,Louannec,22,,,22134000AC0578,,,,,,,,,,,,,0,,,,,S,sols,,,319,-3.413209,48.796605
2021-304886,2021-09-30,000001,Vente,156215,2,D,RTE DE KERLUCUN,0215,22700,22134,Louannec,22,,,22134000AD0206,,,,,,,,,,,,,0,1,Maison,82,4,S,sols,,,399,-3.403076,48.794593
2021-305200,2021-09-30,000001,Vente,200000,4,,VEN DE TRUZUGAL,0048,22700,22134,Louannec,22,,,22134000AB0020,,,,,,,,,,,,,0,1,Maison,66,3,S,sols,,,147,-3.423867,48.796187
2021-305200,2021-09-30,000001,Vente,200000,4,,VEN DE TRUZUGAL,0048,22700,22134,Louannec,22,,,22134000AB0316,,,,,,,,,,,,,0,,,,,L,landes,,,120,-3.423754,48.796209
2021-305208,2021-09-27,000001,Vente,125000,4,,RTE DE MEZERNEC,0300,22700,22134,Louannec,22,,,221340000C0169,,,,,,,,,,,,,0,1,Maison,120,5,S,sols,,,330,-3.419755,48.783996
2021-305208,2021-09-27,000001,Vente,125000,4,,RTE DE MEZERNEC,0300,22700,22134,Louannec,22,,,221340000C0169,,,,,,,,,,,,,0,3,Dépendance,,0,S,sols,,,330,-3.419755,48.783996
2021-305208,2021-09-27,000001,Vente,125000,,,PEN CRECH,B976,22700,22134,Louannec,22,,,221340000C0923,,,,,,,,,,,,,0,,,,,S,sols,,,28,-3.419919,48.784107
2021-305208,2021-09-27,000001,Vente,125000,,,AR STANG,B203,22700,22134,Louannec,22,,,221340000C1289,,,,,,,,,,,,,0,,,,,S,sols,,,103,-3.419863,48.783978
2021-305210,2021-10-04,000001,Vente,160000,13,,RTE DU CROAJOU,0009,22700,22134,Louannec,22,,,22134000AE0045,,,,,,,,,,,,,0,1,Maison,51,2,S,sols,,,492,-3.41753,48.786924
2021-305210,2021-10-04,000001,Vente,160000,13,,RTE DU CROAJOU,0009,22700,22134,Louannec,22,,,22134000AE0045,,,,,,,,,,,,,0,3,Dépendance,,0,S,sols,,,492,-3.41753,48.786924
2021-305756,2021-10-19,000001,Echange,500,13,,RTE DU STIVEL,0058,22700,22134,Louannec,22,,,221340000C2323,,,,,,,,,,,,,0,,,,,AG,terrains d'agrément,,,44,-3.420427,48.790103
2021-305756,2021-10-19,000002,Echange,500,7,,VEN DU STIVEL,0059,22700,22134,Louannec,22,,,221340000C2321,,,,,,,,,,,,,0,,,,,AG,terrains d'agrément,,,109,-3.420468,48.789953
2021-306393,2021-10-18,000001,Vente,90000,3,,ALL DES GENETS,0005,22700,22134,Louannec,22,,,221340000A1070,,,,,,,,,,,,,0,1,Maison,123,3,S,sols,,,382,-3.39588,48.785
2021-306393,2021-10-18,000001,Vente,90000,3,,ALL DES GENETS,0005,22700,22134,Louannec,22,,,221340000A1070,,,,,,,,,,,,,0,3,Dépendance,,0,S,sols,,,382,-3.39588,48.785
2021-306393,2021-10-18,000001,Vente,90000,,,MABILIES,B636,22700,22134,Louannec,22,,,221340000A1072,,,,,,,,,,,,,0,,,,,S,sols,,,68,-3.395933,48.785098
2021-306472,2021-10-25,000002,Vente,30000,,,HENT MEUR,B371,22700,22134,Louannec,22,,,221340000C1913,,,,,,,,,,,,,0,,,,,T,terres,,,196,-3.430816,48.78709
2021-306472,2021-10-25,000002,Vente,30000,,,PARC TOUL AR HRECH,B962,22700,22134,Louannec,22,,,221340000C1941,,,,,,,,,,,,,0,,,,,T,terres,,,42,-3.43083,48.786984
2021-306472,2021-10-25,000002,Vente,30000,,,PARC TOUL AR HRECH,B962,22700,22134,Louannec,22,,,221340000C1943,,,,,,,,,,,,,0,,,,,T,terres,,,56,-3.430836,48.786941
2021-306473,2021-10-25,000003,Vente,3160,,,HENT MEUR,B371,22700,22134,Louannec,22,,,221340000C1913,,,,,,,,,,,,,0,,,,,T,terres,,,196,-3.430816,48.78709
2021-306473,2021-10-25,000003,Vente,3160,,,PARC TOUL AR HRECH,B962,22700,22134,Louannec,22,,,221340000C1941,,,,,,,,,,,,,0,,,,,T,terres,,,42,-3.43083,48.786984
2021-306473,2021-10-25,000003,Vente,3160,,,PARC TOUL AR HRECH,B962,22700,22134,Louannec,22,,,221340000C1943,,,,,,,,,,,,,0,,,,,T,terres,,,56,-3.430836,48.786941
2021-306473,2021-10-25,000003,Vente,3160,,,PARC TOUL AR HRECH,B962,22700,22134,Louannec,22,,,221340000C2293,,,,,,,,,,,,,0,,,,,AB,terrains a bâtir,,,93,-3.430617,48.786907
2021-306473,2021-10-25,000003,Vente,3160,,,PARC TOUL AR HRECH,B962,22700,22134,Louannec,22,,,221340000C2294,,,,,,,,,,,,,0,,,,,AB,terrains a bâtir,,,79,-3.430557,48.786676
2021-307037,2021-10-20,000001,Vente,215274,28,,RUE DES HORTENSIAS,0020,22700,22134,Louannec,22,,,221340000A0648,,,,,,,,,,,,,0,1,Maison,91,5,S,sols,,,636,-3.39182,48.783813
2021-307040,2021-10-28,000001,Vente,42900,,,PARC AR RUMEUR BRAS,B806,22700,22134,Louannec,22,,,22134000AE0539,,,,,,,,,,,,,0,,,,,AB,terrains a bâtir,,,550,-3.417314,48.787564
2021-307158,2021-11-08,000001,Vente,556000,39,,RTE DE KERNU,0030,22700,22134,Louannec,22,,,221340000C1834,,,,,,,,,,,,,0,1,Maison,136,6,S,sols,,,676,-3.435144,48.794974
2021-307158,2021-11-08,000001,Vente,556000,39,,RTE DE KERNU,0030,22700,22134,Louannec,22,,,221340000C1834,,,,,,,,,,,,,0,3,Dépendance,,0,S,sols,,,676,-3.435144,48.794974
2021-307588,2021-11-23,000001,Vente,308000,12,,RES KERGUEN,A200,22700,22134,Louannec,22,,,22134000AE0224,,,,,,,,,,,,,0,1,Maison,109,5,S,sols,,,788,-3.413746,48.791292
2021-307746,2021-11-30,000001,Vente,303000,8,,RUE PAUL SERUSIER,0345,22700,22134,Louannec,22,,,221340000B1084,,,,,,,,,,,,,0,1,Maison,113,5,S,sols,,,641,-3.41116,48.789188
2021-308174,2021-11-10,000001,Vente,281500,45,,RTE DE TREGUIER,0062,22700,22134,Louannec,22,,,221340000A0893,,,,,,,,,,,,,0,1,Maison,138,4,S,sols,,,500,-3.398224,48.787806
2021-308174,2021-11-10,000001,Vente,281500,45,,RTE DE TREGUIER,0062,22700,22134,Louannec,22,,,221340000A0893,,,,,,,,,,,,,0,1,Maison,138,4,AG,terrains d'agrément,,,1118,-3.398224,48.787806
2021-308326,2021-11-26,000001,Vente,278600,19,,RUE DU ROI ARTHUR,0395,22700,22134,Louannec,22,,,22134000AD0234,,,,,,,,,,,,,0,1,Maison,120,5,S,sols,,,412,-3.400989,48.792199
2021-308326,2021-11-26,000001,Vente,278600,19,,RUE DU ROI ARTHUR,0395,22700,22134,Louannec,22,,,22134000AD0234,,,,,,,,,,,,,0,3,Dépendance,,0,S,sols,,,412,-3.400989,48.792199
2021-308326,2021-11-26,000001,Vente,278600,19,,RUE DU ROI ARTHUR,0395,22700,22134,Louannec,22,,,22134000AD0234,,,,,,,,,,,,,0,3,Dépendance,,0,S,sols,,,412,-3.400989,48.792199
2021-308459,2021-11-30,000001,Vente,400,,,PRAT AR STIVEL,C017,22700,22134,Louannec,22,,,221340000C0108,,,,,,,,,,,,,0,,,,,T,terres,,,1665,-3.419396,48.78895
2021-310057,2021-12-15,000001,Vente,564400,,,CASTEL,B257,22700,22134,Louannec,22,,,22134000AE0211,,,,,,,,,,,,,0,,,,,J,jardins,,,341,-3.415065,48.788661
2021-310057,2021-12-15,000001,Vente,564400,14,,RTE DU CROAJOU,0009,22700,22134,Louannec,22,,,22134000AE0213,,,,,,,,,,,,,0,3,Dépendance,,0,S,sols,,,1214,-3.415387,48.788778
2021-310057,2021-12-15,000001,Vente,564400,14,,RTE DU CROAJOU,0009,22700,22134,Louannec,22,,,22134000AE0213,,,,,,,,,,,,,0,1,Maison,198,8,S,sols,,,1214,-3.415387,48.788778
2021-310057,2021-12-15,000001,Vente,564400,,,AR PARC BRAS,B152,22700,22134,Louannec,22,,,22134000AE0215,,,,,,,,,,,,,0,,,,,T,terres,,,528,-3.41556,48.788866
2021-310320,2021-12-21,000001,Vente,575000,,,LIORS BRAS,B563,22700,22134,Louannec,22,,,221340000C0981,,,,,,,,,,,,,0,,,,,S,sols,,,299,-3.419927,48.785887
2021-310320,2021-12-21,000001,Vente,575000,14,B,PEN AR CRECH,B973,22700,22134,Louannec,22,,,221340000C2314,,,,,,,,,,,,,0,1,Maison,211,5,S,sols,,,500,-3.420448,48.785882
2021-310320,2021-12-21,000001,Vente,575000,14,B,PEN AR CRECH,B973,22700,22134,Louannec,22,,,221340000C2314,,,,,,,,,,,,,0,3,Dépendance,,0,S,sols,,,500,-3.420448,48.785882
2021-310320,2021-12-21,000001,Vente,575000,14,B,PEN AR CRECH,B973,22700,22134,Louannec,22,,,221340000C2314,,,,,,,,,,,,,0,3,Dépendance,,0,AG,terrains d'agrément,,,1110,-3.420448,48.785882
2021-310320,2021-12-21,000001,Vente,575000,14,B,PEN AR CRECH,B973,22700,22134,Louannec,22,,,221340000C2314,,,,,,,,,,,,,0,1,Maison,211,5,AG,terrains d'agrément,,,1110,-3.420448,48.785882
2021-310320,2021-12-21,000001,Vente,575000,14,B,PEN AR CRECH,B973,22700,22134,Louannec,22,,,221340000C2315,,,,,,,,,,,,,0,,,,,AG,terrains d'agrément,,,47,-3.420305,48.786136
2021-310394,2021-12-22,000001,Vente,420000,4,,RTE DE CROAS HENT,0110,22700,22134,Louannec,22,,,22134000AC0439,,,,,,,,,,,,,0,1,Maison,112,4,S,sols,,,926,-3.407004,48.793534
2021-310394,2021-12-22,000001,Vente,420000,4,,RTE DE CROAS HENT,0110,22700,22134,Louannec,22,,,22134000AC0439,,,,,,,,,,,,,0,3,Dépendance,,0,S,sols,,,926,-3.407004,48.793534
2021-310625,2021-12-27,000001,Vente,285000,4,,AV DES FEUX DU LARGE,0019,22700,22134,Louannec,22,,,22134000AE0317,,,,,,,,,,,,,0,1,Maison,120,4,J,jardins,,,580,-3.418989,48.791878
2021-310625,2021-12-27,000001,Vente,285000,4,,AV DES FEUX DU LARGE,0019,22700,22134,Louannec,22,,,22134000AE0317,,,,,,,,,,,,,0,1,Maison,120,4,S,sols,,,500,-3.418989,48.791878
2021-316348,2021-01-11,000001,Vente,348580,1,,RES JARDELLEC,A085,22700,22134,Louannec,22,,,221340000C1910,,,,,,,,,,,,,0,1,Maison,132,4,S,sols,,,819,-3.42992,48.787593
2021-316385,2021-01-14,000001,Vente,444600,,,CASTEL,B257,22700,22134,Louannec,22,,,22134000AE0211,,,,,,,,,,,,,0,,,,,J,jardins,,,341,-3.415065,48.788661
2021-316385,2021-01-14,000001,Vente,444600,14,,RTE DU CROAJOU,0009,22700,22134,Louannec,22,,,22134000AE0213,,,,,,,,,,,,,0,1,Maison,198,8,S,sols,,,1214,-3.415387,48.788778
2021-316385,2021-01-14,000001,Vente,444600,,,AR PARC BRAS,B152,22700,22134,Louannec,22,,,22134000AE0215,,,,,,,,,,,,,0,,,,,T,terres,,,528,-3.41556,48.788866
2021-316464,2021-01-15,000001,Vente,320000,11,,RUE DU ROI ARTHUR,0395,22700,22134,Louannec,22,,,22134000AD0219,,,,,,,,,,,,,0,1,Maison,133,6,S,sols,,,404,-3.400529,48.792979
2021-316467,2021-01-11,000001,Vente,282000,17,,RUE PAUL SERUSIER,0345,22700,22134,Louannec,22,,,221340000B1076,,,,,,,,,,,,,0,1,Maison,125,5,S,sols,,,861,-3.41003,48.790736
2021-316570,2021-01-15,000001,Vente,700000,5241,,PONT AR SAUX,B991,22700,22134,Louannec,22,,,221340000C0490,,,,,,,,,,,,,0,4,Local industriel. commercial ou assimilé,539,0,S,sols,,,743,-3.440381,48.797543
2021-316570,2021-01-15,000001,Vente,700000,5241,,PONT AR SAUX,B991,22700,22134,Louannec,22,,,221340000C0490,,,,,,,,,,,,,0,1,Maison,89,3,S,sols,,,743,-3.440381,48.797543
2021-316570,2021-01-15,000001,Vente,700000,5241,,PONT AR SAUX,B991,22700,22134,Louannec,22,,,221340000C0490,,,,,,,,,,,,,0,2,Appartement,50,3,S,sols,,,743,-3.440381,48.797543
2021-316570,2021-01-15,000001,Vente,700000,,,PONT AR SAUX,B991,22700,22134,Louannec,22,,,221340000C1440,,,,,,,,,,,,,0,,,,,S,sols,,,182,-3.440238,48.797281
2021-316577,2021-02-01,000001,Vente,160000,2,,MALFOS,B638,22700,22134,Louannec,22,,,221340000C1132,,,,,,,,,,,,,0,1,Maison,120,8,S,sols,,,1607,-3.436537,48.776142
2021-316577,2021-02-01,000001,Vente,160000,,,LIORS AN TY,B548,22700,22134,Louannec,22,,,221340000C1133,,,,,,,,,,,,,0,,,,,J,jardins,,,97,-3.436477,48.77584
2021-316577,2021-02-01,000001,Vente,160000,,,LIORS AN TY,B548,22700,22134,Louannec,22,,,221340000C1416,,,,,,,,,,,,,0,,,,,T,terres,,,166,-3.436687,48.77634
2021-316592,2021-02-15,000001,Vente,5000,,,LANNEC FAL,B510,22700,22134,Louannec,22,,,221340000C2035,,,,,,,,,,,,,0,,,,,BP,peupleraies,,,2415,-3.420831,48.773682
2021-316787,2021-02-25,000001,Vente,18000,,,AR HRECH BRAS,B112,22700,22134,Louannec,22,,,22134000AB0038,,,,,,,,,,,,,0,,,,,BT,taillis simples,,,5913,-3.422315,48.796406
2021-316787,2021-02-25,000001,Vente,18000,,,AR HRECH BRAS,B112,22700,22134,Louannec,22,,,22134000AB0038,,,,,,,,,,,,,0,,,,,BR,futaies résineuses,,,6912,-3.422315,48.796406
2021-316787,2021-02-25,000001,Vente,18000,,,VOUILLERT BIAN,C137,22700,22134,Louannec,22,,,22134000AB0040,,,,,,,,,,,,,0,,,,,J,jardins,,,760,-3.421267,48.796162
2021-316843,2021-02-19,000001,Vente,350000,2,,RTE DE LANNION,0029,22700,22134,Louannec,22,,,221340000B0184,,,,,,,,,,,,,0,1,Maison,98,5,S,sols,,,2318,-3.402454,48.781697
2021-316843,2021-02-19,000001,Vente,350000,,,VERGER GUERNABACON,C134,22700,22134,Louannec,22,,,221340000B0191,,,,,,,,,,,,,0,,,,,T,terres,,,1005,-3.403101,48.7819
2021-316843,2021-02-19,000001,Vente,350000,,,CLOS AN RUALIAUT,C143,22700,22134,Louannec,22,,,221340000B0691,,,,,,,,,,,,,0,,,,,T,terres,,,2195,-3.401397,48.781864
2021-316843,2021-02-19,000001,Vente,350000,,,AN HERVOUT HER TOSTANT,B027,22700,22134,Louannec,22,,,221340000B0699,,,,,,,,,,,,,0,,,,,T,terres,,,60,-3.402732,48.781222
2021-316843,2021-02-19,000001,Vente,350000,,,ISSUE GUERNA BACON,C142,22700,22134,Louannec,22,,,221340000B1038,,,,,,,,,,,,,0,,,,,L,landes,,,6,-3.4025,48.782154
2021-316843,2021-02-19,000001,Vente,350000,,,ISSUE GUERNA BACON,C142,22700,22134,Louannec,22,,,221340000B1039,,,,,,,,,,,,,0,,,,,L,landes,,,756,-3.402254,48.781874
2021-316843,2021-02-19,000001,Vente,350000,,,AR VEZEC,B220,22700,22134,Louannec,22,,,221340000B1040,,,,,,,,,,,,,0,,,,,T,terres,,,360,-3.402715,48.781979
2021-316843,2021-02-19,000001,Vente,350000,,,AR HOAT QUISTIN,B097,22700,22134,Louannec,22,,,221340000B1042,,,,,,,,,,,,,0,,,,,T,terres,,,1108,-3.402947,48.781682
2021-316843,2021-02-19,000001,Vente,350000,,,LOGUEL AR LEUR,B604,22700,22134,Louannec,22,,,221340000B1044,,,,,,,,,,,,,0,,,,,T,terres,,,1078,-3.402762,48.781438
2021-316843,2021-02-19,000001,Vente,350000,,,AR HOAT,B089,22700,22134,Louannec,22,,,221340000B1046,,,,,,,,,,,,,0,,,,,L,landes,,,312,-3.402737,48.781277
2021-316843,2021-02-19,000001,Vente,350000,,,MOGUEROU BRAS,B669,22700,22134,Louannec,22,,,221340000B1048,,,,,,,,,,,,,0,,,,,T,terres,,,97,-3.40286,48.781199
2021-316975,2021-03-10,000001,Vente,695000,28,,RTE DE NANTOUAR,0034,22700,22134,Louannec,22,,,221340000A0862,,,,,,,,,,,,,0,1,Maison,170,4,S,sols,,,500,-3.396614,48.799681
2021-316975,2021-03-10,000001,Vente,695000,28,,RTE DE NANTOUAR,0034,22700,22134,Louannec,22,,,221340000A0862,,,,,,,,,,,,,0,1,Maison,170,4,AG,terrains d'agrément,,,2242,-3.396614,48.799681
2021-317034,2021-03-31,000001,Vente,400000,28,B,RTE DE KERNU,0030,22700,22134,Louannec,22,,,221340000C2149,,,,,,,,,,,,,0,1,Maison,144,4,J,jardins,,,1000,-3.435765,48.794073
2021-317034,2021-03-31,000001,Vente,400000,28,B,RTE DE KERNU,0030,22700,22134,Louannec,22,,,221340000C2149,,,,,,,,,,,,,0,1,Maison,144,4,S,sols,,,500,-3.435765,48.794073
2021-317141,2021-02-26,000002,Vente,60000,,,LIORS CODEST,B568,22700,22134,Louannec,22,,,221340000C2302,,,,,,,,,,,,,0,,,,,T,terres,,,507,-3.428878,48.774789
2021-317141,2021-02-26,000002,Vente,60000,5,,RTE DE PETIT CAMP,0040,22700,22134,Louannec,22,,,221340000C2307,,,,,,,,,,,,,0,,,,,S,sols,,,629,-3.429067,48.774959
2021-317164,2021-03-29,000001,Vente,250000,5,,RUE DE NIVIDIC,1188,22700,22134,Louannec,22,,,22134000AE0395,,,,,,,,,,,,,0,1,Maison,137,5,S,sols,,,756,-3.415316,48.791479
2021-317317,2021-04-09,000001,Vente,520000,28,,RUE DES MOUETTES,0033,22700,22134,Louannec,22,,,22134000AB0111,,,,,,,,,,,,,0,1,Maison,138,6,S,sols,,,1196,-3.41709,48.797997
2021-317320,2021-04-16,000001,Vente,252500,6,,VEN PONT AR SAUX,0041,22700,22134,Louannec,22,,,221340000C0484,,,,,,,,,,,,,0,1,Maison,104,4,S,sols,,,558,-3.439904,48.797189
2021-317320,2021-04-16,000001,Vente,252500,,,AR LIORS,B134,22700,22134,Louannec,22,,,221340000C0979,,,,,,,,,,,,,0,,,,,S,sols,,,107,-3.440084,48.797129
2021-317327,2021-05-05,000002,Vente,1000,,,LIORS BRAS,B563,22700,22134,Louannec,22,,,221340000B0794,,,,,,,,,,,,,0,,,,,T,terres,,,83,-3.409088,48.780114
2021-317327,2021-05-05,000002,Vente,1000,,,COADENEC,B263,22700,22134,Louannec,22,,,221340000B1170,,,,,,,,,,,,,0,,,,,S,sols,,,124,-3.409226,48.780145
2021-317330,2021-05-05,000001,Vente,243000,5431,,LA VILLE NEUVE,C136,22700,22134,Louannec,22,,,221340000B0220,,,,,,,,,,,,,0,1,Maison,120,5,S,sols,,,670,-3.409759,48.780312
2021-317330,2021-05-05,000001,Vente,243000,5431,,LA VILLE NEUVE,C136,22700,22134,Louannec,22,,,221340000B0220,,,,,,,,,,,,,0,3,Dépendance,,0,S,sols,,,670,-3.409759,48.780312
2021-317330,2021-05-05,000001,Vente,243000,,,PARC AR FEUNTEUN,B730,22700,22134,Louannec,22,,,221340000B0666,,,,,,,,,,,,,0,,,,,T,terres,,,1247,-3.409688,48.780431
2021-317330,2021-05-05,000001,Vente,243000,,,LIORS BRAS,B563,22700,22134,Louannec,22,,,221340000B0793,,,,,,,,,,,,,0,,,,,T,terres,,,301,-3.408691,48.779763
2021-317330,2021-05-05,000001,Vente,243000,,,COADENEC,B263,22700,22134,Louannec,22,,,221340000B0796,,,,,,,,,,,,,0,,,,,S,sols,,,387,-3.409459,48.780038
2021-317330,2021-05-05,000001,Vente,243000,,,AR LIORS,B134,22700,22134,Louannec,22,,,221340000B0803,,,,,,,,,,,,,0,,,,,T,terres,,,204,-3.408889,48.779849
2021-317330,2021-05-05,000001,Vente,243000,,,COADENEC,B263,22700,22134,Louannec,22,,,221340000B1169,,,,,,,,,,,,,0,,,,,S,sols,,,121,-3.409461,48.780175
2021-317387,2021-05-04,000001,Vente,310000,,,ISSUE GUARIDEC BIHAN,B384,22700,22134,Louannec,22,,,221340000B0527,,,,,,,,,,,,,0,,,,,T,terres,,,708,-3.41347,48.768997
2021-317387,2021-05-04,000001,Vente,310000,8,,RTE DE ROSPEZ,0400,22700,22134,Louannec,22,,,221340000B0528,,,,,,,,,,,,,0,1,Maison,104,4,S,sols,,,1967,-3.414443,48.768729
2021-317387,2021-05-04,000001,Vente,310000,8,,RTE DE ROSPEZ,0400,22700,22134,Louannec,22,,,221340000B0528,,,,,,,,,,,,,0,1,Maison,88,3,S,sols,,,1967,-3.414443,48.768729
2021-317387,2021-05-04,000001,Vente,310000,,,GUARIDEC BIHAN,B369,22700,22134,Louannec,22,,,221340000B0529,,,,,,,,,,,,,0,,,,,S,sols,,,730,-3.414521,48.768251
2021-317387,2021-05-04,000001,Vente,310000,,,GUARIDEC BIHAN,B369,22700,22134,Louannec,22,,,221340000B0530,,,,,,,,,,,,,0,,,,,L,landes,,,65,-3.414747,48.768433
2021-317387,2021-05-04,000001,Vente,310000,,,PARC PERICHOUS HULLAN,B938,22700,22134,Louannec,22,,,221340000C0734,,,,,,,,,,,,,0,,,,,P,prés,,,4760,-3.415153,48.76902
2021-317387,2021-05-04,000001,Vente,310000,,,PERICHOUS,B980,22700,22134,Louannec,22,,,221340000C0735,,,,,,,,,,,,,0,,,,,S,sols,,,290,-3.414899,48.768723
2021-317453,2021-04-20,000001,Vente,180000,15,,RTE DE LANNION,0029,22700,22134,Louannec,22,,,221340000C1202,,,,,,,,,,,,,0,1,Maison,79,4,J,jardins,,,974,-3.419652,48.773337
2021-317453,2021-04-20,000001,Vente,180000,15,,RTE DE LANNION,0029,22700,22134,Louannec,22,,,221340000C1202,,,,,,,,,,,,,0,1,Maison,79,4,S,sols,,,389,-3.419652,48.773337
2021-317482,2021-04-28,000001,Vente,470000,,,LANNEC AR GOUENNOUS,B479,22700,22134,Louannec,22,,,22134000AC0115,,,,,,,,,,,,,0,,,,,VE,vergers,,,1225,-3.407193,48.793278
2021-317482,2021-04-28,000001,Vente,470000,33,,RTE DE TREGUIER,0062,22700,22134,Louannec,22,,,22134000AC0116,,,,,,,,,,,,,0,,,,,J,jardins,,,2092,-3.407628,48.793575
2021-317482,2021-04-28,000001,Vente,470000,33,,RTE DE TREGUIER,0062,22700,22134,Louannec,22,,,22134000AC0117,,,,,,,,,,,,,0,1,Maison,215,7,S,sols,,,385,-3.407644,48.793645
2021-317482,2021-04-28,000001,Vente,470000,33,,RTE DE TREGUIER,0062,22700,22134,Louannec,22,,,22134000AC0117,,,,,,,,,,,,,0,1,Maison,65,1,S,sols,,,385,-3.407644,48.793645
2021-317568,2021-05-11,000001,Vente,263000,5,,RUE ROZ AR HISTIN,0450,22700,22134,Louannec,22,,,221340000C1193,,,,,,,,,,,,,0,1,Maison,133,5,S,sols,,,500,-3.434861,48.791709
2021-317568,2021-05-11,000001,Vente,263000,5,,RUE ROZ AR HISTIN,0450,22700,22134,Louannec,22,,,221340000C1193,,,,,,,,,,,,,0,1,Maison,133,5,J,jardins,,,1150,-3.434861,48.791709
2021-317568,2021-05-11,000001,Vente,263000,,,ROS AR VILEN,C074,22700,22134,Louannec,22,,,221340000C1357,,,,,,,,,,,,,0,,,,,L,landes,,,694,-3.43467,48.791467
2021-317575,2021-05-26,000001,Vente,2080,,,PARC AR RUMEUR BRAS,B806,22700,22134,Louannec,22,,,22134000AE0558,,,,,,,,,,,,,0,,,,,S,sols,,,208,-3.418219,48.788373
2021-317576,2021-05-12,000001,Vente,330000,5,,RTE DE PERROS,0035,22700,22134,Louannec,22,,,22134000AC0492,,,,,,,,,,,,,0,4,Local industriel. commercial ou assimilé,245,0,S,sols,,,627,-3.4135,48.794133
2021-317633,2021-05-19,000002,Echange,150,25,,RUE DES GREVES,0046,22700,22134,Louannec,22,,,221340000C2317,,,,,,,,,,,,,0,,,,,S,sols,,,4,-3.429293,48.795211
2021-317633,2021-05-19,000003,Echange,150,,,PARC LAN BRAS,B889,22700,22134,Louannec,22,,,221340000C2318,,,,,,,,,,,,,0,,,,,S,sols,,,11,-3.429424,48.795276
2021-317791,2021-06-16,000001,Vente,217000,31,B,RTE DU CROAJOU,0009,22700,22134,Louannec,22,,,22134000AE0512,,,,,,,,,,,,,0,1,Maison,63,2,S,sols,,,675,-3.417444,48.785542
2021-317791,2021-06-16,000001,Vente,217000,31,B,RTE DU CROAJOU,0009,22700,22134,Louannec,22,,,22134000AE0512,,,,,,,,,,,,,0,3,Dépendance,,0,S,sols,,,675,-3.417444,48.785542
2021-317865,2021-06-11,000001,Vente,260000,10,,RES GWEL AR MOR,A080,22700,22134,Louannec,22,,,221340000C0932,,,,,,,,,,,,,0,1,Maison,89,5,T,terres,,,1157,-3.428893,48.796238
2021-317865,2021-06-11,000001,Vente,260000,10,,RES GWEL AR MOR,A080,22700,22134,Louannec,22,,,221340000C0932,,,,,,,,,,,,,0,1,Maison,89,5,S,sols,,,805,-3.428893,48.796238
2021-317865,2021-06-11,000001,Vente,260000,,,PARC CADIOU NESSANT,B837,22700,22134,Louannec,22,,,221340000C2167,,,,,,,,,,,,,0,,,,,S,sols,,,672,-3.429139,48.796272
2021-317865,2021-06-11,000001,Vente,260000,,,PARC CADIOU NESSANT,B837,22700,22134,Louannec,22,,,221340000C2170,,,,,,,,,,,,,0,,,,,S,sols,,,35,-3.429045,48.796647
2021-317902,2021-06-25,000001,Vente,464050,5,,COAT GOURHANT,B289,22700,22134,Louannec,22,,,221340000C0989,,,,,,,,,,,,,0,3,Dépendance,,0,S,sols,,,2014,-3.430387,48.779932
2021-317902,2021-06-25,000001,Vente,464050,5,,COAT GOURHANT,B289,22700,22134,Louannec,22,,,221340000C0989,,,,,,,,,,,,,0,3,Dépendance,,0,S,sols,,,2014,-3.430387,48.779932
2021-317902,2021-06-25,000001,Vente,464050,5,,COAT GOURHANT,B289,22700,22134,Louannec,22,,,221340000C0989,,,,,,,,,,,,,0,1,Maison,148,5,S,sols,,,2014,-3.430387,48.779932
2021-317925,2021-06-05,000001,Vente,25818,,,PARC AR RUMEUR BRAS,B806,22700,22134,Louannec,22,,,22134000AE0528,,,,,,,,,,,,,0,,,,,AB,terrains a bâtir,,,331,-3.417624,48.788046
2021-317940,2021-05-31,000001,Vente,221000,39,,RTE DE TREGUIER,0062,22700,22134,Louannec,22,,,22134000AD0079,,,,,,,,,,,,,0,1,Maison,152,7,S,sols,,,1440,-3.404638,48.79194
2021-317940,2021-05-31,000001,Vente,221000,39,,RTE DE TREGUIER,0062,22700,22134,Louannec,22,,,22134000AD0079,,,,,,,,,,,,,0,3,Dépendance,,0,S,sols,,,1440,-3.404638,48.79194
2021-317940,2021-05-31,000001,Vente,221000,39,,RTE DE TREGUIER,0062,22700,22134,Louannec,22,,,22134000AD0079,,,,,,,,,,,,,0,3,Dépendance,,0,S,sols,,,1440,-3.404638,48.79194
2021-317940,2021-05-31,000001,Vente,221000,39,,RTE DE TREGUIER,0062,22700,22134,Louannec,22,,,22134000AD0079,,,,,,,,,,,,,0,3,Dépendance,,0,S,sols,,,1440,-3.404638,48.79194
2021-317940,2021-05-31,000001,Vente,221000,39,,RTE DE TREGUIER,0062,22700,22134,Louannec,22,,,22134000AD0079,,,,,,,,,,,,,0,3,Dépendance,,0,S,sols,,,1440,-3.404638,48.79194
2021-317974,2021-06-07,000001,Vente,36114,,,PARC AR RUMEUR BRAS,B806,22700,22134,Louannec,22,,,22134000AE0529,,,,,,,,,,,,,0,,,,,AB,terrains a bâtir,,,463,-3.418214,48.788221
2021-317975,2021-06-07,000001,Vente,39936,,,PARC AR RUMEUR BRAS,B806,22700,22134,Louannec,22,,,22134000AE0541,,,,,,,,,,,,,0,,,,,AB,terrains a bâtir,,,348,-3.417074,48.787618
2021-317975,2021-06-07,000001,Vente,39936,,,PARC AR RUMEUR BRAS,B806,22700,22134,Louannec,22,,,22134000AE0545,,,,,,,,,,,,,0,,,,,AB,terrains a bâtir,,,49,-3.416927,48.787706