id_mutation,date_mutation,numero_disposition,nature_mutation,valeur_fonciere,adresse_numero,adresse_suffixe,adresse_nom_voie,adresse_code_voie,code_postal,code_commune,nom_commune,code_departement,ancien_code_commune,ancien_nom_commune,id_parcelle,ancien_id_parcelle,numero_volume,lot1_numero,lot1_surface_carrez,lot2_numero,lot2_surface_carrez,lot3_numero,lot3_surface_carrez,lot4_numero,lot4_surface_carrez,lot5_numero,lot5_surface_carrez,nombre_lots,code_type_local,type_local,surface_reelle_bati,nombre_pieces_principales,code_nature_culture,nature_culture,code_nature_culture_speciale,nature_culture_speciale,surface_terrain,longitude,latitude
2021-303665,2021-09-16,000001,Vente,7500,9,,RUE DE LA GARE,0023,22340,22137,Maël-Carhaix,22,,,22137000AB0099,,,,,,,,,,,,,0,4,Local industriel. commercial ou assimilé,240,0,S,sols,,,437,-3.42316,48.284709
2021-303665,2021-09-16,000001,Vente,7500,,,RUE DE LA GARE,0023,22340,22137,Maël-Carhaix,22,,,22137000AB0237,,,,,,,,,,,,,0,,,,,S,sols,,,75,-3.423302,48.28484
2021-303986,2021-09-15,000001,Vente,12000,,,LE BOURG,B032,22340,22137,Maël-Carhaix,22,,,22137000AB0203,,,,,,,,,,,,,0,,,,,J,jardins,,,274,-3.423269,48.284965
2021-303986,2021-09-15,000001,Vente,12000,11,,RUE DE LA GARE,0023,22340,22137,Maël-Carhaix,22,,,22137000AB0205,,,,,,,,,,,,,0,1,Maison,98,5,S,sols,,,286,-3.423049,48.284786
2021-304204,2021-07-30,000001,Vente,11250,5978,,RUE DE PAULE,0052,22340,22137,Maël-Carhaix,22,,,22137000YO0204,,,,,,,,,,,,,0,3,Dépendance,,0,S,sols,,,1500,-3.432734,48.280104
2021-304843,2021-09-30,000001,Vente,5500,,,LE LANNEC,B146,22340,22137,Maël-Carhaix,22,,,22137000ZT0004,,,,,,,,,,,,,0,,,,,P,prés,,,13230,-3.444781,48.307381
2021-304843,2021-09-30,000001,Vente,5500,,,LE LANNEC,B146,22340,22137,Maël-Carhaix,22,,,22137000ZT0039,,,,,,,,,,,,,0,,,,,T,terres,,,12126,-3.440475,48.307844
2021-304843,2021-09-30,000001,Vente,5500,,,LE LANNEC,B146,22340,22137,Maël-Carhaix,22,,,22137000ZT0039,,,,,,,,,,,,,0,,,,,P,prés,,,5414,-3.440475,48.307844
2021-305086,2021-10-04,000001,Vente,1600,,,PL DU CENTRE,0007,22340,22137,Maël-Carhaix,22,,,22137000AC0383,,,,,,,,,,,,,0,,,,,S,sols,,,16,-3.422906,48.283559
2021-305464,2021-10-08,000001,Vente,86758,,,AR LEUR,B017,22340,22137,Maël-Carhaix,22,,,22137000ZD0097,,,,,,,,,,,,,0,,,,,T,terres,,,573,-3.39278,48.280969
2021-305464,2021-10-08,000001,Vente,86758,,,AR LEUR,B017,22340,22137,Maël-Carhaix,22,,,22137000ZD0097,,,,,,,,,,,,,0,,,,,S,sols,,,20,-3.39278,48.280969
2021-305464,2021-10-08,000001,Vente,86758,,,KERBALEZ COZ,B083,22340,22137,Maël-Carhaix,22,,,22137000ZD0098,,,,,,,,,,,,,0,,,,,S,sols,,,151,-3.392629,48.280966
2021-305464,2021-10-08,000001,Vente,86758,5,,KERBALEZ COZ,B083,22340,22137,Maël-Carhaix,22,,,22137000ZD0099,,,,,,,,,,,,,0,1,Maison,75,3,S,sols,,,159,-3.392811,48.280866
2021-305464,2021-10-08,000001,Vente,86758,,,AR LEUR,B017,22340,22137,Maël-Carhaix,22,,,22137000ZD0169,,,,,,,,,,,,,0,,,,,S,sols,,,81,-3.392659,48.281125
2021-305464,2021-10-08,000001,Vente,86758,,,PARC AR LEUR,B320,22340,22137,Maël-Carhaix,22,,,22137000ZD0176,,,,,,,,,,,,,0,,,,,VE,vergers,,,4600,-3.393729,48.281104
2021-305487,2021-10-12,000001,Vente,100000,7,B,RUE DES ARDOISIERES,0010,22340,22137,Maël-Carhaix,22,,,22137000AB0400,,,,,,,,,,,,,0,1,Maison,90,4,S,sols,,,1599,-3.419582,48.286339
2021-305487,2021-10-12,000001,Vente,100000,7,B,RUE DES ARDOISIERES,0010,22340,22137,Maël-Carhaix,22,,,22137000AB0400,,,,,,,,,,,,,0,3,Dépendance,,0,S,sols,,,1599,-3.419582,48.286339
2021-306134,2021-10-11,000001,Vente,48500,14,,KERGUEMARREC,B100,22340,22137,Maël-Carhaix,22,,,22137000YR0078,,,,,,,,,,,,,0,1,Maison,68,3,T,terres,,,1490,-3.438399,48.294597
2021-306134,2021-10-11,000001,Vente,48500,14,,KERGUEMARREC,B100,22340,22137,Maël-Carhaix,22,,,22137000YR0078,,,,,,,,,,,,,0,1,Maison,68,3,S,sols,,,500,-3.438399,48.294597
2021-306134,2021-10-11,000001,Vente,48500,,,LIORS COZ,B179,22340,22137,Maël-Carhaix,22,,,22137000YR0105,,,,,,,,,,,,,0,,,,,S,sols,,,146,-3.437865,48.29445
2021-306156,2021-10-14,000001,Vente,75000,16,,KERMARIA,B118,22340,22137,Maël-Carhaix,22,,,22137000ZB0085,,,,,,,,,,,,,0,1,Maison,91,3,S,sols,,,617,-3.413966,48.288018
2021-306355,2021-10-13,000001,Vente,69500,1,,RUE LAN MAEL,0035,22340,22137,Maël-Carhaix,22,,,22137000AC0189,,,,,,,,,,,,,0,1,Maison,76,4,S,sols,,,232,-3.421604,48.283871
2021-306383,2021-10-21,000002,Vente,120,,,KERGUEMARREC,B100,22340,22137,Maël-Carhaix,22,,,22137000YR0168,,,,,,,,,,,,,0,,,,,S,sols,,,76,-3.437446,48.295025
2021-306597,2021-10-22,000001,Vente,15327,,,PARC TRIBORN,B619,22340,22137,Maël-Carhaix,22,,,22137000ZA0133,,,,,,,,,,,,,0,,,,,T,terres,,,1703,,
2021-307212,2021-11-03,000001,Vente,135000,,,PARC KERGUEZENNEC,B483,22340,22137,Maël-Carhaix,22,,,22137000YO0139,,,,,,,,,,,,,0,,,,,T,terres,,,103,-3.431341,48.280973
2021-307212,2021-11-03,000001,Vente,135000,32,,RUE DE PAULE,0052,22340,22137,Maël-Carhaix,22,,,22137000YO0140,,,,,,,,,,,,,0,1,Maison,70,3,S,sols,,,1080,-3.431194,48.280841
2021-307502,2021-11-29,000001,Vente,81495,6,,KERMARIA,B118,22340,22137,Maël-Carhaix,22,,,22137000ZB0080,,,,,,,,,,,,,0,1,Maison,40,2,S,sols,,,571,-3.415287,48.28797
2021-307546,2021-11-02,000001,Vente,83000,1,,KERMAREC,B117,22340,22137,Maël-Carhaix,22,,,22137000ZR0107,,,,,,,,,,,,,0,3,Dépendance,,0,S,sols,,,550,-3.413308,48.270295
2021-307546,2021-11-02,000001,Vente,83000,1,,KERMAREC,B117,22340,22137,Maël-Carhaix,22,,,22137000ZR0107,,,,,,,,,,,,,0,3,Dépendance,,0,T,terres,,,673,-3.413308,48.270295
2021-307546,2021-11-02,000001,Vente,83000,1,,KERMAREC,B117,22340,22137,Maël-Carhaix,22,,,22137000ZR0107,,,,,,,,,,,,,0,1,Maison,124,5,S,sols,,,550,-3.413308,48.270295
2021-307546,2021-11-02,000001,Vente,83000,1,,KERMAREC,B117,22340,22137,Maël-Carhaix,22,,,22137000ZR0107,,,,,,,,,,,,,0,1,Maison,124,5,T,terres,,,673,-3.413308,48.270295
2021-307897,2021-11-10,000001,Vente,135000,6,,RUE DES ARDOISIERES,0010,22340,22137,Maël-Carhaix,22,,,22137000AC0116,,,,,,,,,,,,,0,1,Maison,230,9,S,sols,,,781,-3.418814,48.285867
2021-307897,2021-11-10,000001,Vente,135000,,,RUE DES ARDOISIERES,0010,22340,22137,Maël-Carhaix,22,,,22137000AC0117,,,,,,,,,,,,,0,,,,,J,jardins,,,1560,-3.418461,48.285607
2021-308128,2021-11-27,000001,Vente,82000,,,KERGICQUEL HAMON,B093,22340,22137,Maël-Carhaix,22,,,22137000ZH0141,,,,,,,,,,,,,0,,,,,S,sols,,,55,-3.369029,48.292421
2021-308128,2021-11-27,000001,Vente,82000,3,,KERGICQUEL HAMON,B093,22340,22137,Maël-Carhaix,22,,,22137000ZH0144,,,,,,,,,,,,,0,1,Maison,77,3,S,sols,,,198,-3.369065,48.292522
2021-308128,2021-11-27,000001,Vente,82000,,,PARC AR MAI TY,B321,22340,22137,Maël-Carhaix,22,,,22137000ZH0147,,,,,,,,,,,,,0,,,,,P,prés,,,418,-3.36891,48.292481
2021-308128,2021-11-27,000001,Vente,82000,,,PARC AR MAI TY,B321,22340,22137,Maël-Carhaix,22,,,22137000ZH0147,,,,,,,,,,,,,0,,,,,T,terres,,,322,-3.36891,48.292481
2021-308539,2021-11-17,000001,Vente,52000,6,,RUE DE PONT ROD,0056,22340,22137,Maël-Carhaix,22,,,22137000YO0125,,,,,,,,,,,,,0,1,Maison,71,3,S,sols,,,615,-3.430025,48.281446
2021-308539,2021-11-17,000001,Vente,52000,,,PARC MAR,B518,22340,22137,Maël-Carhaix,22,,,22137000YO0126,,,,,,,,,,,,,0,,,,,T,terres,,,153,-3.430135,48.281482
2021-308839,2021-11-26,000001,Vente,8325,,,RUE DE PAULE,0052,22340,22137,Maël-Carhaix,22,,,22137000YH0176,,,,,,,,,,,,,0,,,,,T,terres,,,555,-3.425767,48.281739
2021-308932,2021-12-15,000001,Vente,106000,7,,RUE DU STADE,0085,22340,22137,Maël-Carhaix,22,,,22137000AB0188,,,,,,,,,,,,,0,1,Maison,132,5,T,terres,,,712,-3.427564,48.282177
2021-309270,2021-10-22,000002,Vente,105000,12,,KERVOUGAR,B133,22340,22137,Maël-Carhaix,22,,,22137000YL0291,,,,,,,,,,,,,0,1,Maison,97,4,,,,,,-3.42518,48.277399
2021-309270,2021-10-22,000002,Vente,105000,12,,KERVOUGAR,B133,22340,22137,Maël-Carhaix,22,,,22137000YL0291,,,,,,,,,,,,,0,3,Dépendance,,0,,,,,,-3.42518,48.277399
2021-309270,2021-10-22,000002,Vente,105000,12,,KERVOUGAR,B133,22340,22137,Maël-Carhaix,22,,,22137000YL0291,,,,,,,,,,,,,0,3,Dépendance,,0,,,,,,-3.42518,48.277399
2021-309270,2021-10-22,000002,Vente,105000,12,,KERVOUGAR,B133,22340,22137,Maël-Carhaix,22,,,22137000YL0291,,,,,,,,,,,,,0,1,Maison,79,3,,,,,,-3.42518,48.277399
2021-309282,2021-11-30,000001,Vente,138000,22,,RUE SAINTE CATHERINE,0075,22340,22137,Maël-Carhaix,22,,,22137000YP0082,,,,,,,,,,,,,0,1,Maison,70,3,S,sols,,,883,-3.426815,48.286958
2021-309856,2021-12-23,000001,Vente,58000,7,,RUE DU PERE MAUNOIR,0054,22340,22137,Maël-Carhaix,22,,,22137000AC0073,,,,,,,,,,,,,0,1,Maison,76,3,S,sols,,,105,-3.422015,48.284506
2021-314261,2021-01-08,000001,Vente,70000,,,LIORS MONTEN,B197,22340,22137,Maël-Carhaix,22,,,22137000ZP0125,,,,,,,,,,,,,0,,,,,T,terres,,,700,-3.388768,48.277436
2021-314261,2021-01-08,000001,Vente,70000,,,PAR AN TY NEVEZ,B222,22340,22137,Maël-Carhaix,22,,,22137000ZP0126,,,,,,,,,,,,,0,,,,,S,sols,,,240,-3.388395,48.277579
2021-314261,2021-01-08,000001,Vente,70000,,,PARC AN TY,B272,22340,22137,Maël-Carhaix,22,,,22137000ZP0127,,,,,,,,,,,,,0,,,,,T,terres,,,203,-3.3883,48.277617
2021-314261,2021-01-08,000001,Vente,70000,5,,QUILLIOU GUEGUEN,B766,22340,22137,Maël-Carhaix,22,,,22137000ZP0128,,,,,,,,,,,,,0,1,Maison,86,3,S,sols,,,84,-3.388145,48.277567
2021-314261,2021-01-08,000001,Vente,70000,,,PARC AN TY,B272,22340,22137,Maël-Carhaix,22,,,22137000ZP0129,,,,,,,,,,,,,0,,,,,T,terres,,,1277,-3.388249,48.27743
2021-314263,2021-01-08,000001,Vente,500,,,RUE SAINTE CATHERINE,0075,22340,22137,Maël-Carhaix,22,,,22137000AB0228,,,,,,,,,,,,,0,,,,,S,sols,,,36,-3.424875,48.285182
2021-314263,2021-01-08,000001,Vente,500,,,PARC AR LEUR,B320,22340,22137,Maël-Carhaix,22,,,22137000AB0282,,,,,,,,,,,,,0,,,,,T,terres,,,1089,-3.423806,48.284823
2021-314263,2021-01-08,000001,Vente,500,,,PARC AR LEUR,B320,22340,22137,Maël-Carhaix,22,,,22137000AB0284,,,,,,,,,,,,,0,,,,,T,terres,,,800,-3.424501,48.28512
2021-314332,2021-01-20,000001,Vente,6000,,,QUILLIOU GUEGUEN,B766,22340,22137,Maël-Carhaix,22,,,22137000ZP0130,,,,,,,,,,,,,0,,,,,S,sols,,,450,-3.388178,48.27715
2021-314332,2021-01-20,000001,Vente,6000,,,QUILLIOU GUEGUEN,B766,22340,22137,Maël-Carhaix,22,,,22137000ZP0130,,,,,,,,,,,,,0,,,,,T,terres,,,958,-3.388178,48.27715
2021-314341,2021-01-15,000001,Vente,118000,5787,,RUE SAINTE CATHERINE,0075,22340,22137,Maël-Carhaix,22,,,22137000AB0014,,,,,,,,,,,,,0,3,Dépendance,,0,S,sols,,,188,-3.425729,48.286184
2021-314341,2021-01-15,000001,Vente,118000,,,RUE SAINTE CATHERINE,0075,22340,22137,Maël-Carhaix,22,,,22137000AB0016,,,,,,,,,,,,,0,,,,,S,sols,,,312,-3.425925,48.286258
2021-314341,2021-01-15,000001,Vente,118000,14,B,RUE SAINTE CATHERINE,0075,22340,22137,Maël-Carhaix,22,,,22137000AB0017,,,,,,,,,,,,,0,1,Maison,106,5,S,sols,,,847,-3.42567,48.286383
2021-314341,2021-01-15,000001,Vente,118000,,,LE BOURG,B032,22340,22137,Maël-Carhaix,22,,,22137000AB0333,,,,,,,,,,,,,0,,,,,L,landes,,,91,-3.425568,48.286503
2021-314341,2021-01-15,000001,Vente,118000,,,LE BOURG,B032,22340,22137,Maël-Carhaix,22,,,22137000AB0334,,,,,,,,,,,,,0,,,,,L,landes,,,69,-3.425495,48.286342
2021-314341,2021-01-15,000001,Vente,118000,,,LE VERGER,B795,22340,22137,Maël-Carhaix,22,,,22137000AB0335,,,,,,,,,,,,,0,,,,,VE,vergers,,,772,-3.425405,48.28659
2021-314435,2021-01-22,000001,Vente,191000,,,KEROGUIOU,B122,22340,22137,Maël-Carhaix,22,,,22137000YM0038,,,,,,,,,,,,,0,,,,,T,terres,,,5835,-3.467335,48.272848
2021-314435,2021-01-22,000001,Vente,191000,,,KEROGUIOU,B122,22340,22137,Maël-Carhaix,22,,,22137000YM0038,,,,,,,,,,,,,0,,,,,T,terres,,,17505,-3.467335,48.272848
2021-314435,2021-01-22,000001,Vente,191000,,,KEROGUIOU,B122,22340,22137,Maël-Carhaix,22,,,22137000YM0039,,,,,,,,,,,,,0,,,,,T,terres,,,7880,-3.466688,48.273328
2021-314435,2021-01-22,000001,Vente,191000,,,KEROGUIOU,B122,22340,22137,Maël-Carhaix,22,,,22137000YM0040,,,,,,,,,,,,,0,,,,,T,terres,,,27435,-3.464491,48.273203
2021-314435,2021-01-22,000001,Vente,191000,,,KEROGUIOU,B122,22340,22137,Maël-Carhaix,22,,,22137000YM0040,,,,,,,,,,,,,0,,,,,T,terres,,,9145,-3.464491,48.273203
2021-314435,2021-01-22,000001,Vente,191000,,,ROCK AN BURTUL,B773,22340,22137,Maël-Carhaix,22,,,22137000YM0045,,,,,,,,,,,,,0,,,,,P,prés,,,2000,-3.461649,48.276615
2021-314435,2021-01-22,000001,Vente,191000,,,ROCK AN BURTUL,B773,22340,22137,Maël-Carhaix,22,,,22137000YM0045,,,,,,,,,,,,,0,,,,,P,prés,,,6000,-3.461649,48.276615
2021-314435,2021-01-22,000001,Vente,191000,,,ROCK AN BURTUL,B773,22340,22137,Maël-Carhaix,22,,,22137000YM0047,,,,,,,,,,,,,0,,,,,T,terres,,,7940,-3.462985,48.27713
2021-314435,2021-01-22,000001,Vente,191000,,,ROCK AN BURTUL,B773,22340,22137,Maël-Carhaix,22,,,22137000YM0047,,,,,,,,,,,,,0,,,,,T,terres,,,15880,-3.462985,48.27713
2021-314435,2021-01-22,000001,Vente,191000,,,ROCK AN BURTUL,B773,22340,22137,Maël-Carhaix,22,,,22137000YM0048,,,,,,,,,,,,,0,,,,,L,landes,,,13160,-3.464862,48.278367
2021-314435,2021-01-22,000001,Vente,191000,,,ROCK AN BURTUL,B773,22340,22137,Maël-Carhaix,22,,,22137000YM0048,,,,,,,,,,,,,0,,,,,T,terres,,,10000,-3.464862,48.278367
2021-314435,2021-01-22,000001,Vente,191000,,,ROCK AN BURTUL,B773,22340,22137,Maël-Carhaix,22,,,22137000YM0048,,,,,,,,,,,,,0,,,,,T,terres,,,30000,-3.464862,48.278367
2021-314435,2021-01-22,000001,Vente,191000,,,ROCK AN BURTUL,B773,22340,22137,Maël-Carhaix,22,,,22137000YM0060,,,,,,,,,,,,,0,,,,,T,terres,,,43030,-3.462914,48.278743
2021-314665,2021-03-09,000001,Vente,3476,,,RUE PONT PUT,0055,22340,22137,Maël-Carhaix,22,,,22137000AC0012,,,,,,,,,,,,,0,,,,,J,jardins,,,316,-3.423301,48.28244
2021-314689,2021-03-08,000001,Vente,500,,,KERMAREC,B117,22340,22137,Maël-Carhaix,22,,,22137000YH0075,,,,,,,,,,,,,0,,,,,S,sols,,,103,-3.415162,48.268964
2021-314808,2021-03-22,000001,Vente,65000,4,,KERGILBERT,B095,22340,22137,Maël-Carhaix,22,,,22137000ZR0010,,,,,,,,,,,,,0,1,Maison,62,3,T,terres,,,4520,-3.411702,48.278689
2021-314808,2021-03-22,000001,Vente,65000,4,,KERGILBERT,B095,22340,22137,Maël-Carhaix,22,,,22137000ZR0010,,,,,,,,,,,,,0,1,Maison,62,3,S,sols,,,670,-3.411702,48.278689
2021-315038,2021-04-22,000001,Vente,67000,3,,KERMARIA,B118,22340,22137,Maël-Carhaix,22,,,22137000ZA0147,,,,,,,,,,,,,0,1,Maison,70,4,S,sols,,,632,-3.417495,48.287197
2021-315048,2021-04-16,000001,Vente,3100,,,KERDOUPIN,B090,22340,22137,Maël-Carhaix,22,,,22137000ZX0029,,,,,,,,,,,,,0,,,,,T,terres,,,8880,-3.419309,48.303876
2021-315085,2021-04-21,000001,Vente,230000,,,KER ANNA,B078,22340,22137,Maël-Carhaix,22,,,22137000ZC0168,,,,,,,,,,,,,0,,,,,S,sols,,,77,-3.415075,48.280701
2021-315085,2021-04-21,000001,Vente,230000,1,,IMP DE KERGILBERT,0027,22340,22137,Maël-Carhaix,22,,,22137000ZC0237,,,,,,,,,,,,,0,1,Maison,169,6,AG,terrains d'agrément,,,2904,-3.415169,48.280585
2021-315085,2021-04-21,000001,Vente,230000,1,,IMP DE KERGILBERT,0027,22340,22137,Maël-Carhaix,22,,,22137000ZC0237,,,,,,,,,,,,,0,1,Maison,169,6,S,sols,,,500,-3.415169,48.280585
2021-315098,2021-04-16,000001,Vente,40500,,,LE LANNEC,B146,22340,22137,Maël-Carhaix,22,,,22137000ZT0015,,,,,,,,,,,,,0,,,,,P,prés,,,4660,-3.439216,48.312842
2021-315098,2021-04-16,000001,Vente,40500,,,LE LANNEC,B146,22340,22137,Maël-Carhaix,22,,,22137000ZT0015,,,,,,,,,,,,,0,,,,,P,prés,,,4660,-3.439216,48.312842
2021-315098,2021-04-16,000001,Vente,40500,,,LE LANNEC,B146,22340,22137,Maël-Carhaix,22,,,22137000ZT0015,,,,,,,,,,,,,0,,,,,T,terres,,,71630,-3.439216,48.312842
2021-315148,2021-05-11,000001,Vente,120000,18,,LA MONTAGNE,B215,22340,22137,Maël-Carhaix,22,,,22137000ZP0117,,,,,,,,,,,,,0,1,Maison,150,4,S,sols,,,889,-3.392079,48.276911
2021-315148,2021-05-11,000001,Vente,120000,,,PARC AR LEUR,B320,22340,22137,Maël-Carhaix,22,,,22137000ZP0188,,,,,,,,,,,,,0,,,,,J,jardins,,,437,-3.392088,48.276801
2021-315148,2021-05-11,000001,Vente,120000,,,PARC AR LEUR,B320,22340,22137,Maël-Carhaix,22,,,22137000ZP0189,,,,,,,,,,,,,0,,,,,T,terres,,,9362,-3.391493,48.276626
2021-315148,2021-05-11,000001,Vente,120000,,,PARC AR LEUR,B320,22340,22137,Maël-Carhaix,22,,,22137000ZP0189,,,,,,,,,,,,,0,,,,,T,terres,,,9361,-3.391493,48.276626
2021-315152,2021-04-29,000001,Vente,25150,,,LE LANNEC,B146,22340,22137,Maël-Carhaix,22,,,22137000ZT0045,,,,,,,,,,,,,0,,,,,T,terres,,,33507,-3.441432,48.310523
2021-315152,2021-04-29,000001,Vente,25150,,,LE LANNEC,B146,22340,22137,Maël-Carhaix,22,,,22137000ZT0045,,,,,,,,,,,,,0,,,,,T,terres,,,16753,-3.441432,48.310523
2021-315177,2021-04-30,000001,Vente,220000,2,,QUILLIOU GUEGUEN,B766,22340,22137,Maël-Carhaix,22,,,22137000ZP0036,,,,,,,,,,,,,0,1,Maison,166,6,S,sols,,,2880,-3.390093,48.27652
2021-315238,2021-05-11,000001,Vente,50000,,,RUE DES ARDOISIERES,0010,22340,22137,Maël-Carhaix,22,,,22137000AC0118,,,,,,,,,,,,,0,,,,,J,jardins,,,500,-3.418337,48.28578
2021-315238,2021-05-11,000001,Vente,50000,8,,RUE DES ARDOISIERES,0010,22340,22137,Maël-Carhaix,22,,,22137000AC0119,,,,,,,,,,,,,0,1,Maison,35,3,S,sols,,,233,-3.418583,48.286016
2021-315247,2021-05-26,000001,Vente,100000,1,,KERBIQUET,B085,22340,22137,Maël-Carhaix,22,,,22137000ZB0028,,,,,,,,,,,,,0,1,Maison,44,2,T,terres,,,9280,-3.403828,48.290635
2021-315247,2021-05-26,000001,Vente,100000,1,,KERBIQUET,B085,22340,22137,Maël-Carhaix,22,,,22137000ZB0028,,,,,,,,,,,,,0,1,Maison,44,2,S,sols,,,360,-3.403828,48.290635
2021-315247,2021-05-26,000001,Vente,100000,,,LIORS AN ISSUE,B153,22340,22137,Maël-Carhaix,22,,,22137000ZB0135,,,,,,,,,,,,,0,,,,,L,landes,,,10,-3.403893,48.291507
2021-315247,2021-05-26,000001,Vente,100000,,,PARC AR VERGER,B362,22340,22137,Maël-Carhaix,22,,,22137000ZB0142,,,,,,,,,,,,,0,,,,,J,jardins,,,236,-3.403897,48.291459
2021-315256,2021-05-12,000001,Vente,68750,,,KERGILBERT,B095,22340,22137,Maël-Carhaix,22,,,22137000ZC0221,,,,,,,,,,,,,0,,,,,T,terres,,,11173,-3.411517,48.280022
2021-315256,2021-05-12,000001,Vente,68750,,,KERGILBERT,B095,22340,22137,Maël-Carhaix,22,,,22137000ZC0222,,,,,,,,,,,,,0,,,,,S,sols,,,156,-3.410434,48.279915
2021-315256,2021-05-12,000001,Vente,68750,,,KERGILBERT,B095,22340,22137,Maël-Carhaix,22,,,22137000ZC0222,,,,,,,,,,,,,0,,,,,T,terres,,,2485,-3.410434,48.279915
2021-315256,2021-05-12,000001,Vente,68750,,,KERGILBERT,B095,22340,22137,Maël-Carhaix,22,,,22137000ZC0224,,,,,,,,,,,,,0,,,,,S,sols,,,66,-3.410269,48.279367
2021-315256,2021-05-12,000001,Vente,68750,,,KERGILBERT,B095,22340,22137,Maël-Carhaix,22,,,22137000ZC0225,,,,,,,,,,,,,0,,,,,S,sols,,,70,-3.410159,48.279405
2021-315256,2021-05-12,000001,Vente,68750,,,KERGILBERT,B095,22340,22137,Maël-Carhaix,22,,,22137000ZC0226,,,,,,,,,,,,,0,,,,,T,terres,,,271,-3.410129,48.279794
2021-315256,2021-05-12,000001,Vente,68750,21,,KERGILBERT,B095,22340,22137,Maël-Carhaix,22,,,22137000ZC0227,,,,,,,,,,,,,0,1,Maison,101,5,S,sols,,,519,-3.409908,48.279609
2021-315256,2021-05-12,000001,Vente,68750,19,,KERGILBERT,B095,22340,22137,Maël-Carhaix,22,,,22137000ZC0229,,,,,,,,,,,,,0,1,Maison,40,2,S,sols,,,153,-3.410095,48.279562
2021-315256,2021-05-12,000001,Vente,68750,,,KERGILBERT,B095,22340,22137,Maël-Carhaix,22,,,22137000ZC0230,,,,,,,,,,,,,0,,,,,S,sols,,,291,-3.410007,48.279535
2021-315256,2021-05-12,000001,Vente,68750,,,KERGILBERT,B095,22340,22137,Maël-Carhaix,22,,,22137000ZC0231,,,,,,,,,,,,,0,,,,,S,sols,,,44,-3.410051,48.279425
2021-315256,2021-05-12,000001,Vente,68750,,,KERGILBERT,B095,22340,22137,Maël-Carhaix,22,,,22137000ZC0232,,,,,,,,,,,,,0,,,,,S,sols,,,2,-3.410034,48.279374
2021-315258,2021-05-26,000002,Vente,124500,,,PARC BRAS,B387,22340,22137,Maël-Carhaix,22,,,22137000ZB0026,,,,,,,,,,,,,0,,,,,T,terres,,,7860,-3.404747,48.29001
2021-315258,2021-05-26,000002,Vente,124500,,,PARC BRAS,B387,22340,22137,Maël-Carhaix,22,,,22137000ZB0027,,,,,,,,,,,,,0,,,,,T,terres,,,4310,-3.404351,48.290233
2021-315258,2021-05-26,000002,Vente,124500,,,THOBIGUET,B793,22340,22137,Maël-Carhaix,22,,,22137000ZB0061,,,,,,,,,,,,,0,,,,,T,terres,,,7120,-3.405012,48.29117
2021-315258,2021-05-26,000002,Vente,124500,,,THOBIGUET,B793,22340,22137,Maël-Carhaix,22,,,22137000ZB0061,,,,,,,,,,,,,0,,,,,S,sols,,,1020,-3.405012,48.29117
2021-315258,2021-05-26,000002,Vente,124500,,,THOBIGUET,B793,22340,22137,Maël-Carhaix,22,,,22137000ZB0061,,,,,,,,,,,,,0,,,,,T,terres,,,2560,-3.405012,48.29117
2021-315258,2021-05-26,000002,Vente,124500,,,PARC AR VERGER,B362,22340,22137,Maël-Carhaix,22,,,22137000ZB0134,,,,,,,,,,,,,0,,,,,S,sols,,,720,-3.405775,48.291767
2021-315258,2021-05-26,000002,Vente,124500,,,PARC AR VERGER,B362,22340,22137,Maël-Carhaix,22,,,22137000ZB0134,,,,,,,,,,,,,0,,,,,T,terres,,,18097,-3.405775,48.291767
2021-315258,2021-05-26,000002,Vente,124500,,,PARC AR VERGER,B362,22340,22137,Maël-Carhaix,22,,,22137000ZB0143,,,,,,,,,,,,,0,,,,,S,sols,,,39,-3.404358,48.291702
2021-315258,2021-05-26,000002,Vente,124500,,,KERBIQUET,B085,22340,22137,Maël-Carhaix,22,,,22137000ZB0149,,,,,,,,,,,,,0,,,,,S,sols,,,325,-3.403545,48.291632
2021-315402,2021-06-03,000001,Vente,25000,,,KERVRIAND,B134,22340,22137,Maël-Carhaix,22,,,22137000ZV0051,,,,,,,,,,,,,0,,,,,BF,futaies feuillues,,,2240,-3.432891,48.310888
2021-315402,2021-06-03,000001,Vente,25000,,,KERVRIAND,B134,22340,22137,Maël-Carhaix,22,,,22137000ZV0104,,,,,,,,,,,,,0,,,,,S,sols,,,34,-3.432648,48.31066
2021-315402,2021-06-03,000001,Vente,25000,4,,KERVRIAND,B134,22340,22137,Maël-Carhaix,22,,,22137000ZV0105,,,,,,,,,,,,,0,1,Maison,140,3,S,sols,,,1044,-3.432871,48.310584
2021-315459,2021-06-11,000001,Vente,84000,13,,RUE DE LA GARE,0023,22340,22137,Maël-Carhaix,22,,,22137000AB0080,,,,,,,,,,,,,0,1,Maison,141,6,S,sols,,,145,-3.422849,48.284799
2021-315459,2021-06-11,000001,Vente,84000,,,RUE DE LA GARE,0023,22340,22137,Maël-Carhaix,22,,,22137000AB0165,,,,,,,,,,,,,0,,,,,S,sols,,,122,-3.422971,48.284866
2021-315459,2021-06-11,000001,Vente,84000,,,LE BOURG,B032,22340,22137,Maël-Carhaix,22,,,22137000AB0204,,,,,,,,,,,,,0,,,,,J,jardins,,,283,-3.423204,48.285032
2021-315459,2021-06-11,000001,Vente,84000,,,RUE DE LA GARE,0023,22340,22137,Maël-Carhaix,22,,,22137000AB0206,,,,,,,,,,,,,0,,,,,S,sols,,,5,-3.422929,48.284773
2021-315483,2021-06-10,000001,Vente,6000,,,PARC VINGLIN,B622,22340,22137,Maël-Carhaix,22,,,22137000ZM0007,,,,,,,,,,,,,0,,,,,T,terres,,,16560,-3.38456,48.269321
2021-315483,2021-06-10,000001,Vente,6000,,,PARC TIRIENNO,B612,22340,22137,Maël-Carhaix,22,,,22137000ZM0045,,,,,,,,,,,,,0,,,,,T,terres,,,4220,-3.383328,48.267385
2021-315483,2021-06-10,000001,Vente,6000,,,PARC TIRIENNO,B612,22340,22137,Maël-Carhaix,22,,,22137000ZM0045,,,,,,,,,,,,,0,,,,,T,terres,,,4220,-3.383328,48.267385
2021-315513,2021-06-18,000001,Vente,150000,,,PARC MEUR,B535,22340,22137,Maël-Carhaix,22,,,22137000ZN0004,,,,,,,,,,,,,0,,,,,T,terres,,,59911,-3.387378,48.261975
2021-315513,2021-06-18,000001,Vente,150000,,,PARC MEUR,B535,22340,22137,Maël-Carhaix,22,,,22137000ZN0004,,,,,,,,,,,,,0,,,,,P,prés,,,28711,-3.387378,48.261975
2021-315513,2021-06-18,000001,Vente,150000,,,PARC MEUR,B535,22340,22137,Maël-Carhaix,22,,,22137000ZN0004,,,,,,,,,,,,,0,,,,,T,terres,,,59910,-3.387378,48.261975
2021-315513,2021-06-18,000001,Vente,150000,,,PARC MEUR,B535,22340,22137,Maël-Carhaix,22,,,22137000ZN0004,,,,,,,,,,,,,0,,,,,L,landes,,,27848,-3.387378,48.261975
2021-315513,2021-06-18,000001,Vente,150000,,,PRAT LANDELAZEC,B726,22340,22137,Maël-Carhaix,22,,,22137000ZN0010,,,,,,,,,,,,,0,,,,,T,terres,,,9594,-3.390288,48.259119
2021-315513,2021-06-18,000001,Vente,150000,,,PRAT LANDELAZEC,B726,22340,22137,Maël-Carhaix,22,,,22137000ZN0010,,,,,,,,,,,,,0,,,,,T,terres,,,15292,-3.390288,48.259119
2021-315513,2021-06-18,000001,Vente,150000,,,PRAT LANDELAZEC,B726,22340,22137,Maël-Carhaix,22,,,22137000ZN0010,,,,,,,,,,,,,0,,,,,P,prés,,,7494,-3.390288,48.259119
2021-315513,2021-06-18,000001,Vente,150000,,,PARC MOULLEC BIAN,B546,22340,22137,Maël-Carhaix,22,,,22137000ZN0012,,,,,,,,,,,,,0,,,,,L,landes,,,29615,-3.391907,48.262561
2021-315513,2021-06-18,000001,Vente,150000,,,PARC MOULLEC BIAN,B546,22340,22137,Maël-Carhaix,22,,,22137000ZN0012,,,,,,,,,,,,,0,,,,,T,terres,,,33028,-3.391907,48.262561
2021-315513,2021-06-18,000001,Vente,150000,,,PARC MOULLEC BIAN,B546,22340,22137,Maël-Carhaix,22,,,22137000ZN0012,,,,,,,,,,,,,0,,,,,T,terres,,,64467,-3.391907,48.262561
2021-315513,2021-06-18,000001,Vente,150000,,,PARC MOULLEC BIAN,B546,22340,22137,Maël-Carhaix,22,,,22137000ZN0012,,,,,,,,,,,,,0,,,,,S,sols,,,1590,-3.391907,48.262561