id_mutation,date_mutation,numero_disposition,nature_mutation,valeur_fonciere,adresse_numero,adresse_suffixe,adresse_nom_voie,adresse_code_voie,code_postal,code_commune,nom_commune,code_departement,ancien_code_commune,ancien_nom_commune,id_parcelle,ancien_id_parcelle,numero_volume,lot1_numero,lot1_surface_carrez,lot2_numero,lot2_surface_carrez,lot3_numero,lot3_surface_carrez,lot4_numero,lot4_surface_carrez,lot5_numero,lot5_surface_carrez,nombre_lots,code_type_local,type_local,surface_reelle_bati,nombre_pieces_principales,code_nature_culture,nature_culture,code_nature_culture_speciale,nature_culture_speciale,surface_terrain,longitude,latitude
2021-304701,2021-10-12,000001,Vente,90000,6,,RTE DES ECOLES,0009,22110,22146,Mellionnec,22,,,22146000AB0189,,,,,,,,,,,,,0,3,Dépendance,,0,S,sols,,,467,-3.295958,48.173921
2021-304701,2021-10-12,000001,Vente,90000,6,,RTE DES ECOLES,0009,22110,22146,Mellionnec,22,,,22146000AB0189,,,,,,,,,,,,,0,3,Dépendance,,0,S,sols,,,467,-3.295958,48.173921
2021-304701,2021-10-12,000001,Vente,90000,6,,RTE DES ECOLES,0009,22110,22146,Mellionnec,22,,,22146000AB0189,,,,,,,,,,,,,0,1,Maison,103,5,S,sols,,,467,-3.295958,48.173921
2021-305321,2021-10-08,000001,Vente,7500,3,,PL DE L EGLISE,0011,22110,22146,Mellionnec,22,,,22146000AB0172,,,,,,,,,,,,,0,1,Maison,30,1,S,sols,,,38,-3.297242,48.174198
2021-305328,2021-10-08,000001,Vente,7500,1,,PL DE L EGLISE,0011,22110,22146,Mellionnec,22,,,22146000AB0173,,,,,,,,,,,,,0,1,Maison,28,1,S,sols,,,42,-3.297256,48.174271
2021-306398,2021-10-21,000001,Vente,172600,34,,PONT CROIX,C299,22110,22146,Mellionnec,22,,,22146000WE0076,,,,,,,,,,,,,0,1,Maison,70,4,T,terres,,,8444,-3.296999,48.179152
2021-306398,2021-10-21,000001,Vente,172600,34,,PONT CROIX,C299,22110,22146,Mellionnec,22,,,22146000WE0076,,,,,,,,,,,,,0,1,Maison,70,4,S,sols,,,398,-3.296999,48.179152
2021-306731,2021-10-19,000001,Vente,35000,2,,RTE DES ECOLES,0009,22110,22146,Mellionnec,22,,,22146000AB0154,,,,,,,,,,,,,0,1,Maison,120,4,S,sols,,,148,-3.296422,48.173867
2021-307160,2021-11-16,000001,Vente,296340,5218,B,KERNOMBRE,B219,22110,22146,Mellionnec,22,,,22146000WA0086,,,,,,,,,,,,,0,1,Maison,135,4,T,terres,,,1235,-3.302809,48.183541
2021-307160,2021-11-16,000001,Vente,296340,5218,B,KERNOMBRE,B219,22110,22146,Mellionnec,22,,,22146000WA0086,,,,,,,,,,,,,0,1,Maison,135,4,T,terres,,,3706,-3.302809,48.183541
2021-307160,2021-11-16,000001,Vente,296340,,,KERNOMBRE,B219,22110,22146,Mellionnec,22,,,22146000WA0113,,,,,,,,,,,,,0,,,,,J,jardins,,,480,-3.303157,48.183577
2021-307160,2021-11-16,000001,Vente,296340,,,KERNOMBRE,B219,22110,22146,Mellionnec,22,,,22146000WA0115,,,,,,,,,,,,,0,,,,,S,sols,,,3,-3.303341,48.183371
2021-307949,2021-11-26,000001,Vente,106000,,,L HOMELUS,B192,22110,22146,Mellionnec,22,,,22146000WR0064,,,,,,,,,,,,,0,,,,,T,terres,,,7413,-3.28799,48.156852
2021-307949,2021-11-26,000001,Vente,106000,,,L HOMELUS,B192,22110,22146,Mellionnec,22,,,22146000WR0064,,,,,,,,,,,,,0,,,,,T,terres,,,2948,-3.28799,48.156852
2021-307949,2021-11-26,000001,Vente,106000,,,L HOMELUS,B192,22110,22146,Mellionnec,22,,,22146000WR0064,,,,,,,,,,,,,0,,,,,T,terres,,,5897,-3.28799,48.156852
2021-307949,2021-11-26,000001,Vente,106000,,,L HOMELUS,B192,22110,22146,Mellionnec,22,,,22146000WR0064,,,,,,,,,,,,,0,,,,,L,landes,,,41578,-3.28799,48.156852
2021-307949,2021-11-26,000001,Vente,106000,,,L HOMELUS,B192,22110,22146,Mellionnec,22,,,22146000WR0074,,,,,,,,,,,,,0,,,,,T,terres,,,4129,-3.294458,48.153121
2021-307949,2021-11-26,000001,Vente,106000,,,L HOMELUS,B192,22110,22146,Mellionnec,22,,,22146000WR0074,,,,,,,,,,,,,0,,,,,L,landes,,,7954,-3.294458,48.153121
2021-307949,2021-11-26,000001,Vente,106000,,,L HOMELUS,B192,22110,22146,Mellionnec,22,,,22146000WR0074,,,,,,,,,,,,,0,,,,,T,terres,,,2643,-3.294458,48.153121
2021-307949,2021-11-26,000001,Vente,106000,,,L HOMELUS,B192,22110,22146,Mellionnec,22,,,22146000WR0074,,,,,,,,,,,,,0,,,,,BT,taillis simples,,,7954,-3.294458,48.153121
2021-307949,2021-11-26,000001,Vente,106000,,,L HOMELUS,B192,22110,22146,Mellionnec,22,,,22146000WR0076,,,,,,,,,,,,,0,,,,,BR,futaies résineuses,,,3290,-3.295446,48.153173
2021-307949,2021-11-26,000001,Vente,106000,,,L HOMELUS,B192,22110,22146,Mellionnec,22,,,22146000WR0081,,,,,,,,,,,,,0,,,,,T,terres,,,34070,-3.290529,48.153978
2021-307949,2021-11-26,000001,Vente,106000,,,L HOMELUS,B192,22110,22146,Mellionnec,22,,,22146000WR0081,,,,,,,,,,,,,0,,,,,L,landes,,,2990,-3.290529,48.153978
2021-307949,2021-11-26,000001,Vente,106000,,,L HOMELUS,B192,22110,22146,Mellionnec,22,,,22146000WR0102,,,,,,,,,,,,,0,,,,,S,sols,,,53,-3.293885,48.156885
2021-307949,2021-11-26,000001,Vente,106000,,,L HOMELUS,B192,22110,22146,Mellionnec,22,,,22146000WR0104,,,,,,,,,,,,,0,,,,,T,terres,,,1457,-3.293538,48.15686
2021-307949,2021-11-26,000001,Vente,106000,,,L HOMELUS,B192,22110,22146,Mellionnec,22,,,22146000WR0104,,,,,,,,,,,,,0,,,,,S,sols,,,153,-3.293538,48.15686
2021-307949,2021-11-26,000001,Vente,106000,,,L HOMELUS,B192,22110,22146,Mellionnec,22,,,22146000WR0106,,,,,,,,,,,,,0,,,,,S,sols,,,69,-3.293966,48.156629
2021-307949,2021-11-26,000001,Vente,106000,,,MENEZ HAMON,B325,22110,22146,Mellionnec,22,,,22146000WR0118,,,,,,,,,,,,,0,,,,,BR,futaies résineuses,,,7630,-3.300256,48.157026
2021-308767,2021-11-26,000001,Vente,55700,21,,RTE DES ECOLES,0009,22110,22146,Mellionnec,22,,,22146000AB0270,,,,,,,,,,,,,0,1,Maison,95,6,S,sols,,,809,-3.292968,48.174124
2021-309285,2021-12-23,000001,Vente,90000,33,,RTE DES ECOLES,0009,22110,22146,Mellionnec,22,,,22146000AB0263,,,,,,,,,,,,,0,1,Maison,70,4,S,sols,,,8790,-3.290254,48.174003
2021-309285,2021-12-23,000001,Vente,90000,33,,RTE DES ECOLES,0009,22110,22146,Mellionnec,22,,,22146000AB0263,,,,,,,,,,,,,0,1,Maison,70,4,BR,futaies résineuses,,,2499,-3.290254,48.174003
2021-309285,2021-12-23,000001,Vente,90000,33,,RTE DES ECOLES,0009,22110,22146,Mellionnec,22,,,22146000AB0263,,,,,,,,,,,,,0,1,Maison,70,4,T,terres,,,1212,-3.290254,48.174003
2021-309285,2021-12-23,000001,Vente,90000,33,,RTE DES ECOLES,0009,22110,22146,Mellionnec,22,,,22146000AB0263,,,,,,,,,,,,,0,1,Maison,70,4,J,jardins,,,1106,-3.290254,48.174003
2021-309549,2021-12-08,000001,Vente,86000,16,,RTE DE GOUAREC,0018,22110,22146,Mellionnec,22,,,22146000AB0066,,,,,,,,,,,,,0,1,Maison,62,2,S,sols,,,276,-3.294741,48.175157
2021-310355,2021-12-22,000001,Vente,1000,,,RTE DE GOUAREC,0018,22110,22146,Mellionnec,22,,,22146000AB0246,,,,,,,,,,,,,0,,,,,J,jardins,,,1296,-3.294339,48.175847
2021-318790,2021-01-20,000001,Vente,139700,5168,A,BOURG KERACH,B042,22110,22146,Mellionnec,22,,,22146000WP0020,,,,,,,,,,,,,0,1,Maison,110,5,S,sols,,,1251,-3.311079,48.166121
2021-318825,2021-01-11,000001,Vente,245000,,,MANEZ CURE,B302,22110,22146,Mellionnec,22,,,22146000WK0009,,,,,,,,,,,,,0,,,,,T,terres,,,11600,-3.273948,48.169473
2021-318825,2021-01-11,000001,Vente,245000,,,MANEZ CURE,B302,22110,22146,Mellionnec,22,,,22146000WK0016,,,,,,,,,,,,,0,,,,,L,landes,,,5586,-3.270174,48.168949
2021-318825,2021-01-11,000001,Vente,245000,,,MANEZ CURE,B302,22110,22146,Mellionnec,22,,,22146000WK0016,,,,,,,,,,,,,0,,,,,L,landes,,,4516,-3.270174,48.168949
2021-318825,2021-01-11,000001,Vente,245000,,,MANEZ CURE,B302,22110,22146,Mellionnec,22,,,22146000WK0016,,,,,,,,,,,,,0,,,,,T,terres,,,18104,-3.270174,48.168949
2021-318825,2021-01-11,000001,Vente,245000,5097,,MANEZ CURE,B302,22110,22146,Mellionnec,22,,,22146000WK0065,,,,,,,,,,,,,0,1,Maison,80,2,L,landes,,,1175,-3.272939,48.166984
2021-318825,2021-01-11,000001,Vente,245000,5097,,MANEZ CURE,B302,22110,22146,Mellionnec,22,,,22146000WK0065,,,,,,,,,,,,,0,1,Maison,80,2,T,terres,,,17042,-3.272939,48.166984
2021-318825,2021-01-11,000001,Vente,245000,5097,,MANEZ CURE,B302,22110,22146,Mellionnec,22,,,22146000WK0065,,,,,,,,,,,,,0,1,Maison,80,2,L,landes,,,18725,-3.272939,48.166984
2021-318825,2021-01-11,000001,Vente,245000,5097,,MANEZ CURE,B302,22110,22146,Mellionnec,22,,,22146000WK0065,,,,,,,,,,,,,0,1,Maison,80,2,T,terres,,,19454,-3.272939,48.166984
2021-318825,2021-01-11,000001,Vente,245000,5097,,MANEZ CURE,B302,22110,22146,Mellionnec,22,,,22146000WK0065,,,,,,,,,,,,,0,1,Maison,80,2,BT,taillis simples,,,9403,-3.272939,48.166984
2021-318825,2021-01-11,000001,Vente,245000,5097,,MANEZ CURE,B302,22110,22146,Mellionnec,22,,,22146000WK0065,,,,,,,,,,,,,0,1,Maison,80,2,S,sols,,,1459,-3.272939,48.166984
2021-318825,2021-01-11,000001,Vente,245000,5097,,MANEZ CURE,B302,22110,22146,Mellionnec,22,,,22146000WK0065,,,,,,,,,,,,,0,1,Maison,80,2,T,terres,,,17043,-3.272939,48.166984
2021-318858,2021-01-19,000001,Vente,30000,3,,IMP DU FOURNIL,0014,22110,22146,Mellionnec,22,,,22146000AB0079,,,,,,,,,,,,,0,1,Maison,73,3,S,sols,,,83,-3.296348,48.174744
2021-319131,2021-03-24,000002,Vente,82000,5165,,BOURG KERACH,B042,22110,22146,Mellionnec,22,,,22146000WP0144,,,,,,,,,,,,,0,1,Maison,75,3,,,,,,-3.309814,48.167085
2021-319133,2021-03-11,000002,Vente,21,,,LE BOURG,B039,22110,22146,Mellionnec,22,,,22146000AB0326,,,,,,,,,,,,,0,,,,,J,jardins,,,14,-3.296056,48.174396
2021-319134,2021-03-10,000001,Vente,1000,,,RESTHOUANET,C136,22110,22146,Mellionnec,22,,,22146000WM0039,,,,,,,,,,,,,0,,,,,L,landes,,,4797,-3.280169,48.164717
2021-319135,2021-03-19,000001,Vente,1200,,,GOAS AR GOLEN,B172,22110,22146,Mellionnec,22,,,22146000WL0045,,,,,,,,,,,,,0,,,,,T,terres,,,2625,-3.264482,48.163536
2021-319137,2021-03-29,000001,Vente,79000,,,LE RESTE,C131,22110,22146,Mellionnec,22,,,22146000WH0022,,,,,,,,,,,,,0,,,,,T,terres,,,3452,-3.284339,48.177674
2021-319137,2021-03-29,000001,Vente,79000,,,LE RESTE,C131,22110,22146,Mellionnec,22,,,22146000WH0023,,,,,,,,,,,,,0,,,,,T,terres,,,4314,-3.284733,48.177053
2021-319137,2021-03-29,000001,Vente,79000,5036,,LE RESTE,C131,22110,22146,Mellionnec,22,,,22146000WH0032,,,,,,,,,,,,,0,1,Maison,70,4,S,sols,,,479,-3.283931,48.177879
2021-319137,2021-03-29,000001,Vente,79000,,,LE RESTE,C131,22110,22146,Mellionnec,22,,,22146000WH0043,,,,,,,,,,,,,0,,,,,S,sols,,,36,-3.282878,48.178229
2021-319137,2021-03-29,000001,Vente,79000,,,LE RESTE,C131,22110,22146,Mellionnec,22,,,22146000WH0050,,,,,,,,,,,,,0,,,,,T,terres,,,1050,-3.282441,48.177673
2021-319199,2021-04-13,000001,Vente,10000,,,CALESHOUARN,B050,22110,22146,Mellionnec,22,,,22146000WP0089,,,,,,,,,,,,,0,,,,,T,terres,,,8525,-3.305923,48.162621
2021-319199,2021-04-13,000001,Vente,10000,,,CALESHOUARN,B050,22110,22146,Mellionnec,22,,,22146000WP0089,,,,,,,,,,,,,0,,,,,BF,futaies feuillues,,,11337,-3.305923,48.162621
2021-319199,2021-04-13,000001,Vente,10000,,,CALESHOUARN,B050,22110,22146,Mellionnec,22,,,22146000WP0089,,,,,,,,,,,,,0,,,,,BF,futaies feuillues,,,11337,-3.305923,48.162621
2021-319199,2021-04-13,000001,Vente,10000,,,CALESHOUARN,B050,22110,22146,Mellionnec,22,,,22146000WP0089,,,,,,,,,,,,,0,,,,,T,terres,,,4263,-3.305923,48.162621
2021-319200,2021-04-15,000001,Vente,57000,5136,,SAINT AUNY,C234,22110,22146,Mellionnec,22,,,22146000WN0027,,,,,,,,,,,,,0,1,Maison,62,2,S,sols,,,152,-3.281341,48.153144
2021-319200,2021-04-15,000001,Vente,57000,,,SAINT AUNY,C234,22110,22146,Mellionnec,22,,,22146000WN0028,,,,,,,,,,,,,0,,,,,S,sols,,,118,-3.281312,48.152967
2021-319200,2021-04-15,000001,Vente,57000,,,SAINT AUNY,C234,22110,22146,Mellionnec,22,,,22146000WN0029,,,,,,,,,,,,,0,,,,,S,sols,,,502,-3.281442,48.153086
2021-319200,2021-04-15,000001,Vente,57000,,,SAINT AUNY,C234,22110,22146,Mellionnec,22,,,22146000WN0058,,,,,,,,,,,,,0,,,,,VE,vergers,,,540,-3.279877,48.153753
2021-319205,2021-04-01,000001,Vente,30000,18,,RTE DE PONT CROIX,0042,22110,22146,Mellionnec,22,,,22146000AB0039,,,,,,,,,,,,,0,1,Maison,50,3,S,sols,,,177,-3.2966,48.176147
2021-319374,2021-04-23,000001,Vente,58000,18,,RTE DE GOUAREC,0018,22110,22146,Mellionnec,22,,,22146000AB0279,,,,,,,,,,,,,0,1,Maison,104,6,J,jardins,,,594,-3.294469,48.175202
2021-319374,2021-04-23,000001,Vente,58000,18,,RTE DE GOUAREC,0018,22110,22146,Mellionnec,22,,,22146000AB0279,,,,,,,,,,,,,0,1,Maison,104,6,S,sols,,,244,-3.294469,48.175202
2021-319374,2021-04-23,000001,Vente,58000,,,RTE DE GOUAREC,0018,22110,22146,Mellionnec,22,,,22146000WE0063,,,,,,,,,,,,,0,,,,,BR,futaies résineuses,,,1318,-3.294086,48.176544
2021-319374,2021-04-23,000001,Vente,58000,,,RTE DE GOUAREC,0018,22110,22146,Mellionnec,22,,,22146000WE0063,,,,,,,,,,,,,0,,,,,T,terres,,,13417,-3.294086,48.176544
2021-319374,2021-04-23,000001,Vente,58000,,,LE BOURG,B039,22110,22146,Mellionnec,22,,,22146000WH0114,,,,,,,,,,,,,0,,,,,L,landes,,,6874,-3.285773,48.169961
2021-319374,2021-04-23,000001,Vente,58000,,,LE BOURG,B039,22110,22146,Mellionnec,22,,,22146000WH0114,,,,,,,,,,,,,0,,,,,BR,futaies résineuses,,,2291,-3.285773,48.169961
2021-319374,2021-04-23,000001,Vente,58000,,,LE BOURG,B039,22110,22146,Mellionnec,22,,,22146000WM0005,,,,,,,,,,,,,0,,,,,L,landes,,,2663,-3.286374,48.169986
2021-319523,2021-06-02,000001,Vente,49000,5003,,HACADOUR,B186,22110,22146,Mellionnec,22,,,22146000WD0093,,,,,,,,,,,,,0,1,Maison,84,4,T,terres,,,1500,-3.259141,48.192557
2021-319523,2021-06-02,000001,Vente,49000,5003,,HACADOUR,B186,22110,22146,Mellionnec,22,,,22146000WD0093,,,,,,,,,,,,,0,3,Dépendance,,0,S,sols,,,903,-3.259141,48.192557
2021-319523,2021-06-02,000001,Vente,49000,5003,,HACADOUR,B186,22110,22146,Mellionnec,22,,,22146000WD0093,,,,,,,,,,,,,0,1,Maison,84,4,S,sols,,,903,-3.259141,48.192557
2021-319523,2021-06-02,000001,Vente,49000,5003,,HACADOUR,B186,22110,22146,Mellionnec,22,,,22146000WD0093,,,,,,,,,,,,,0,3,Dépendance,,0,T,terres,,,1500,-3.259141,48.192557
2021-319626,2021-06-11,000001,Vente,10000,,,BOURG KERACH,B042,22110,22146,Mellionnec,22,,,22146000WP0145,,,,,,,,,,,,,0,,,,,T,terres,,,1000,-3.30969,48.166339
2021-319845,2021-07-01,000001,Vente,124000,5017,,LE RESTE,C131,22110,22146,Mellionnec,22,,,22146000WE0097,,,,,,,,,,,,,0,3,Dépendance,,0,S,sols,,,599,-3.283929,48.179053
2021-319845,2021-07-01,000001,Vente,124000,5017,,LE RESTE,C131,22110,22146,Mellionnec,22,,,22146000WE0097,,,,,,,,,,,,,0,1,Maison,102,4,S,sols,,,599,-3.283929,48.179053
2021-319845,2021-07-01,000001,Vente,124000,,,LE RESTE,C131,22110,22146,Mellionnec,22,,,22146000WE0101,,,,,,,,,,,,,0,,,,,S,sols,,,164,-3.284189,48.179108
2021-319919,2021-07-23,000001,Vente,140000,4,,RTE DE PONT CROIX,0042,22110,22146,Mellionnec,22,,,22146000AB0050,,,,,,,,,,,,,0,3,Dépendance,,0,S,sols,,,105,-3.296621,48.175427
2021-319919,2021-07-23,000001,Vente,140000,4,,RTE DE PONT CROIX,0042,22110,22146,Mellionnec,22,,,22146000AB0050,,,,,,,,,,,,,0,1,Maison,72,3,S,sols,,,105,-3.296621,48.175427
2021-319919,2021-07-23,000001,Vente,140000,4,,RTE DE PONT CROIX,0042,22110,22146,Mellionnec,22,,,22146000AB0050,,,,,,,,,,,,,0,3,Dépendance,,0,S,sols,,,105,-3.296621,48.175427
2021-319919,2021-07-23,000001,Vente,140000,4,,RTE DE PONT CROIX,0042,22110,22146,Mellionnec,22,,,22146000AB0051,,,,,,,,,,,,,0,,,,,J,jardins,,,738,-3.296386,48.175354
2021-319927,2021-07-13,000001,Vente,130000,5152,,MENEZ HAMON,B325,22110,22146,Mellionnec,22,,,22146000WR0029,,,,,,,,,,,,,0,1,Maison,167,4,S,sols,,,1122,-3.299724,48.158631
2021-319927,2021-07-13,000001,Vente,130000,,,MENEZ HAMON,B325,22110,22146,Mellionnec,22,,,22146000WR0032,,,,,,,,,,,,,0,,,,,T,terres,,,3065,-3.299022,48.158478
2021-319928,2021-07-20,000001,Vente,12000,,,CORNEC,B114,22110,22146,Mellionnec,22,,,22146000WD0003,,,,,,,,,,,,,0,,,,,BT,taillis simples,,,10629,-3.271663,48.187241
2021-319928,2021-07-20,000001,Vente,12000,,,CORNEC,B114,22110,22146,Mellionnec,22,,,22146000WD0003,,,,,,,,,,,,,0,,,,,BR,futaies résineuses,,,10628,-3.271663,48.187241
2021-319928,2021-07-20,000001,Vente,12000,,,CORNEC,B114,22110,22146,Mellionnec,22,,,22146000WD0063,,,,,,,,,,,,,0,,,,,T,terres,,,10960,-3.26559,48.18254
2021-319928,2021-07-20,000001,Vente,12000,,,CORNEC,B114,22110,22146,Mellionnec,22,,,22146000WD0063,,,,,,,,,,,,,0,,,,,T,terres,,,10960,-3.26559,48.18254
2021-319928,2021-07-20,000001,Vente,12000,,,CORNEC,B114,22110,22146,Mellionnec,22,,,22146000WD0063,,,,,,,,,,,,,0,,,,,T,terres,,,10960,-3.26559,48.18254
2021-319964,2021-07-26,000001,Vente,50000,14,,RTE DES ECOLES,0009,22110,22146,Mellionnec,22,,,22146000AB0231,,,,,,,,,,,,,0,3,Dépendance,,0,J,jardins,,,302,-3.293472,48.173891
2021-319964,2021-07-26,000001,Vente,50000,14,,RTE DES ECOLES,0009,22110,22146,Mellionnec,22,,,22146000AB0231,,,,,,,,,,,,,0,1,Maison,59,3,J,jardins,,,302,-3.293472,48.173891
2021-319964,2021-07-26,000001,Vente,50000,14,,RTE DES ECOLES,0009,22110,22146,Mellionnec,22,,,22146000AB0232,,,,,,,,,,,,,0,,,,,J,jardins,,,226,-3.29342,48.17375
2021-319964,2021-07-26,000001,Vente,50000,,,RTE DES ECOLES,0009,22110,22146,Mellionnec,22,,,22146000AB0233,,,,,,,,,,,,,0,,,,,J,jardins,,,226,-3.293322,48.173757
2021-320063,2021-08-20,000001,Vente,86000,5077,,GOAS AR GOLEN,B172,22110,22146,Mellionnec,22,,,22146000WL0035,,,,,,,,,,,,,0,1,Maison,78,3,L,landes,,,993,-3.265587,48.162643
2021-320099,2021-08-20,000001,Vente,115000,5111,,RESTHOUANET,C136,22110,22146,Mellionnec,22,,,22146000WM0021,,,,,,,,,,,,,0,1,Maison,76,3,S,sols,,,373,-3.278511,48.165004
2021-320099,2021-08-20,000001,Vente,115000,5111,,RESTHOUANET,C136,22110,22146,Mellionnec,22,,,22146000WM0021,,,,,,,,,,,,,0,3,Dépendance,,0,S,sols,,,373,-3.278511,48.165004
