id_mutation,date_mutation,numero_disposition,nature_mutation,valeur_fonciere,adresse_numero,adresse_suffixe,adresse_nom_voie,adresse_code_voie,code_postal,code_commune,nom_commune,code_departement,ancien_code_commune,ancien_nom_commune,id_parcelle,ancien_id_parcelle,numero_volume,lot1_numero,lot1_surface_carrez,lot2_numero,lot2_surface_carrez,lot3_numero,lot3_surface_carrez,lot4_numero,lot4_surface_carrez,lot5_numero,lot5_surface_carrez,nombre_lots,code_type_local,type_local,surface_reelle_bati,nombre_pieces_principales,code_nature_culture,nature_culture,code_nature_culture_speciale,nature_culture_speciale,surface_terrain,longitude,latitude
2021-303648,2021-08-31,000001,Vente,20900,,,PARC HOEL,C262,22310,22238,Plufur,22,,,22238000AB0312,,,,,,,,,,,,,0,,,,,AB,terrains a bâtir,,,700,-3.578196,48.606754
2021-304839,2021-10-05,000001,Vente,4000,,,PARC AR CROISSANT,B995,22310,22238,Plufur,22,,,222380000C0628,,,,,,,,,,,,,0,,,,,BF,futaies feuillues,,,13632,-3.560461,48.608747
2021-306542,2021-06-15,000001,Adjudication,15200,6,,RUE LIORS MANAC H TY,0300,22310,22238,Plufur,22,,,222380000D0781,,,,,,,,,,,,,0,3,Dépendance,,0,S,sols,,,374,-3.566226,48.584006
2021-306542,2021-06-15,000001,Adjudication,15200,6,,RUE LIORS MANAC H TY,0300,22310,22238,Plufur,22,,,222380000D0781,,,,,,,,,,,,,0,1,Maison,25,2,S,sols,,,374,-3.566226,48.584006
2021-306542,2021-06-15,000001,Adjudication,15200,,,PARC AN TY,B982,22310,22238,Plufur,22,,,222380000D0782,,,,,,,,,,,,,0,,,,,T,terres,,,1767,-3.566169,48.583695
2021-306542,2021-06-15,000001,Adjudication,15200,,,LAN MANAC HTY,B636,22310,22238,Plufur,22,,,222380000D1006,,,,,,,,,,,,,0,,,,,T,terres,,,4540,-3.565424,48.584237
2021-308630,2021-12-15,000001,Vente,1397,,,AR VEZEC,B070,22310,22238,Plufur,22,,,222380000E0443,,,,,,,,,,,,,0,,,,,BS,taillis sous futaie,,,6984,-3.587734,48.594426
2021-308681,2021-12-09,000001,Vente,37500,,,MEZ GUEN,B906,22310,22238,Plufur,22,,,222380000E0927,,,,,,,,,,,,,0,,,,,AB,terrains a bâtir,,,2018,-3.581772,48.6056
2021-308689,2021-12-07,000001,Vente,735.6,,,PARC FALL,C186,22310,22238,Plufur,22,,,222380000E0866,,,,,,,,,,,,,0,,,,,T,terres,,,1914,-3.582738,48.598994
2021-308693,2021-12-07,000001,Vente,3000,,,PARC TREBRIAUT,C533,22310,22238,Plufur,22,,,222380000E0470,,,,,,,,,,,,,0,,,,,T,terres,,,7340,-3.588136,48.596548
2021-308953,2021-11-26,000002,Echange,2000,,,PARC CREIS,C159,22310,22238,Plufur,22,,,222380000E0478,,,,,,,,,,,,,0,,,,,T,terres,,,4144,-3.591116,48.59543
2021-308953,2021-11-26,000003,Echange,2000,,,TREUZIC NEVEDER,C993,22310,22238,Plufur,22,,,222380000E0464,,,,,,,,,,,,,0,,,,,T,terres,,,1606,-3.587723,48.596547
2021-308953,2021-11-26,000003,Echange,2000,,,PARC AR FEUNTEUN,B997,22310,22238,Plufur,22,,,222380000E0953,,,,,,,,,,,,,0,,,,,T,terres,,,2564,-3.589507,48.59512
2021-308953,2021-11-26,000003,Echange,2000,,,AR ROZ,B055,22310,22238,Plufur,22,,,222380000E0955,,,,,,,,,,,,,0,,,,,T,terres,,,1074,-3.589845,48.59493
2021-308953,2021-11-26,000004,Echange,2000,,,MEZ MORO BIHAN,B909,22310,22238,Plufur,22,,,222380000E0374,,,,,,,,,,,,,0,,,,,T,terres,,,2885,-3.588525,48.597076
2021-308953,2021-11-26,000005,Echange,2000,,,PARC AR PORS,C022,22310,22238,Plufur,22,,,222380000C0792,,,,,,,,,,,,,0,,,,,T,terres,,,3999,-3.561028,48.60435
2021-308953,2021-11-26,000005,Echange,2000,,,PARC FALL,C186,22310,22238,Plufur,22,,,222380000E0865,,,,,,,,,,,,,0,,,,,T,terres,,,1913,-3.58296,48.598855
2021-309961,2021-12-21,000001,Vente,18000,11,,PL JEAN MOULIN,0360,22310,22238,Plufur,22,,,22238000AB0083,,,,,,,,,,,,,0,1,Maison,67,4,S,sols,,,95,-3.575605,48.610022
2021-316392,2021-01-25,000001,Vente,15500,,,LANNEC MANACH,B714,22310,22238,Plufur,22,,,222380000D0764,,,,,,,,,,,,,0,,,,,L,landes,,,16786,-3.563098,48.586502
2021-316392,2021-01-25,000001,Vente,15500,,,LANNEC LAN PIE,B713,22310,22238,Plufur,22,,,222380000D0765,,,,,,,,,,,,,0,,,,,L,landes,,,14070,-3.564308,48.585669
2021-317075,2021-03-23,000001,Vente,75000,9,,PL JEAN MOULIN,0360,22310,22238,Plufur,22,,,22238000AB0208,,,,,,,,,,,,,0,1,Maison,120,5,S,sols,,,72,-3.575544,48.609951
2021-317289,2021-04-30,000001,Vente,145000,,,TOUL FALL,C977,22310,22238,Plufur,22,,,222380000C0223,,,,,,,,,,,,,0,,,,,L,landes,,,700,-3.562618,48.618449
2021-317289,2021-04-30,000001,Vente,145000,5124,,KERFUBU BRAS,B602,22310,22238,Plufur,22,,,222380000C0225,,,,,,,,,,,,,0,1,Maison,67,3,S,sols,,,67,-3.562468,48.618662
2021-317289,2021-04-30,000001,Vente,145000,,,AR JARDIN,B032,22310,22238,Plufur,22,,,222380000C0226,,,,,,,,,,,,,0,,,,,J,jardins,,,392,-3.562513,48.618828
2021-317289,2021-04-30,000001,Vente,145000,,,KERFUBU BRAS,B602,22310,22238,Plufur,22,,,222380000C0875,,,,,,,,,,,,,0,,,,,J,jardins,,,6,-3.562601,48.618713
2021-317289,2021-04-30,000001,Vente,145000,,,VERGER BIHAN,D031,22310,22238,Plufur,22,,,222380000C0877,,,,,,,,,,,,,0,,,,,J,jardins,,,363,-3.562679,48.618588
2021-317294,2021-04-30,000001,Vente,120000,,,AN HENT VIHAN,B012,22310,22238,Plufur,22,,,222380000D0423,,,,,,,,,,,,,0,,,,,L,landes,,,866,-3.558932,48.59436
2021-317294,2021-04-30,000001,Vente,120000,5223,,BECHEN,B077,22310,22238,Plufur,22,,,222380000D0433,,,,,,,,,,,,,0,1,Maison,116,4,S,sols,,,1932,-3.559983,48.594091
2021-317294,2021-04-30,000001,Vente,120000,,,PRAT BIHAN IZELLAN,C688,22310,22238,Plufur,22,,,222380000D0434,,,,,,,,,,,,,0,,,,,P,prés,,,446,-3.560242,48.593842
2021-317294,2021-04-30,000001,Vente,120000,,,PRAT AR STANG,C671,22310,22238,Plufur,22,,,222380000D0435,,,,,,,,,,,,,0,,,,,P,prés,,,172,-3.559746,48.593697
2021-317294,2021-04-30,000001,Vente,120000,,,LIORS BIHAN,B806,22310,22238,Plufur,22,,,222380000D0436,,,,,,,,,,,,,0,,,,,T,terres,,,1553,-3.55964,48.59387
2021-317294,2021-04-30,000001,Vente,120000,,,PRAT NEVEZ,C782,22310,22238,Plufur,22,,,222380000D0437,,,,,,,,,,,,,0,,,,,P,prés,,,499,-3.559409,48.59363
2021-317333,2021-04-20,000001,Vente,3500,,,COAT ROZ FEUNTEUN,B350,22310,22238,Plufur,22,,,222380000D0289,,,,,,,,,,,,,0,,,,,BT,taillis simples,,,3533,-3.553471,48.598463
2021-317333,2021-04-20,000001,Vente,3500,,,COAT BIHAN,B184,22310,22238,Plufur,22,,,222380000D0290,,,,,,,,,,,,,0,,,,,BT,taillis simples,,,1662,-3.552926,48.598137
2021-317471,2021-05-07,000001,Vente,113000,,,LE JARDIN,B566,22310,22238,Plufur,22,,,222380000D0812,,,,,,,,,,,,,0,,,,,J,jardins,,,705,-3.565865,48.582649
2021-317471,2021-05-07,000001,Vente,113000,2,,RUE DES TROENES,0600,22310,22238,Plufur,22,,,222380000D0813,,,,,,,,,,,,,0,1,Maison,91,4,S,sols,,,233,-3.56616,48.58277
2021-317471,2021-05-07,000001,Vente,113000,,,AR JARDIN,B032,22310,22238,Plufur,22,,,222380000D0910,,,,,,,,,,,,,0,,,,,S,sols,,,141,-3.566109,48.582622
2021-317657,2021-05-25,000001,Vente,111000,,,LESCOMARCH,B767,22310,22238,Plufur,22,,,222380000E0230,,,,,,,,,,,,,0,,,,,S,sols,,,323,-3.598998,48.603496
2021-317657,2021-05-25,000001,Vente,111000,,,LESCOMARCH,B767,22310,22238,Plufur,22,,,222380000E0231,,,,,,,,,,,,,0,,,,,S,sols,,,155,-3.598348,48.603235
2021-317657,2021-05-25,000001,Vente,111000,5320,,LESCOMARCH,B767,22310,22238,Plufur,22,,,222380000E0232,,,,,,,,,,,,,0,1,Maison,76,2,S,sols,,,799,-3.598526,48.603343
2021-317657,2021-05-25,000001,Vente,111000,,,AR VERGER,B065,22310,22238,Plufur,22,,,222380000E0233,,,,,,,,,,,,,0,,,,,T,terres,,,3664,-3.59802,48.60362
2021-317950,2021-06-28,000001,Vente,110000,3,,RUE DES TROENES,0600,22310,22238,Plufur,22,,,222380000D0785,,,,,,,,,,,,,0,3,Dépendance,,0,S,sols,,,238,-3.565934,48.583143
2021-317950,2021-06-28,000001,Vente,110000,3,,RUE DES TROENES,0600,22310,22238,Plufur,22,,,222380000D0785,,,,,,,,,,,,,0,1,Maison,62,2,S,sols,,,238,-3.565934,48.583143
2021-317950,2021-06-28,000001,Vente,110000,3,,RUE DES TROENES,0600,22310,22238,Plufur,22,,,222380000D0785,,,,,,,,,,,,,0,3,Dépendance,,0,S,sols,,,238,-3.565934,48.583143
2021-317950,2021-06-28,000001,Vente,110000,3,,RUE DES TROENES,0600,22310,22238,Plufur,22,,,222380000D0786,,,,,,,,,,,,,0,,,,,J,jardins,,,652,-3.56599,48.583321
2021-317959,2021-06-21,000001,Vente,115000,,,PARC BELLEC,C064,22310,22238,Plufur,22,,,22238000AB0246,,,,,,,,,,,,,0,,,,,T,terres,,,24,-3.576876,48.611249
2021-317959,2021-06-21,000001,Vente,115000,17,,RUE DES VALLEES,0900,22310,22238,Plufur,22,,,222380000B0696,,,,,,,,,,,,,0,1,Maison,67,2,S,sols,,,79,-3.577137,48.611314
2021-317959,2021-06-21,000001,Vente,115000,17,,RUE DES VALLEES,0900,22310,22238,Plufur,22,,,222380000B0696,,,,,,,,,,,,,0,1,Maison,67,2,J,jardins,,,606,-3.577137,48.611314
2021-317959,2021-06-21,000001,Vente,115000,,,PARC MORVAN,C371,22310,22238,Plufur,22,,,222380000B0738,,,,,,,,,,,,,0,,,,,T,terres,,,117,-3.577162,48.611187
2021-317961,2021-06-04,000001,Vente,21000,,,PARC HOEL,C262,22310,22238,Plufur,22,,,22238000AB0313,,,,,,,,,,,,,0,,,,,AB,terrains a bâtir,,,705,-3.577879,48.606749
2021-318133,2021-07-06,000001,Vente,3000,16,,RUE DE LA FONTAINE,0130,22310,22238,Plufur,22,,,22238000AB0128,,,,,,,,,,,,,0,1,Maison,20,1,S,sols,,,294,-3.572732,48.610529
2021-318133,2021-07-06,000001,Vente,3000,16,,RUE DE LA FONTAINE,0130,22310,22238,Plufur,22,,,22238000AB0128,,,,,,,,,,,,,0,3,Dépendance,,0,S,sols,,,294,-3.572732,48.610529
2021-318133,2021-07-06,000001,Vente,3000,,,LIORS AR BOURG,B786,22310,22238,Plufur,22,,,22238000AB0133,,,,,,,,,,,,,0,,,,,J,jardins,,,580,-3.572295,48.610336
2021-318133,2021-07-06,000001,Vente,3000,,,LE BOURG,B087,22310,22238,Plufur,22,,,22238000AB0181,,,,,,,,,,,,,0,,,,,J,jardins,,,289,-3.57237,48.610301
2021-318133,2021-07-06,000001,Vente,3000,,,VERGER KERILIS IZELLAN,D045,22310,22238,Plufur,22,,,222380000C0505,,,,,,,,,,,,,0,,,,,VE,vergers,,,676,-3.57196,48.60982
2021-318133,2021-07-06,000001,Vente,3000,,,PRAT KERILIS,C757,22310,22238,Plufur,22,,,222380000C0901,,,,,,,,,,,,,0,,,,,BP,peupleraies,,,1442,-3.57207,48.610065
2021-318260,2021-07-08,000001,Vente,300000,,,PRAT POUTIC,C802,22310,22238,Plufur,22,,,222380000E0276,,,,,,,,,,,,,0,,,,,BT,taillis simples,,,1494,-3.60096,48.59948
2021-318260,2021-07-08,000001,Vente,300000,,,ROZ LEON,C893,22310,22238,Plufur,22,,,222380000E0279,,,,,,,,,,,,,0,,,,,BS,taillis sous futaie,,,6557,-3.599836,48.59892
2021-318260,2021-07-08,000001,Vente,300000,,,PRAT MOAN,C777,22310,22238,Plufur,22,,,222380000E0280,,,,,,,,,,,,,0,,,,,L,landes,,,1204,-3.600085,48.598824
2021-318260,2021-07-08,000001,Vente,300000,,,PRAT HIR,C747,22310,22238,Plufur,22,,,222380000E0281,,,,,,,,,,,,,0,,,,,BT,taillis simples,,,1235,-3.600178,48.597476
2021-318260,2021-07-08,000001,Vente,300000,,,GOAREM GOZ,B480,22310,22238,Plufur,22,,,222380000E0282,,,,,,,,,,,,,0,,,,,BT,taillis simples,,,5315,-3.599906,48.597416
2021-318260,2021-07-08,000001,Vente,300000,,,LIORS BIHAN,B806,22310,22238,Plufur,22,,,222380000E0528,,,,,,,,,,,,,0,,,,,L,landes,,,1069,-3.598292,48.595391
2021-318260,2021-07-08,000001,Vente,300000,,,TY COZ,C995,22310,22238,Plufur,22,,,222380000E0529,,,,,,,,,,,,,0,,,,,L,landes,,,88,-3.597725,48.595331
2021-318260,2021-07-08,000001,Vente,300000,,,AR ROZ,B055,22310,22238,Plufur,22,,,222380000E0532,,,,,,,,,,,,,0,,,,,VE,vergers,,,2673,-3.598524,48.595815
2021-318260,2021-07-08,000001,Vente,300000,,,AR ROZ,B055,22310,22238,Plufur,22,,,222380000E0533,,,,,,,,,,,,,0,,,,,L,landes,,,2319,-3.598866,48.595495
2021-318260,2021-07-08,000001,Vente,300000,,,PRAT SAINT NICOLAS,C824,22310,22238,Plufur,22,,,222380000E0535,,,,,,,,,,,,,0,,,,,BT,taillis simples,,,1212,-3.599917,48.596006
2021-318260,2021-07-08,000001,Vente,300000,,,AR LIORS,B037,22310,22238,Plufur,22,,,222380000E0536,,,,,,,,,,,,,0,,,,,T,terres,,,435,-3.599394,48.595967
2021-318260,2021-07-08,000001,Vente,300000,,,COAT SAINT NICOLAS,B364,22310,22238,Plufur,22,,,222380000E0537,,,,,,,,,,,,,0,,,,,BT,taillis simples,,,3635,-3.599632,48.596395
2021-318260,2021-07-08,000001,Vente,300000,6536,,CRECH AR LOUE,D075,22310,22238,Plufur,22,,,222380000E0538,,,,,,,,,,,,,0,1,Maison,143,6,S,sols,,,642,-3.600173,48.596481
2021-318260,2021-07-08,000001,Vente,300000,,,PRAT AR VILIN,C673,22310,22238,Plufur,22,,,222380000E0539,,,,,,,,,,,,,0,,,,,BT,taillis simples,,,2162,-3.600411,48.596611
2021-318315,2021-08-02,000001,Vente,94000,7,,RUE DE LA FONTAINE,0130,22310,22238,Plufur,22,,,22238000AB0113,,,,,,,,,,,,,0,1,Maison,76,3,S,sols,,,80,-3.57421,48.610261
2021-318531,2021-08-05,000001,Vente,115000,,,LIORS KERADENEC,B845,22310,22238,Plufur,22,,,222380000B0579,,,,,,,,,,,,,0,,,,,T,terres,,,822,-3.58526,48.610357
2021-318531,2021-08-05,000001,Vente,115000,3,,KERADENEC,B585,22310,22238,Plufur,22,,,222380000B0580,,,,,,,,,,,,,0,1,Maison,50,2,S,sols,,,270,-3.585331,48.610062
2021-318531,2021-08-05,000001,Vente,115000,,,PARC DOUAR NOSTRO,C183,22310,22238,Plufur,22,,,222380000B0732,,,,,,,,,,,,,0,,,,,T,terres,,,9,-3.585241,48.610037
2021-318531,2021-08-05,000001,Vente,115000,,,LANNEC KERADENEC,B711,22310,22238,Plufur,22,,,222380000B0734,,,,,,,,,,,,,0,,,,,T,terres,,,13,-3.585346,48.609995
2021-318531,2021-08-05,000001,Vente,115000,,,ROSTANG,C858,22310,22238,Plufur,22,,,222380000B0754,,,,,,,,,,,,,0,,,,,T,terres,,,440,-3.585418,48.61043
2021-318532,2021-08-05,000001,Vente,160000,,,GOAREM KERNEVEZ,B486,22310,22238,Plufur,22,,,222380000E0341,,,,,,,,,,,,,0,,,,,L,landes,,,3101,-3.588014,48.599806
2021-318532,2021-08-05,000001,Vente,160000,,,GOAREM VIHAN,B515,22310,22238,Plufur,22,,,222380000E0343,,,,,,,,,,,,,0,,,,,L,landes,,,3330,-3.588608,48.599576
2021-318532,2021-08-05,000001,Vente,160000,6531,,KERNEVEZ,B616,22310,22238,Plufur,22,,,222380000E0364,,,,,,,,,,,,,0,1,Maison,106,4,S,sols,,,1281,-3.58758,48.599049
2021-318532,2021-08-05,000001,Vente,160000,6531,,KERNEVEZ,B616,22310,22238,Plufur,22,,,222380000E0364,,,,,,,,,,,,,0,3,Dépendance,,0,S,sols,,,1281,-3.58758,48.599049
2021-318532,2021-08-05,000001,Vente,160000,6531,,KERNEVEZ,B616,22310,22238,Plufur,22,,,222380000E0364,,,,,,,,,,,,,0,3,Dépendance,,0,S,sols,,,1281,-3.58758,48.599049
2021-318532,2021-08-05,000001,Vente,160000,,,LIORS LEUR,B849,22310,22238,Plufur,22,,,222380000E0365,,,,,,,,,,,,,0,,,,,T,terres,,,592,-3.587104,48.598988
2021-318532,2021-08-05,000001,Vente,160000,,,LIORS BRAS,B812,22310,22238,Plufur,22,,,222380000E0800,,,,,,,,,,,,,0,,,,,VE,vergers,,,329,-3.587252,48.598837
2021-318532,2021-08-05,000001,Vente,160000,,,LIORS AN TY,B781,22310,22238,Plufur,22,,,222380000E0802,,,,,,,,,,,,,0,,,,,VE,vergers,,,180,-3.587739,48.598984
2021-318532,2021-08-05,000001,Vente,160000,,,STYLQUED LAN,C935,22310,22238,Plufur,22,,,222380000E0804,,,,,,,,,,,,,0,,,,,T,terres,,,8,-3.58591,48.598485
2021-318532,2021-08-05,000001,Vente,160000,,,LIORS HERVOAN,B839,22310,22238,Plufur,22,,,222380000E0806,,,,,,,,,,,,,0,,,,,T,terres,,,2385,-3.586372,48.598713
2021-318704,2021-09-09,000001,Vente,20900,,,PARC HOEL,C262,22310,22238,Plufur,22,,,22238000AB0311,,,,,,,,,,,,,0,,,,,AB,terrains a bâtir,,,700,-3.578446,48.606821
