id_mutation,date_mutation,numero_disposition,nature_mutation,valeur_fonciere,adresse_numero,adresse_suffixe,adresse_nom_voie,adresse_code_voie,code_postal,code_commune,nom_commune,code_departement,ancien_code_commune,ancien_nom_commune,id_parcelle,ancien_id_parcelle,numero_volume,lot1_numero,lot1_surface_carrez,lot2_numero,lot2_surface_carrez,lot3_numero,lot3_surface_carrez,lot4_numero,lot4_surface_carrez,lot5_numero,lot5_surface_carrez,nombre_lots,code_type_local,type_local,surface_reelle_bati,nombre_pieces_principales,code_nature_culture,nature_culture,code_nature_culture_speciale,nature_culture_speciale,surface_terrain,longitude,latitude
2021-303506,2021-08-24,000001,Vente,11515,,,CLOS CHATAIGNIER,B065,22630,22263,Le Quiou,22,,,222630000B0314,,,,,,,,,,,,,0,,,,,T,terres,,,2145,-2.001582,48.35208
2021-303506,2021-08-24,000001,Vente,11515,,,LE CLOS DES CHATAIGNIERS,B076,22630,22263,Le Quiou,22,,,222630000B0588,,,,,,,,,,,,,0,,,,,T,terres,,,45,-2.00172,48.352605
2021-303818,2021-09-09,000001,Vente,159000,21,,PL DE L'EGLISE,0011,22630,22263,Le Quiou,22,,,222630000B0305,,,,,,,,,,,,,0,1,Maison,85,4,S,sols,,,287,-2.005572,48.350681
2021-303818,2021-09-09,000001,Vente,159000,19,,PL DE L'EGLISE,0011,22630,22263,Le Quiou,22,,,222630000B0308,,,,,,,,,,,,,0,2,Appartement,16,1,S,sols,,,1243,-2.005449,48.35089
2021-303818,2021-09-09,000001,Vente,159000,19,,PL DE L'EGLISE,0011,22630,22263,Le Quiou,22,,,222630000B0308,,,,,,,,,,,,,0,4,Local industriel. commercial ou assimilé,737,0,S,sols,,,1243,-2.005449,48.35089
2021-305663,2021-10-13,000001,Vente,2315.25,,,LES HAUTES FOSSES,B195,22630,22263,Le Quiou,22,,,222630000A0227,,,,,,,,,,,,,0,,,,,T,terres,,,5145,-2.009012,48.349715
2021-305954,2021-11-03,000001,Vente,700,,,LES COURTES PIECES,B109,22630,22263,Le Quiou,22,,,222630000A0170,,,,,,,,,,,,,0,,,,,T,terres,,,1320,-2.015618,48.353844
2021-305954,2021-11-03,000001,Vente,700,,,LES COURTES PIECES,B109,22630,22263,Le Quiou,22,,,222630000A0183,,,,,,,,,,,,,0,,,,,P,prés,,,890,-2.016254,48.353602
2021-306985,2021-10-27,000001,Vente,117915,,,COURTIL BODIN,B112,22630,22263,Le Quiou,22,,,222630000A0655,,,,,,,,,,,,,0,,,,,J,jardins,,,108,-2.008329,48.351984
2021-306985,2021-10-27,000001,Vente,117915,,,COURTIL BODIN,B112,22630,22263,Le Quiou,22,,,222630000A0991,,,,,,,,,,,,,0,,,,,S,sols,,,154,-2.008328,48.351788
2021-306985,2021-10-27,000001,Vente,117915,16,,RUE DE LA VILLE NEUVE,0065,22630,22263,Le Quiou,22,,,222630000A0992,,,,,,,,,,,,,0,1,Maison,74,5,S,sols,,,204,-2.008465,48.351945
2021-306985,2021-10-27,000001,Vente,117915,16,,RUE DE LA VILLE NEUVE,0065,22630,22263,Le Quiou,22,,,222630000A0992,,,,,,,,,,,,,0,3,Dépendance,,0,S,sols,,,204,-2.008465,48.351945
2021-306985,2021-10-27,000001,Vente,117915,16,,RUE DE LA VILLE NEUVE,0065,22630,22263,Le Quiou,22,,,222630000A0992,,,,,,,,,,,,,0,3,Dépendance,,0,S,sols,,,204,-2.008465,48.351945
2021-306985,2021-10-27,000001,Vente,117915,4,,LA VILLE NEUVE,B392,22630,22263,Le Quiou,22,,,222630000A0993,,,,,,,,,,,,,0,,,,,S,sols,,,3,-2.008354,48.351752
2021-308460,2021-11-22,000001,Vente,44821,,,PETITE LOUGRAIE,B282,22630,22263,Le Quiou,22,,,222630000B0438,,,,,,,,,,,,,0,,,,,T,terres,,,3400,-1.980821,48.341634
2021-310744,2021-02-11,000003,Vente,25475,5500,F,RUE DE LA FONTAINE,0012,22630,22263,Le Quiou,22,,,222630000B0935,,,,,,,,,,,,,0,1,Maison,78,4,P,prés,,,23,-2.00492,48.351178
2021-310744,2021-02-11,000003,Vente,25475,,,LE COURTIL DE LA METAIRIE,B123,22630,22263,Le Quiou,22,,,222630000B0936,,,,,,,,,,,,,0,,,,,P,prés,,,267,-2.004885,48.351127
2021-311207,2021-02-05,000001,Vente,144000,37,,LE CRAON,B143,22630,22263,Le Quiou,22,,,222630000B0727,,,,,,,,,,,,,0,1,Maison,90,3,S,sols,,,788,-1.975513,48.342172
2021-311207,2021-02-05,000001,Vente,144000,,,LE COURTIL DE DERRIERE,B117,22630,22263,Le Quiou,22,,,222630000B0844,,,,,,,,,,,,,0,,,,,J,jardins,,,423,-1.975475,48.342405
2021-311222,2021-01-22,000001,Vente,5800,,,SUR LA VOYE,B396,22630,22263,Le Quiou,22,,,222630000B0531,,,,,,,,,,,,,0,,,,,T,terres,,,12610,-1.984308,48.34468
2021-311783,2021-04-01,000001,Vente,305000,30,,LA VILLE GOHEN,B388,22630,22263,Le Quiou,22,,,222630000A0158,,,,,,,,,,,,,0,1,Maison,150,6,S,sols,,,590,-2.012747,48.35238
2021-311783,2021-04-01,000001,Vente,305000,32,,LA VILLE GOHEN,B388,22630,22263,Le Quiou,22,,,222630000A0159,,,,,,,,,,,,,0,,,,,S,sols,,,570,-2.012959,48.35233
2021-311783,2021-04-01,000001,Vente,305000,,,LE CHAMP DU ROY,B041,22630,22263,Le Quiou,22,,,222630000A0160,,,,,,,,,,,,,0,,,,,T,terres,,,1240,-2.013181,48.352317
2021-311783,2021-04-01,000001,Vente,305000,,,COURTIL DU DEVANT,B132,22630,22263,Le Quiou,22,,,222630000A0424,,,,,,,,,,,,,0,,,,,P,prés,,,1260,-2.012499,48.351999
2021-311783,2021-04-01,000001,Vente,305000,34,,LA VILLE GOHEN,B388,22630,22263,Le Quiou,22,,,222630000A0425,,,,,,,,,,,,,0,,,,,S,sols,,,190,-2.012614,48.352234
2021-311783,2021-04-01,000001,Vente,305000,,,LE CHAMP DU ROY,B041,22630,22263,Le Quiou,22,,,222630000A0797,,,,,,,,,,,,,0,,,,,T,terres,,,165,-2.012592,48.352398
2021-311783,2021-04-01,000001,Vente,305000,,,LE PRESBYTERE,B339,22630,22263,Le Quiou,22,,,222630000A0800,,,,,,,,,,,,,0,,,,,S,sols,,,63,-2.012449,48.352224
2021-311783,2021-04-01,000001,Vente,305000,,,PATURE DU PRESBYTERE,B246,22630,22263,Le Quiou,22,,,222630000A0821,,,,,,,,,,,,,0,,,,,T,terres,,,1435,-2.012384,48.35171
2021-311855,2021-03-05,000001,Vente,142000,,,LA BUTTE,B031,22630,22263,Le Quiou,22,,,222630000A0368,,,,,,,,,,,,,0,,,,,J,jardins,,,440,-2.011554,48.346286
2021-311855,2021-03-05,000001,Vente,142000,,,LE PAS DE HAC,B235,22630,22263,Le Quiou,22,,,222630000A0369,,,,,,,,,,,,,0,,,,,J,jardins,,,120,-2.011489,48.346192
2021-311855,2021-03-05,000001,Vente,142000,21,,CHE DU PAS DU HAC,0016,22630,22263,Le Quiou,22,,,222630000A0378,,,,,,,,,,,,,0,1,Maison,94,4,S,sols,,,195,-2.011143,48.346338
2021-311855,2021-03-05,000001,Vente,142000,,,LE PAS DE HAC,B235,22630,22263,Le Quiou,22,,,222630000A0660,,,,,,,,,,,,,0,,,,,S,sols,,,28,-2.011321,48.346319
2021-311855,2021-03-05,000001,Vente,142000,,,LE PAS DE HAC,B235,22630,22263,Le Quiou,22,,,222630000A0661,,,,,,,,,,,,,0,,,,,S,sols,,,72,-2.011273,48.346314
2021-311855,2021-03-05,000001,Vente,142000,,,LE PAS DE HAC,B235,22630,22263,Le Quiou,22,,,222630000A0662,,,,,,,,,,,,,0,,,,,J,jardins,,,40,-2.011229,48.346219
2021-311855,2021-03-05,000001,Vente,142000,,,LE PAS DE HAC,B235,22630,22263,Le Quiou,22,,,222630000A0676,,,,,,,,,,,,,0,,,,,J,jardins,,,259,-2.011354,48.346169
2021-311855,2021-03-05,000001,Vente,142000,,,LE PAS DE HAC,B235,22630,22263,Le Quiou,22,,,222630000A0729,,,,,,,,,,,,,0,,,,,P,prés,,,42,-2.01133,48.346049
2021-311855,2021-03-05,000001,Vente,142000,,,LES PERRIERES,B255,22630,22263,Le Quiou,22,,,222630000A0770,,,,,,,,,,,,,0,,,,,T,terres,,,77,-2.011135,48.346226
2021-311855,2021-03-05,000001,Vente,142000,,,LES PERRIERES,B255,22630,22263,Le Quiou,22,,,222630000A0773,,,,,,,,,,,,,0,,,,,T,terres,,,152,-2.011135,48.346132
2021-312236,2021-05-05,000001,Vente,140000,2,,CHE DE LA VICOMTE,0055,22630,22263,Le Quiou,22,,,222630000A0751,,,,,,,,,,,,,0,1,Maison,73,3,S,sols,,,500,-2.006849,48.352999
2021-312236,2021-05-05,000001,Vente,140000,2,,CHE DE LA VICOMTE,0055,22630,22263,Le Quiou,22,,,222630000A0751,,,,,,,,,,,,,0,1,Maison,73,3,T,terres,,,700,-2.006849,48.352999
2021-312385,2021-05-18,000001,Vente,115000,,,LES HAUTS FOSSES,B197,22630,22263,Le Quiou,22,,,222630000A0225,,,,,,,,,,,,,0,,,,,T,terres,,,745,-2.008886,48.349418
2021-312385,2021-05-18,000001,Vente,115000,,,LES HAUTS FOSSES,B197,22630,22263,Le Quiou,22,,,222630000A0225,,,,,,,,,,,,,0,,,,,S,sols,,,150,-2.008886,48.349418
2021-312385,2021-05-18,000001,Vente,115000,12,,RUE DE LA VILLA ROMAINE,0060,22630,22263,Le Quiou,22,,,222630000A0226,,,,,,,,,,,,,0,4,Local industriel. commercial ou assimilé,54,0,S,sols,,,360,-2.008097,48.349764
2021-312385,2021-05-18,000001,Vente,115000,12,,RUE DE LA VILLA ROMAINE,0060,22630,22263,Le Quiou,22,,,222630000A0226,,,,,,,,,,,,,0,1,Maison,116,5,S,sols,,,360,-2.008097,48.349764
2021-312632,2021-05-28,000001,Vente,200,,,COURTIL BODIN,B112,22630,22263,Le Quiou,22,,,222630000A0546,,,,,,,,,,,,,0,,,,,J,jardins,,,152,-2.008379,48.352109
2021-312914,2021-05-28,000001,Vente,153000,3,,RUE DES RUETTES,0001,22630,22263,Le Quiou,22,,,222630000B0769,,,,,,,,,,,,,0,3,Dépendance,,0,J,jardins,,,338,-2.003873,48.351333
2021-312914,2021-05-28,000001,Vente,153000,3,,RUE DES RUETTES,0001,22630,22263,Le Quiou,22,,,222630000B0769,,,,,,,,,,,,,0,1,Maison,91,5,S,sols,,,500,-2.003873,48.351333
2021-312914,2021-05-28,000001,Vente,153000,3,,RUE DES RUETTES,0001,22630,22263,Le Quiou,22,,,222630000B0769,,,,,,,,,,,,,0,1,Maison,91,5,J,jardins,,,338,-2.003873,48.351333
2021-312914,2021-05-28,000001,Vente,153000,3,,RUE DES RUETTES,0001,22630,22263,Le Quiou,22,,,222630000B0769,,,,,,,,,,,,,0,3,Dépendance,,0,S,sols,,,500,-2.003873,48.351333
2021-312918,2021-06-23,000001,Vente,800,,,LA GRANDE VICOMTE,B183,22630,22263,Le Quiou,22,,,222630000A0132,,,,,,,,,,,,,0,,,,,T,terres,,,2635,-2.010809,48.353321
2021-312919,2021-06-30,000001,Vente,3868.2,,,LA JANNAIE,B200,22630,22263,Le Quiou,22,,,222630000A0147,,,,,,,,,,,,,0,,,,,T,terres,,,2430,-2.011402,48.354657
2021-312919,2021-06-30,000001,Vente,3868.2,,,LES MOULINETS,B228,22630,22263,Le Quiou,22,,,222630000A0403,,,,,,,,,,,,,0,,,,,P,prés,,,1465,-2.014044,48.348963
2021-312919,2021-06-30,000001,Vente,3868.2,,,LE GRAND PRE,B176,22630,22263,Le Quiou,22,,,222630000A0417,,,,,,,,,,,,,0,,,,,P,prés,,,4590,-2.015182,48.351159
2021-312919,2021-06-30,000001,Vente,3868.2,,,LE GRAND PRE,B176,22630,22263,Le Quiou,22,,,222630000A0418,,,,,,,,,,,,,0,,,,,P,prés,,,1579,-2.014579,48.351265
2021-312919,2021-06-30,000001,Vente,3868.2,,,CHAMP ROLLAND,B051,22630,22263,Le Quiou,22,,,222630000B0019,,,,,,,,,,,,,0,,,,,T,terres,,,2830,-2.001435,48.351126
2021-313730,2021-08-06,000001,Vente,28000,,,COURTIL DE DEVANT,B119,22630,22263,Le Quiou,22,,,222630000A1016,,,,,,,,,,,,,0,,,,,T,terres,,,1081,-2.006898,48.352645
2021-314166,2021-09-20,000001,Vente,245000,,,LE PRE PRIOU,B334,22630,22263,Le Quiou,22,,,222630000B0081,,,,,,,,,,,,,0,,,,,P,prés,,,1050,-1.991514,48.345201
2021-314166,2021-09-20,000001,Vente,245000,,,LEBAS MAUNY,B213,22630,22263,Le Quiou,22,,,222630000B0083,,,,,,,,,,,,,0,,,,,S,sols,,,200,-1.991215,48.344757
2021-314166,2021-09-20,000001,Vente,245000,,,LEBAS MAUNY,B213,22630,22263,Le Quiou,22,,,222630000B0084,,,,,,,,,,,,,0,,,,,P,prés,,,480,-1.991421,48.344756
2021-314166,2021-09-20,000001,Vente,245000,,,LEBAS MAUNY,B213,22630,22263,Le Quiou,22,,,222630000B0086,,,,,,,,,,,,,0,,,,,P,prés,,,290,-1.991645,48.344759
2021-314166,2021-09-20,000001,Vente,245000,,,PETIT PRE DE MAUNY,B277,22630,22263,Le Quiou,22,,,222630000B0087,,,,,,,,,,,,,0,,,,,P,prés,,,480,-1.99152,48.344577
2021-314166,2021-09-20,000001,Vente,245000,,,PETIT PRE DE MAUNY,B277,22630,22263,Le Quiou,22,,,222630000B0088,,,,,,,,,,,,,0,,,,,P,prés,,,567,-1.991478,48.344401
2021-314166,2021-09-20,000001,Vente,245000,,,PETIT MAUNY,B271,22630,22263,Le Quiou,22,,,222630000B0089,,,,,,,,,,,,,0,,,,,P,prés,,,790,-1.9915,48.344253
2021-314166,2021-09-20,000001,Vente,245000,11,,MAUNY,B223,22630,22263,Le Quiou,22,,,222630000B0481,,,,,,,,,,,,,0,,,,,S,sols,,,214,-1.988835,48.343674
2021-314166,2021-09-20,000001,Vente,245000,,,MAUNY,B223,22630,22263,Le Quiou,22,,,222630000B0482,,,,,,,,,,,,,0,,,,,J,jardins,,,500,-1.988508,48.343693
2021-314166,2021-09-20,000001,Vente,245000,,,MAUNY,B223,22630,22263,Le Quiou,22,,,222630000B0483,,,,,,,,,,,,,0,,,,,J,jardins,,,435,-1.988478,48.343844
2021-314166,2021-09-20,000001,Vente,245000,11,,MAUNY,B223,22630,22263,Le Quiou,22,,,222630000B0484,,,,,,,,,,,,,0,1,Maison,90,4,S,sols,,,285,-1.988947,48.343811
2021-314166,2021-09-20,000001,Vente,245000,,,MAUNY,B223,22630,22263,Le Quiou,22,,,222630000B0486,,,,,,,,,,,,,0,,,,,S,sols,,,50,-1.989012,48.343902
2021-314166,2021-09-20,000001,Vente,245000,5158,,MAUNY,B223,22630,22263,Le Quiou,22,,,222630000B0605,,,,,,,,,,,,,0,3,Dépendance,,0,S,sols,,,222,-1.989014,48.343677
2021-314166,2021-09-20,000001,Vente,245000,5158,,MAUNY,B223,22630,22263,Le Quiou,22,,,222630000B0605,,,,,,,,,,,,,0,3,Dépendance,,0,S,sols,,,222,-1.989014,48.343677
