id_mutation,date_mutation,numero_disposition,nature_mutation,valeur_fonciere,adresse_numero,adresse_suffixe,adresse_nom_voie,adresse_code_voie,code_postal,code_commune,nom_commune,code_departement,ancien_code_commune,ancien_nom_commune,id_parcelle,ancien_id_parcelle,numero_volume,lot1_numero,lot1_surface_carrez,lot2_numero,lot2_surface_carrez,lot3_numero,lot3_surface_carrez,lot4_numero,lot4_surface_carrez,lot5_numero,lot5_surface_carrez,nombre_lots,code_type_local,type_local,surface_reelle_bati,nombre_pieces_principales,code_nature_culture,nature_culture,code_nature_culture_speciale,nature_culture_speciale,surface_terrain,longitude,latitude
2021-303947,2021-09-10,000001,Vente,3500,,,LE CHAMP DEVANT,B027,22630,22352,Tréfumel,22,,,223520000A0261,,,,,,,,,,,,,0,,,,,T,terres,,,7725,-2.035029,48.331329
2021-303999,2021-09-06,000002,Vente,24500,,,COURTIL DE LA MARRE,B118,22630,22352,Tréfumel,22,,,223520000A0890,,,,,,,,,,,,,0,,,,,T,terres,,,1517,-2.023138,48.333449
2021-304983,2021-09-27,000001,Vente,67000,,,COURTIL DE LA MARRE,B118,22630,22352,Tréfumel,22,,,223520000A0331,,,,,,,,,,,,,0,,,,,J,jardins,,,745,-2.023925,48.333523
2021-304983,2021-09-27,000001,Vente,67000,9,,RUE DE LA MARE,0090,22630,22352,Tréfumel,22,,,223520000A0332,,,,,,,,,,,,,0,1,Maison,75,3,S,sols,,,246,-2.024157,48.33353
2021-304983,2021-09-27,000001,Vente,67000,,,LA MARRE,B190,22630,22352,Tréfumel,22,,,223520000A0333,,,,,,,,,,,,,0,,,,,J,jardins,,,263,-2.024171,48.333673
2021-304983,2021-09-27,000001,Vente,67000,,,LA MARRE,B190,22630,22352,Tréfumel,22,,,223520000A0775,,,,,,,,,,,,,0,,,,,S,sols,,,139,-2.024281,48.333496
2021-304983,2021-09-27,000001,Vente,67000,,,COURTIL DE LA MARRE,B118,22630,22352,Tréfumel,22,,,223520000A0889,,,,,,,,,,,,,0,,,,,T,terres,,,84,-2.023888,48.333402
2021-305335,2021-09-30,000001,Vente,13574.19,,,LE GRAND ENCLOS,B158,22630,22352,Tréfumel,22,,,223520000A0487,,,,,,,,,,,,,0,,,,,T,terres,,,6310,-2.040999,48.327709
2021-305335,2021-09-30,000001,Vente,13574.19,,,LE GRAND ENCLOS,B158,22630,22352,Tréfumel,22,,,223520000A0488,,,,,,,,,,,,,0,,,,,T,terres,,,6070,-2.041402,48.327726
2021-305335,2021-09-30,000001,Vente,13574.19,,,LE PETIT ENCLOS,B233,22630,22352,Tréfumel,22,,,223520000A0489,,,,,,,,,,,,,0,,,,,P,prés,,,5200,-2.041255,48.328934
2021-305335,2021-09-30,000001,Vente,13574.19,,,LE JUGANDIN,B178,22630,22352,Tréfumel,22,,,223520000A0490,,,,,,,,,,,,,0,,,,,T,terres,,,9132,-2.042304,48.33005
2021-305335,2021-09-30,000001,Vente,13574.19,,,LA CHAUSSEE,B039,22630,22352,Tréfumel,22,,,223520000A0491,,,,,,,,,,,,,0,,,,,T,terres,,,3200,-2.043063,48.329789
2021-305335,2021-09-30,000001,Vente,13574.19,,,LA CHAUSSEE,B039,22630,22352,Tréfumel,22,,,223520000A0492,,,,,,,,,,,,,0,,,,,T,terres,,,2335,-2.043498,48.329479
2021-305335,2021-09-30,000001,Vente,13574.19,,,LE CHAMP RIFIEL,B034,22630,22352,Tréfumel,22,,,223520000A0493,,,,,,,,,,,,,0,,,,,L,landes,,,1100,-2.042779,48.33021
2021-311742,2021-03-29,000001,Vente,165000,21,,RUE DE LA ROCHE,0150,22630,22352,Tréfumel,22,,,223520000A0273,,,,,,,,,,,,,0,1,Maison,100,3,J,jardins,,,1166,-2.031777,48.332222
2021-311742,2021-03-29,000001,Vente,165000,21,,RUE DE LA ROCHE,0150,22630,22352,Tréfumel,22,,,223520000A0273,,,,,,,,,,,,,0,1,Maison,100,3,S,sols,,,84,-2.031777,48.332222
2021-311742,2021-03-29,000001,Vente,165000,,,CLOS DE LA CHESNAIE,B061,22630,22352,Tréfumel,22,,,223520000A0274,,,,,,,,,,,,,0,,,,,S,sols,,,84,-2.031566,48.332287
2021-311742,2021-03-29,000001,Vente,165000,,,CLOS DE LA CHESNAIE,B061,22630,22352,Tréfumel,22,,,223520000A0274,,,,,,,,,,,,,0,,,,,T,terres,,,1196,-2.031566,48.332287
2021-312223,2021-04-29,000001,Vente,566000,,,LA VIEILLE PRAIRIE,B325,22630,22352,Tréfumel,22,,,223520000A0763,,,,,,,,,,,,,0,,,,,T,terres,,,1014,-2.032404,48.327654
2021-312223,2021-04-29,000001,Vente,566000,,,LA VILLE DAVID,B332,22630,22352,Tréfumel,22,,,223520000A0765,,,,,,,,,,,,,0,,,,,S,sols,,,56,-2.032328,48.327796
2021-312223,2021-04-29,000001,Vente,566000,,,LA VILLE DAVID,B332,22630,22352,Tréfumel,22,,,223520000A0765,,,,,,,,,,,,,0,,,,,P,prés,,,824,-2.032328,48.327796
2021-312223,2021-04-29,000001,Vente,566000,,,RABINE DE LA VILLE DAVID,B303,22630,22352,Tréfumel,22,,,223520000A0766,,,,,,,,,,,,,0,,,,,L,landes,,,486,-2.032391,48.327387
2021-312223,2021-04-29,000001,Vente,566000,11,,RUE DE LA ROCHE,0150,22630,22352,Tréfumel,22,,,223520000A0769,,,,,,,,,,,,,0,1,Maison,70,3,S,sols,,,2231,-2.031914,48.327618
2021-312223,2021-04-29,000001,Vente,566000,11,,RUE DE LA ROCHE,0150,22630,22352,Tréfumel,22,,,223520000A0769,,,,,,,,,,,,,0,3,Dépendance,,0,S,sols,,,2231,-2.031914,48.327618
2021-312223,2021-04-29,000001,Vente,566000,11,,RUE DE LA ROCHE,0150,22630,22352,Tréfumel,22,,,223520000A0769,,,,,,,,,,,,,0,3,Dépendance,,0,S,sols,,,2231,-2.031914,48.327618
2021-312223,2021-04-29,000001,Vente,566000,11,,RUE DE LA ROCHE,0150,22630,22352,Tréfumel,22,,,223520000A0769,,,,,,,,,,,,,0,4,Local industriel. commercial ou assimilé,227,0,S,sols,,,2231,-2.031914,48.327618
2021-312223,2021-04-29,000001,Vente,566000,11,,RUE DE LA ROCHE,0150,22630,22352,Tréfumel,22,,,223520000A0769,,,,,,,,,,,,,0,1,Maison,464,14,S,sols,,,2231,-2.031914,48.327618
2021-312223,2021-04-29,000001,Vente,566000,,,LA VILLE DAVID,B332,22630,22352,Tréfumel,22,,,223520000A0770,,,,,,,,,,,,,0,,,,,J,jardins,,,1209,-2.031751,48.327861
2021-312223,2021-04-29,000001,Vente,566000,,,LE CLOS SEC,B101,22630,22352,Tréfumel,22,,,223520000A0773,,,,,,,,,,,,,0,,,,,S,sols,,,237,-2.031465,48.327706
2021-312223,2021-04-29,000001,Vente,566000,,,LE CLOS SEC,B101,22630,22352,Tréfumel,22,,,223520000A0773,,,,,,,,,,,,,0,,,,,T,terres,,,1986,-2.031465,48.327706
2021-313454,2021-06-28,000001,Vente,286000,,,COURTIL DE DERRIERE,B113,22630,22352,Tréfumel,22,,,223520000B0739,,,,,,,,,,,,,0,,,,,T,terres,,,273,-2.020867,48.340678
2021-313454,2021-06-28,000001,Vente,286000,,,CHAMP DE L EGLISE,B024,22630,22352,Tréfumel,22,,,223520000B0849,,,,,,,,,,,,,0,,,,,T,terres,,,634,-2.02069,48.340795
2021-313454,2021-06-28,000001,Vente,286000,45,,RTE DE LE QUIOU,0130,22630,22352,Tréfumel,22,,,223520000B0850,,,,,,,,,,,,,0,3,Dépendance,,0,S,sols,,,794,-2.020572,48.340765
2021-313454,2021-06-28,000001,Vente,286000,45,,RTE DE LE QUIOU,0130,22630,22352,Tréfumel,22,,,223520000B0850,,,,,,,,,,,,,0,3,Dépendance,,0,S,sols,,,794,-2.020572,48.340765
2021-313454,2021-06-28,000001,Vente,286000,45,,RTE DE LE QUIOU,0130,22630,22352,Tréfumel,22,,,223520000B0850,,,,,,,,,,,,,0,3,Dépendance,,0,S,sols,,,794,-2.020572,48.340765
2021-313454,2021-06-28,000001,Vente,286000,45,,RTE DE LE QUIOU,0130,22630,22352,Tréfumel,22,,,223520000B0850,,,,,,,,,,,,,0,1,Maison,270,6,S,sols,,,794,-2.020572,48.340765
2021-313454,2021-06-28,000001,Vente,286000,,,COURTIL DE DERRIERE,B113,22630,22352,Tréfumel,22,,,223520000B1106,,,,,,,,,,,,,0,,,,,T,terres,,,189,-2.020921,48.340657
