id_mutation,date_mutation,numero_disposition,nature_mutation,valeur_fonciere,adresse_numero,adresse_suffixe,adresse_nom_voie,adresse_code_voie,code_postal,code_commune,nom_commune,code_departement,ancien_code_commune,ancien_nom_commune,id_parcelle,ancien_id_parcelle,numero_volume,lot1_numero,lot1_surface_carrez,lot2_numero,lot2_surface_carrez,lot3_numero,lot3_surface_carrez,lot4_numero,lot4_surface_carrez,lot5_numero,lot5_surface_carrez,nombre_lots,code_type_local,type_local,surface_reelle_bati,nombre_pieces_principales,code_nature_culture,nature_culture,code_nature_culture_speciale,nature_culture_speciale,surface_terrain,longitude,latitude
2021-320378,2021-01-26,000001,Vente,60000,5054,,LE PEYROUX,B079,23110,23046,Chambonchard,23,,,23046000ZE0043,,,,,,,,,,,,,0,1,Maison,166,6,S,sols,,,1486,2.528623,46.151689
2021-320378,2021-01-26,000001,Vente,60000,,,LE PEYROUX,B079,23110,23046,Chambonchard,23,,,23046000ZE0044,,,,,,,,,,,,,0,,,,,S,sols,,,1483,2.528294,46.151385
2021-320378,2021-01-26,000001,Vente,60000,,,LE PEYROUX,B079,23110,23046,Chambonchard,23,,,23046000ZE0045,,,,,,,,,,,,,0,,,,,J,jardins,,,1378,2.527897,46.151203
2021-320378,2021-01-26,000001,Vente,60000,,,LES COUTURES,B034,23110,23046,Chambonchard,23,,,23046000ZE0059,,,,,,,,,,,,,0,,,,,T,terres,,,13830,2.528615,46.150808
2021-320378,2021-01-26,000001,Vente,60000,,,LES COUTURES,B034,23110,23046,Chambonchard,23,,,23046000ZE0059,,,,,,,,,,,,,0,,,,,T,terres,,,13831,2.528615,46.150808
2021-321554,2021-04-23,000001,Vente,30000,,,LES MAS,B069,23110,23046,Chambonchard,23,,,23046000ZK0037,,,,,,,,,,,,,0,,,,,T,terres,,,846,2.522998,46.168567
2021-321554,2021-04-23,000001,Vente,30000,,,LES MAS,B069,23110,23046,Chambonchard,23,,,23046000ZK0037,,,,,,,,,,,,,0,,,,,P,prés,,,249,2.522998,46.168567
2021-321554,2021-04-23,000001,Vente,30000,,,LE MAS,B068,23110,23046,Chambonchard,23,,,23046000ZK0039,,,,,,,,,,,,,0,,,,,S,sols,,,1531,2.523102,46.168528
2021-321795,2021-04-28,000001,Vente,72272,,,GRAND PRE,B052,23110,23046,Chambonchard,23,,,23046000ZL0041,,,,,,,,,,,,,0,,,,,T,terres,,,1007,2.526179,46.1728
2021-321795,2021-04-28,000001,Vente,72272,5096,,FEYNERAUD,B044,23110,23046,Chambonchard,23,,,23046000ZL0047,,,,,,,,,,,,,0,1,Maison,81,1,S,sols,,,412,2.526427,46.172788
2021-321795,2021-04-28,000001,Vente,72272,,,FEYNERAUD,B044,23110,23046,Chambonchard,23,,,23046000ZL0078,,,,,,,,,,,,,0,,,,,L,landes,,,68,2.526634,46.172768
2021-322324,2021-06-03,000001,Vente,16500,,,LA PICHOTTE,B081,23110,23046,Chambonchard,23,,,230460000A0130,,,,,,,,,,,,,0,,,,,BT,taillis simples,,,810,2.518055,46.171573
2021-322324,2021-06-03,000001,Vente,16500,,,LA PICHOTTE,B081,23110,23046,Chambonchard,23,,,23046000ZL0026,,,,,,,,,,,,,0,,,,,T,terres,,,36252,2.520785,46.171543
2021-322324,2021-06-03,000001,Vente,16500,,,LA PICHOTTE,B081,23110,23046,Chambonchard,23,,,23046000ZL0026,,,,,,,,,,,,,0,,,,,T,terres,,,18128,2.520785,46.171543
2021-322482,2021-06-11,000001,Vente,130000,,,RAMEAU,B100,23110,23046,Chambonchard,23,,,230460000B0340,,,,,,,,,,,,,0,,,,,S,sols,,,317,2.566462,46.144164
2021-322482,2021-06-11,000001,Vente,130000,5046,,RAMEAU,B100,23110,23046,Chambonchard,23,,,230460000B0341,,,,,,,,,,,,,0,3,Dépendance,,0,S,sols,,,946,2.56649,46.14384
2021-322482,2021-06-11,000001,Vente,130000,5046,,RAMEAU,B100,23110,23046,Chambonchard,23,,,230460000B0341,,,,,,,,,,,,,0,3,Dépendance,,0,S,sols,,,946,2.56649,46.14384
2021-322482,2021-06-11,000001,Vente,130000,5046,,RAMEAU,B100,23110,23046,Chambonchard,23,,,230460000B0341,,,,,,,,,,,,,0,1,Maison,120,5,S,sols,,,946,2.56649,46.14384
2021-322482,2021-06-11,000001,Vente,130000,5046,,RAMEAU,B100,23110,23046,Chambonchard,23,,,230460000B0341,,,,,,,,,,,,,0,3,Dépendance,,0,S,sols,,,946,2.56649,46.14384
2021-322482,2021-06-11,000001,Vente,130000,,,RAMEAU,B100,23110,23046,Chambonchard,23,,,230460000B0343,,,,,,,,,,,,,0,,,,,J,jardins,,,308,2.566235,46.143347
2021-322482,2021-06-11,000001,Vente,130000,,,RAMEAU,B100,23110,23046,Chambonchard,23,,,230460000B0344,,,,,,,,,,,,,0,,,,,PA,pâtures,,,120,2.566187,46.143232
2021-322482,2021-06-11,000001,Vente,130000,,,LES LIDIERES,B062,23110,23046,Chambonchard,23,,,230460000B0345,,,,,,,,,,,,,0,,,,,BT,taillis simples,,,3489,2.565066,46.143313
2021-322482,2021-06-11,000001,Vente,130000,,,LES LIDIERES,B062,23110,23046,Chambonchard,23,,,230460000B0345,,,,,,,,,,,,,0,,,,,S,sols,,,990,2.565066,46.143313
2021-322482,2021-06-11,000001,Vente,130000,,,LES LIDIERES,B062,23110,23046,Chambonchard,23,,,230460000B0346,,,,,,,,,,,,,0,,,,,BT,taillis simples,,,7160,2.565036,46.143734
2021-322482,2021-06-11,000001,Vente,130000,,,LES LIDIERES,B062,23110,23046,Chambonchard,23,,,230460000B0359,,,,,,,,,,,,,0,,,,,BT,taillis simples,,,1071,2.563372,46.139994
2021-322482,2021-06-11,000001,Vente,130000,,,LES LIDIERES,B062,23110,23046,Chambonchard,23,,,230460000B0361,,,,,,,,,,,,,0,,,,,BT,taillis simples,,,648,2.563029,46.139986
2021-322482,2021-06-11,000001,Vente,130000,,,RAMEAU,B100,23110,23046,Chambonchard,23,,,230460000B0420,,,,,,,,,,,,,0,,,,,BT,taillis simples,,,494,2.566543,46.143637
2021-322482,2021-06-11,000001,Vente,130000,,,RAMEAU,B100,23110,23046,Chambonchard,23,,,230460000B0421,,,,,,,,,,,,,0,,,,,L,landes,,,333,2.566373,46.143837
2021-322482,2021-06-11,000001,Vente,130000,5087,,RAMEAU,B100,23110,23046,Chambonchard,23,,,230460000B0422,,,,,,,,,,,,,0,1,Maison,22,1,S,sols,,,231,2.566201,46.143585
2021-322853,2021-07-22,000001,Vente,29000,,,SEVENNE,B105,23110,23046,Chambonchard,23,,,23046000ZI0025,,,,,,,,,,,,,0,,,,,S,sols,,,628,2.542424,46.152945
2021-322853,2021-07-22,000001,Vente,29000,,,SEVENNE,B105,23110,23046,Chambonchard,23,,,23046000ZI0044,,,,,,,,,,,,,0,,,,,T,terres,,,1346,2.542244,46.153016
2021-324813,2021-11-02,000002,Vente,34000,5018,,LE BOURG,B017,23110,23046,Chambonchard,23,,,230460000B0517,,,,,,,,,,,,,0,1,Maison,108,4,S,sols,,,77,2.551291,46.176729
