id_mutation,date_mutation,numero_disposition,nature_mutation,valeur_fonciere,adresse_numero,adresse_suffixe,adresse_nom_voie,adresse_code_voie,code_postal,code_commune,nom_commune,code_departement,ancien_code_commune,ancien_nom_commune,id_parcelle,ancien_id_parcelle,numero_volume,lot1_numero,lot1_surface_carrez,lot2_numero,lot2_surface_carrez,lot3_numero,lot3_surface_carrez,lot4_numero,lot4_surface_carrez,lot5_numero,lot5_surface_carrez,nombre_lots,code_type_local,type_local,surface_reelle_bati,nombre_pieces_principales,code_nature_culture,nature_culture,code_nature_culture_speciale,nature_culture_speciale,surface_terrain,longitude,latitude
2021-320385,2021-01-18,000001,Vente,1500,,,LES MAZIERES GRANDES,B103,23190,23113,Lupersat,23,,,23113000AW0103,,,,,,,,,,,,,0,,,,,BR,futaies résineuses,SAPIN,Sapins ou sapinière,13845,2.371809,45.966314
2021-320394,2021-01-21,000001,Vente,62000,,,POUMEROLLE,B332,23190,23113,Lupersat,23,,,23113000BD0200,,,,,,,,,,,,,0,,,,,S,sols,,,85,2.370114,45.972913
2021-320394,2021-01-21,000001,Vente,62000,,,POUMEROLLE,B332,23190,23113,Lupersat,23,,,23113000BD0201,,,,,,,,,,,,,0,,,,,L,landes,,,9,2.370176,45.972868
2021-320394,2021-01-21,000001,Vente,62000,,,POUMEROLLE,B332,23190,23113,Lupersat,23,,,23113000BD0202,,,,,,,,,,,,,0,,,,,L,landes,,,120,2.370233,45.972844
2021-320394,2021-01-21,000001,Vente,62000,5277,,POUMEROLLE,B332,23190,23113,Lupersat,23,,,23113000BD0207,,,,,,,,,,,,,0,1,Maison,76,3,S,sols,,,150,2.370185,45.972941
2021-320394,2021-01-21,000001,Vente,62000,,,POUMEROLLE,B332,23190,23113,Lupersat,23,,,23113000BD0227,,,,,,,,,,,,,0,,,,,S,sols,,,145,2.370068,45.972662
2021-320394,2021-01-21,000001,Vente,62000,,,POUMEROLLE,B332,23190,23113,Lupersat,23,,,23113000BD0229,,,,,,,,,,,,,0,,,,,T,terres,,,3858,2.369314,45.972886
2021-320394,2021-01-21,000001,Vente,62000,,,POUMEROLLE,B332,23190,23113,Lupersat,23,,,23113000BD0337,,,,,,,,,,,,,0,,,,,L,landes,,,54,2.370276,45.972964
2021-320394,2021-01-21,000001,Vente,62000,,,POUMEROLLE,B332,23190,23113,Lupersat,23,,,23113000BD0339,,,,,,,,,,,,,0,,,,,L,landes,,,48,2.370224,45.97302
2021-320504,2021-02-03,000001,Vente,3300,,,LES MAZIERES,B283,23190,23113,Lupersat,23,,,23113000AV0071,,,,,,,,,,,,,0,,,,,BT,taillis simples,,,3340,2.377291,45.964172
2021-320504,2021-02-03,000001,Vente,3300,,,LES MAZIERES,B283,23190,23113,Lupersat,23,,,23113000AV0086,,,,,,,,,,,,,0,,,,,BR,futaies résineuses,PIN,Pins,10270,2.375927,45.965219
2021-320504,2021-02-03,000001,Vente,3300,,,LES MAZIERES,B283,23190,23113,Lupersat,23,,,23113000AV0086,,,,,,,,,,,,,0,,,,,BR,futaies résineuses,SAPIN,Sapins ou sapinière,20540,2.375927,45.965219
2021-320504,2021-02-03,000001,Vente,3300,,,LES MAZIERES,B283,23190,23113,Lupersat,23,,,23113000AV0087,,,,,,,,,,,,,0,,,,,BT,taillis simples,,,2340,2.376477,45.965806
2021-320543,2021-02-10,000001,Vente,35000,,,CHAMP BLANC,B179,23190,23113,Lupersat,23,,,23113000AX0022,,,,,,,,,,,,,0,,,,,BT,taillis simples,,,11540,2.35383,45.958494
2021-320543,2021-02-10,000001,Vente,35000,,,LE MONTEIL SUGNET,B041,23190,23113,Lupersat,23,,,23113000AZ0012,,,,,,,,,,,,,0,,,,,T,terres,,,8740,2.354321,45.970952
2021-320543,2021-02-10,000001,Vente,35000,,,LE MONTEIL SUGNET,B041,23190,23113,Lupersat,23,,,23113000AZ0026,,,,,,,,,,,,,0,,,,,T,terres,,,27820,2.354299,45.973506
2021-320543,2021-02-10,000001,Vente,35000,,,LE MONTEIL SUGNET,B041,23190,23113,Lupersat,23,,,23113000AZ0027,,,,,,,,,,,,,0,,,,,BT,taillis simples,,,5620,2.353888,45.973656
2021-320543,2021-02-10,000001,Vente,35000,,,L ETANG DU MONTEIL,B111,23190,23113,Lupersat,23,,,23113000AZ0032,,,,,,,,,,,,,0,,,,,T,terres,,,15155,2.356754,45.975738
2021-320543,2021-02-10,000001,Vente,35000,,,LES PELADES,B314,23190,23113,Lupersat,23,,,23113000AZ0210,,,,,,,,,,,,,0,,,,,S,sols,,,1000,2.348631,45.971725
2021-320543,2021-02-10,000001,Vente,35000,,,LES PELADES,B314,23190,23113,Lupersat,23,,,23113000AZ0210,,,,,,,,,,,,,0,,,,,T,terres,,,10215,2.348631,45.971725
2021-320543,2021-02-10,000001,Vente,35000,,,L ETANG DU MONTEIL,B111,23190,23113,Lupersat,23,,,23113000AZ0222,,,,,,,,,,,,,0,,,,,T,terres,,,205,2.35728,45.976398
2021-320543,2021-02-10,000001,Vente,35000,,,L ETANG DU MONTEIL,B111,23190,23113,Lupersat,23,,,23113000AZ0223,,,,,,,,,,,,,0,,,,,T,terres,,,2081,2.357476,45.976328
2021-320543,2021-02-10,000001,Vente,35000,,,LE MONTAREIX,B288,23190,23113,Lupersat,23,,,23113000BC0007,,,,,,,,,,,,,0,,,,,T,terres,,,7390,2.350932,45.977473
2021-320543,2021-02-10,000001,Vente,35000,,,LE MONTAREIX,B288,23190,23113,Lupersat,23,,,23113000BC0008,,,,,,,,,,,,,0,,,,,BT,taillis simples,,,30880,2.351782,45.977165
2021-320543,2021-02-10,000001,Vente,35000,,,LE MONTAREIX,B288,23190,23113,Lupersat,23,,,23113000BC0030,,,,,,,,,,,,,0,,,,,BT,taillis simples,,,39820,2.35493,45.977771
2021-320543,2021-02-10,000001,Vente,35000,,,LE MONTAREIX,B288,23190,23113,Lupersat,23,,,23113000BC0031,,,,,,,,,,,,,0,,,,,T,terres,,,4415,2.354702,45.977102
2021-320543,2021-02-10,000001,Vente,35000,,,LE MONTAREIX,B288,23190,23113,Lupersat,23,,,23113000BC0034,,,,,,,,,,,,,0,,,,,T,terres,,,5670,2.354733,45.976332
2021-320543,2021-02-10,000001,Vente,35000,,,LE MONTAREIX,B288,23190,23113,Lupersat,23,,,23113000BC0035,,,,,,,,,,,,,0,,,,,BT,taillis simples,,,1210,2.355119,45.976108
2021-320543,2021-02-10,000001,Vente,35000,,,LE MONTAREIX,B288,23190,23113,Lupersat,23,,,23113000BC0036,,,,,,,,,,,,,0,,,,,BT,taillis simples,,,9459,2.353933,45.975983
2021-320543,2021-02-10,000001,Vente,35000,,,LE MONTAREIX,B288,23190,23113,Lupersat,23,,,23113000BC0038,,,,,,,,,,,,,0,,,,,T,terres,,,5990,2.353391,45.975848
2021-320543,2021-02-10,000001,Vente,35000,,,LE MONTAREIX,B288,23190,23113,Lupersat,23,,,23113000BC0039,,,,,,,,,,,,,0,,,,,T,terres,,,17875,2.352943,45.976854
2021-320543,2021-02-10,000001,Vente,35000,,,LES BROUAS,B163,23190,23113,Lupersat,23,,,23113000BC0040,,,,,,,,,,,,,0,,,,,BT,taillis simples,,,2665,2.35133,45.976153
2021-320543,2021-02-10,000001,Vente,35000,,,LES BROUAS,B163,23190,23113,Lupersat,23,,,23113000BC0041,,,,,,,,,,,,,0,,,,,T,terres,,,12640,2.35155,45.975491
2021-320543,2021-02-10,000001,Vente,35000,,,LES BROUAS,B163,23190,23113,Lupersat,23,,,23113000BC0042,,,,,,,,,,,,,0,,,,,BT,taillis simples,,,3645,2.351837,45.975175
2021-320543,2021-02-10,000001,Vente,35000,,,LES BROUAS,B163,23190,23113,Lupersat,23,,,23113000BC0043,,,,,,,,,,,,,0,,,,,T,terres,,,4050,2.352818,45.975146
2021-320543,2021-02-10,000001,Vente,35000,,,LES BROUAS,B163,23190,23113,Lupersat,23,,,23113000BC0044,,,,,,,,,,,,,0,,,,,BT,taillis simples,,,11530,2.352767,45.97482
2021-320543,2021-02-10,000001,Vente,35000,,,LES BROUAS,B163,23190,23113,Lupersat,23,,,23113000BC0046,,,,,,,,,,,,,0,,,,,T,terres,,,8885,2.352753,45.973039
2021-320543,2021-02-10,000001,Vente,35000,,,LES BROUAS,B163,23190,23113,Lupersat,23,,,23113000BC0047,,,,,,,,,,,,,0,,,,,BT,taillis simples,,,10695,2.351218,45.973861
2021-320543,2021-02-10,000001,Vente,35000,,,LES BROUAS,B163,23190,23113,Lupersat,23,,,23113000BC0048,,,,,,,,,,,,,0,,,,,PA,pâtures,,,36470,2.350708,45.972342
2021-320543,2021-02-10,000001,Vente,35000,,,LES BROUAS,B163,23190,23113,Lupersat,23,,,23113000BC0049,,,,,,,,,,,,,0,,,,,PA,pâtures,,,6415,2.349894,45.971637
2021-320543,2021-02-10,000001,Vente,35000,,,LES BROUAS,B163,23190,23113,Lupersat,23,,,23113000BC0084,,,,,,,,,,,,,0,,,,,BT,taillis simples,,,13350,2.35334,45.974339
2021-320675,2021-02-19,000001,Vente,18190,,,LE BOURG,B006,23190,23113,Lupersat,23,,,23113000BH0149,,,,,,,,,,,,,0,,,,,S,sols,,,162,2.353509,45.982576
2021-320675,2021-02-19,000001,Vente,18190,,,LE BOURG,B006,23190,23113,Lupersat,23,,,23113000BH0150,,,,,,,,,,,,,0,,,,,J,jardins,,,505,2.353686,45.982588
2021-320675,2021-02-19,000001,Vente,18190,2,,RTE DE RONNET,0021,23190,23113,Lupersat,23,,,23113000BH0151,,,,,,,,,,,,,0,,,,,S,sols,,,915,2.353727,45.982764
2021-320675,2021-02-19,000001,Vente,18190,1,,RTE DE RONNET,0021,23190,23113,Lupersat,23,,,23113000BH0164,,,,,,,,,,,,,0,,,,,S,sols,,,72,2.353425,45.982911
2021-320675,2021-02-19,000001,Vente,18190,,,LE BOURG,B006,23190,23113,Lupersat,23,,,23113000BH0170,,,,,,,,,,,,,0,,,,,L,landes,,,35,2.353225,45.982776
2021-320675,2021-02-19,000001,Vente,18190,,,LE BOURG,B006,23190,23113,Lupersat,23,,,23113000BH0171,,,,,,,,,,,,,0,,,,,P,prés,,,705,2.353015,45.982685
2021-320675,2021-02-19,000001,Vente,18190,,,LE BOURG,B006,23190,23113,Lupersat,23,,,23113000BH0172,,,,,,,,,,,,,0,,,,,S,sols,,,31,2.353014,45.982608
2021-320675,2021-02-19,000001,Vente,18190,3,,RUE PRINCIPALE,0017,23190,23113,Lupersat,23,,,23113000BH0298,,,,,,,,,,,,,0,1,Maison,180,4,S,sols,,,229,2.353266,45.982599
2021-320696,2021-02-10,000001,Vente,4300,,,MONTCOR,B289,23190,23113,Lupersat,23,,,23113000AT0074,,,,,,,,,,,,,0,,,,,S,sols,,,160,2.380658,45.973801
2021-320769,2021-02-25,000001,Vente,10000,5,,PL DE L EGLISE,0009,23190,23113,Lupersat,23,,,23113000BH0209,,,,,,,,,,,,,0,1,Maison,94,3,S,sols,,,102,2.353093,45.981569
2021-320769,2021-02-25,000001,Vente,10000,1,,PL DE L EGLISE,0009,23190,23113,Lupersat,23,,,23113000BH0213,,,,,,,,,,,,,0,3,Dépendance,,0,S,sols,,,80,2.353278,45.981444
2021-321134,2021-03-29,000001,Vente,5000,,,THEOLLET,B055,23190,23113,Lupersat,23,,,23113000BV0077,,,,,,,,,,,,,0,,,,,S,sols,,,135,2.329339,46.004726
2021-321134,2021-03-29,000001,Vente,5000,,,THEOLLET,B055,23190,23113,Lupersat,23,,,23113000BV0083,,,,,,,,,,,,,0,,,,,S,sols,,,40,2.329435,46.004085
2021-321134,2021-03-29,000001,Vente,5000,,,THEOLLET,B055,23190,23113,Lupersat,23,,,23113000BV0090,,,,,,,,,,,,,0,,,,,T,terres,,,2775,2.330135,46.004223
2021-321210,2021-03-30,000001,Vente,800,,,LA GARENNE DU MASREMBAUD,B146,23190,23113,Lupersat,23,,,23113000BY0092,,,,,,,,,,,,,0,,,,,BT,taillis simples,,,393,2.341741,46.012987
2021-321436,2021-04-12,000001,Echange,980,,,LA CHARRAUD DE THEOLLET,B141,23190,23113,Lupersat,23,,,23113000BW0090,,,,,,,,,,,,,0,,,,,T,terres,,,3265,2.325459,46.006619
2021-321437,2021-04-12,000002,Echange,4647,,,PUY MAUD,B369,23190,23113,Lupersat,23,,,23113000BW0074,,,,,,,,,,,,,0,,,,,T,terres,,,4060,2.332166,46.008051
2021-321437,2021-04-12,000002,Echange,4647,,,LES MAUCHERES,B281,23190,23113,Lupersat,23,,,23113000BX0023,,,,,,,,,,,,,0,,,,,T,terres,,,6700,2.334101,46.007685
2021-321437,2021-04-12,000002,Echange,4647,,,LES MAUCHERES,B281,23190,23113,Lupersat,23,,,23113000BX0024,,,,,,,,,,,,,0,,,,,PA,pâtures,,,4730,2.333938,46.00828
2021-321525,2021-04-23,000001,Vente,1000,,,THEOLLET,B055,23190,23113,Lupersat,23,,,23113000BV0112,,,,,,,,,,,,,0,,,,,L,landes,,,555,2.329158,46.003112
2021-321525,2021-04-23,000001,Vente,1000,,,FANJON,B243,23190,23113,Lupersat,23,,,23113000BV0133,,,,,,,,,,,,,0,,,,,T,terres,,,2480,2.327293,46.000905
2021-321525,2021-04-23,000001,Vente,1000,,,FANJON,B243,23190,23113,Lupersat,23,,,23113000BV0134,,,,,,,,,,,,,0,,,,,T,terres,,,3700,2.327961,46.00106
2021-321525,2021-04-23,000001,Vente,1000,,,LE CROS,B230,23190,23113,Lupersat,23,,,23113000BX0010,,,,,,,,,,,,,0,,,,,PA,pâtures,,,7025,2.330055,46.001561
2021-322038,2021-05-11,000001,Vente,60,,,COTE DE COUDEAU,B079,23190,23113,Lupersat,23,,,23113000AO0110,,,,,,,,,,,,,0,,,,,T,terres,,,249,2.380712,45.994519
2021-322335,2021-06-11,000001,Vente,22000,5,,RTE DE SERMUR,0023,23190,23113,Lupersat,23,,,23113000BH0140,,,,,,,,,,,,,0,3,Dépendance,,0,S,sols,,,255,2.35447,45.981212
2021-322335,2021-06-11,000001,Vente,22000,5,,RTE DE SERMUR,0023,23190,23113,Lupersat,23,,,23113000BH0140,,,,,,,,,,,,,0,3,Dépendance,,0,S,sols,,,255,2.35447,45.981212
2021-322335,2021-06-11,000001,Vente,22000,5,,RTE DE SERMUR,0023,23190,23113,Lupersat,23,,,23113000BH0140,,,,,,,,,,,,,0,1,Maison,86,4,S,sols,,,255,2.35447,45.981212
2021-322602,2021-07-05,000001,Vente,600,,,VILLOCETTE,B061,23190,23113,Lupersat,23,,,23113000AS0193,,,,,,,,,,,,,0,,,,,J,jardins,,,214,2.389292,45.976861
2021-322602,2021-07-05,000001,Vente,600,,,VILLOCETTE,B061,23190,23113,Lupersat,23,,,23113000AS0194,,,,,,,,,,,,,0,,,,,J,jardins,,,292,2.389159,45.976875
2021-322781,2021-07-12,000001,Vente,2000,,,CORNEMULE,B017,23190,23113,Lupersat,23,,,23113000AC0104,,,,,,,,,,,,,0,,,,,T,terres,,,8822,2.35783,46.020275
2021-322781,2021-07-12,000001,Vente,2000,,,CORNEMULE,B017,23190,23113,Lupersat,23,,,23113000AC0104,,,,,,,,,,,,,0,,,,,T,terres,,,8823,2.35783,46.020275
2021-323015,2021-07-12,000001,Vente,43000,,,LE MOURSOUX,B044,23190,23113,Lupersat,23,,,23113000AH0029,,,,,,,,,,,,,0,,,,,T,terres,,,3190,2.356563,46.006903
2021-323015,2021-07-12,000001,Vente,43000,,,LE MOURSOUX,B044,23190,23113,Lupersat,23,,,23113000AH0030,,,,,,,,,,,,,0,,,,,BT,taillis simples,,,1454,2.357381,46.007094
2021-323015,2021-07-12,000001,Vente,43000,,,LE MOURSOUX,B044,23190,23113,Lupersat,23,,,23113000AH0031,,,,,,,,,,,,,0,,,,,S,sols,,,710,2.3568,46.007104
2021-323879,2021-10-04,000001,Vente,26000,11,,CHEZ LATOUR,B206,23190,23113,Lupersat,23,,,23113000AM0067,,,,,,,,,,,,,0,1,Maison,139,6,S,sols,,,245,2.373343,45.993517
2021-323879,2021-10-04,000001,Vente,26000,,,CHEZ LATOUR,B206,23190,23113,Lupersat,23,,,23113000AM0070,,,,,,,,,,,,,0,,,,,L,landes,,,255,2.373674,45.993442
2021-324936,2021-11-24,000001,Vente,82000,6,,LA CHAMAUBEIX,B177,23190,23113,Lupersat,23,,,23113000AY0065,,,,,,,,,,,,,0,3,Dépendance,,0,S,sols,,,575,2.347434,45.966916
2021-324936,2021-11-24,000001,Vente,82000,6,,LA CHAMAUBEIX,B177,23190,23113,Lupersat,23,,,23113000AY0065,,,,,,,,,,,,,0,1,Maison,88,4,S,sols,,,575,2.347434,45.966916
2021-324936,2021-11-24,000001,Vente,82000,,,LA CHAMAUBEIX,B177,23190,23113,Lupersat,23,,,23113000AY0066,,,,,,,,,,,,,0,,,,,J,jardins,,,760,2.34724,45.96696
2021-324936,2021-11-24,000001,Vente,82000,,,LA CHAMAUBEIX,B177,23190,23113,Lupersat,23,,,23113000AY0067,,,,,,,,,,,,,0,,,,,T,terres,,,1630,2.347264,45.966672
2021-324936,2021-11-24,000001,Vente,82000,,,LA CHAMAUBEIX,B177,23190,23113,Lupersat,23,,,23113000AY0068,,,,,,,,,,,,,0,,,,,J,jardins,,,536,2.347465,45.966625
2021-324967,2021-12-09,000001,Vente,60000,,,LE GRAND CHAMP DU FAUX,B068,23190,23113,Lupersat,23,,,23113000AE0017,,,,,,,,,,,,,0,,,,,BT,taillis simples,,,4760,2.373368,46.013764
2021-324967,2021-12-09,000001,Vente,60000,,,LE GRAND CHAMP DU FAUX,B068,23190,23113,Lupersat,23,,,23113000AE0018,,,,,,,,,,,,,0,,,,,T,terres,,,11973,2.374414,46.013909
2021-324967,2021-12-09,000001,Vente,60000,,,LE GRAND CHAMP DU FAUX,B068,23190,23113,Lupersat,23,,,23113000AE0018,,,,,,,,,,,,,0,,,,,T,terres,,,11972,2.374414,46.013909
2021-324967,2021-12-09,000001,Vente,60000,,,LE GRAND CHAMP DU FAUX,B068,23190,23113,Lupersat,23,,,23113000AE0019,,,,,,,,,,,,,0,,,,,E,eaux,PECH,Etangs pêchables,360,2.375388,46.014999
2021-324967,2021-12-09,000001,Vente,60000,,,LE GRAND CHAMP DU FAUX,B068,23190,23113,Lupersat,23,,,23113000AE0020,,,,,,,,,,,,,0,,,,,BT,taillis simples,,,5040,2.375779,46.014969
2021-324967,2021-12-09,000001,Vente,60000,,,LE GRAND CHAMP DU FAUX,B068,23190,23113,Lupersat,23,,,23113000AE0021,,,,,,,,,,,,,0,,,,,T,terres,,,5855,2.375977,46.015677
2021-324967,2021-12-09,000001,Vente,60000,,,LE GRAND CHAMP DU FAUX,B068,23190,23113,Lupersat,23,,,23113000AE0022,,,,,,,,,,,,,0,,,,,PA,pâtures,,,11355,2.377526,46.015348
2021-324967,2021-12-09,000001,Vente,60000,,,LE GRAND CHAMP DU FAUX,B068,23190,23113,Lupersat,23,,,23113000AE0022,,,,,,,,,,,,,0,,,,,P,prés,,,11355,2.377526,46.015348
2021-324967,2021-12-09,000001,Vente,60000,,,LE GRAND CHAMP DU FAUX,B068,23190,23113,Lupersat,23,,,23113000AE0023,,,,,,,,,,,,,0,,,,,T,terres,,,4250,2.378666,46.015
2021-324967,2021-12-09,000001,Vente,60000,,,LE GRAND CHAMP DU FAUX,B068,23190,23113,Lupersat,23,,,23113000AE0024,,,,,,,,,,,,,0,,,,,T,terres,,,8380,2.379494,46.014627
2021-324967,2021-12-09,000001,Vente,60000,,,LE GRAND CHAMP DU FAUX,B068,23190,23113,Lupersat,23,,,23113000AE0025,,,,,,,,,,,,,0,,,,,T,terres,,,9150,2.378646,46.014085
2021-324967,2021-12-09,000001,Vente,60000,,,PUY FAUX BAS,B069,23190,23113,Lupersat,23,,,23113000AE0037,,,,,,,,,,,,,0,,,,,T,terres,,,1476,2.385639,46.013911
2021-324967,2021-12-09,000001,Vente,60000,,,LE PUY DU FAUX,B358,23190,23113,Lupersat,23,,,23113000AK0022,,,,,,,,,,,,,0,,,,,L,landes,,,1625,2.386648,46.013372
2021-324967,2021-12-09,000001,Vente,60000,,,LE PUY DU FAUX,B358,23190,23113,Lupersat,23,,,23113000AK0023,,,,,,,,,,,,,0,,,,,T,terres,,,12535,2.386316,46.013921
2021-325308,2021-12-29,000001,Vente,1376,,,LA PLATE,B329,23190,23113,Lupersat,23,,,23113000AV0005,,,,,,,,,,,,,0,,,,,BT,taillis simples,,,10320,2.375019,45.968702
2021-325308,2021-12-29,000001,Vente,1376,,,LES CHABESSIERES,B176,23190,23113,Lupersat,23,,,23113000AV0092,,,,,,,,,,,,,0,,,,,BT,taillis simples,,,5865,2.376164,45.969212
2021-325314,2021-12-29,000001,Vente,14000,,,LA SAGNE D EROULLETAS,B104,23190,23113,Lupersat,23,,,23113000AW0034,,,,,,,,,,,,,0,,,,,BT,taillis simples,,,1530,2.367887,45.971356
2021-325314,2021-12-29,000001,Vente,14000,,,LES MAZIERES GRANDES,B103,23190,23113,Lupersat,23,,,23113000AW0101,,,,,,,,,,,,,0,,,,,BT,taillis simples,,,8755,2.373971,45.966066
2021-325314,2021-12-29,000001,Vente,14000,,,LES MAZIERES GRANDES,B103,23190,23113,Lupersat,23,,,23113000AW0138,,,,,,,,,,,,,0,,,,,BT,taillis simples,,,13940,2.36904,45.965027
2021-325314,2021-12-29,000001,Vente,14000,,,LES MAZIERES GRANDES,B103,23190,23113,Lupersat,23,,,23113000AW0141,,,,,,,,,,,,,0,,,,,BT,taillis simples,,,5320,2.368025,45.963259
2021-325314,2021-12-29,000001,Vente,14000,,,LES MAZIERES GRANDES,B103,23190,23113,Lupersat,23,,,23113000AW0142,,,,,,,,,,,,,0,,,,,BT,taillis simples,,,7960,2.367796,45.962685
2021-325314,2021-12-29,000001,Vente,14000,,,PUY D EROULLETAS,B357,23190,23113,Lupersat,23,,,23113000AW0143,,,,,,,,,,,,,0,,,,,BT,taillis simples,,,9165,2.366907,45.961828
2021-325314,2021-12-29,000001,Vente,14000,,,PUY D EROULLETAS,B357,23190,23113,Lupersat,23,,,23113000AW0144,,,,,,,,,,,,,0,,,,,BT,taillis simples,,,15760,2.366669,45.962558
2021-325314,2021-12-29,000001,Vente,14000,,,LA NAUTE,B294,23190,23113,Lupersat,23,,,23113000AZ0095,,,,,,,,,,,,,0,,,,,BT,taillis simples,,,2369,2.363196,45.972311
2021-325314,2021-12-29,000001,Vente,14000,,,LA NAUTE,B294,23190,23113,Lupersat,23,,,23113000AZ0100,,,,,,,,,,,,,0,,,,,BT,taillis simples,,,1010,2.362854,45.971065
2021-325314,2021-12-29,000001,Vente,14000,,,TOURTIVAT,B420,23190,23113,Lupersat,23,,,23113000BE0109,,,,,,,,,,,,,0,,,,,BT,taillis simples,,,4455,2.364923,45.98047
2021-325314,2021-12-29,000001,Vente,14000,,,TOURTIVAT,B420,23190,23113,Lupersat,23,,,23113000BE0110,,,,,,,,,,,,,0,,,,,BR,futaies résineuses,SAPIN,Sapins ou sapinière,3768,2.365937,45.980603
2021-325314,2021-12-29,000001,Vente,14000,,,LE PUY DE VILLEVIJEANNE,B380,23190,23113,Lupersat,23,,,23113000BE0129,,,,,,,,,,,,,0,,,,,BT,taillis simples,,,2817,2.362383,45.980005
2021-325314,2021-12-29,000001,Vente,14000,,,LE PUY DE VILLEVIJEANNE,B380,23190,23113,Lupersat,23,,,23113000BE0130,,,,,,,,,,,,,0,,,,,BT,taillis simples,,,6464,2.363062,45.979662
2021-325314,2021-12-29,000001,Vente,14000,,,LE PUY DE VILLEVIJEANNE,B380,23190,23113,Lupersat,23,,,23113000BE0144,,,,,,,,,,,,,0,,,,,BT,taillis simples,,,1225,2.362739,45.977722
