id_mutation,date_mutation,numero_disposition,nature_mutation,valeur_fonciere,adresse_numero,adresse_suffixe,adresse_nom_voie,adresse_code_voie,code_postal,code_commune,nom_commune,code_departement,ancien_code_commune,ancien_nom_commune,id_parcelle,ancien_id_parcelle,numero_volume,lot1_numero,lot1_surface_carrez,lot2_numero,lot2_surface_carrez,lot3_numero,lot3_surface_carrez,lot4_numero,lot4_surface_carrez,lot5_numero,lot5_surface_carrez,nombre_lots,code_type_local,type_local,surface_reelle_bati,nombre_pieces_principales,code_nature_culture,nature_culture,code_nature_culture_speciale,nature_culture_speciale,surface_terrain,longitude,latitude
2021-320267,2021-01-08,000001,Vente,8000,,,CHAMPARMELAUD,B075,23140,23154,Pionnat,23,,,231540000E0335,,,,,,,,,,,,,0,,,,,BR,futaies résineuses,,,8016,2.034551,46.137402
2021-320267,2021-01-08,000001,Vente,8000,,,CHAMPARMELAUD,B075,23140,23154,Pionnat,23,,,231540000E0337,,,,,,,,,,,,,0,,,,,BR,futaies résineuses,,,5813,2.035883,46.137308
2021-320583,2021-02-12,000001,Vente,143000,7,,RTE D'AJAIN,0011,23140,23154,Pionnat,23,,,23154000AB0008,,,,,,,,,,,,,0,3,Dépendance,,0,S,sols,,,100,2.024481,46.172899
2021-320583,2021-02-12,000001,Vente,143000,7,,RTE D'AJAIN,0011,23140,23154,Pionnat,23,,,23154000AB0008,,,,,,,,,,,,,0,3,Dépendance,,0,T,terres,,,1147,2.024481,46.172899
2021-320583,2021-02-12,000001,Vente,143000,7,,RTE D'AJAIN,0011,23140,23154,Pionnat,23,,,23154000AB0009,,,,,,,,,,,,,0,1,Maison,83,6,S,sols,,,642,2.024739,46.172785
2021-320583,2021-02-12,000001,Vente,143000,,,LES PERRIERES,B254,23140,23154,Pionnat,23,,,231540000H0053,,,,,,,,,,,,,0,,,,,BT,taillis simples,,,851,2.032259,46.175894
2021-320635,2021-02-01,000001,Vente,228000,,,COTES DU MOULIN,B132,23140,23154,Pionnat,23,,,231540000E0625,,,,,,,,,,,,,0,,,,,S,sols,,,230,2.010937,46.13999
2021-320635,2021-02-01,000001,Vente,228000,,,COTES DU MOULIN,B132,23140,23154,Pionnat,23,,,231540000E0626,,,,,,,,,,,,,0,,,,,P,prés,,,2420,2.011329,46.140068
2021-320635,2021-02-01,000001,Vente,228000,1,,MOULIN DU BREUIL,B232,23140,23154,Pionnat,23,,,231540000F0679,,,,,,,,,,,,,0,2,Appartement,90,3,S,sols,,,1860,2.010502,46.140053
2021-320635,2021-02-01,000001,Vente,228000,1,,MOULIN DU BREUIL,B232,23140,23154,Pionnat,23,,,231540000F0679,,,,,,,,,,,,,0,4,Local industriel. commercial ou assimilé,168,0,S,sols,,,1860,2.010502,46.140053
2021-320635,2021-02-01,000001,Vente,228000,1,,MOULIN DU BREUIL,B232,23140,23154,Pionnat,23,,,231540000F0679,,,,,,,,,,,,,0,2,Appartement,57,3,S,sols,,,1860,2.010502,46.140053
2021-320635,2021-02-01,000001,Vente,228000,1,,MOULIN DU BREUIL,B232,23140,23154,Pionnat,23,,,231540000F0679,,,,,,,,,,,,,0,2,Appartement,68,3,S,sols,,,1860,2.010502,46.140053
2021-320635,2021-02-01,000001,Vente,228000,,,MOULIN DU BREUIL,B232,23140,23154,Pionnat,23,,,231540000F0680,,,,,,,,,,,,,0,,,,,PA,pâtures,,,665,2.010201,46.140103
2021-320635,2021-02-01,000001,Vente,228000,,,MOULIN DU BREUIL,B232,23140,23154,Pionnat,23,,,231540000F0681,,,,,,,,,,,,,0,,,,,J,jardins,,,865,2.009733,46.140632
2021-320635,2021-02-01,000001,Vente,228000,,,FONT A LA FEE,B167,23140,23154,Pionnat,23,,,231540000F0870,,,,,,,,,,,,,0,,,,,PA,pâtures,,,470,2.00997,46.140039
2021-320701,2021-02-24,000001,Vente,71500,,,LAPEYRE,B209,23140,23154,Pionnat,23,,,231540000B0581,,,,,,,,,,,,,0,,,,,T,terres,,,815,2.042028,46.188673
2021-320701,2021-02-24,000001,Vente,71500,,,LAPEYRE,B209,23140,23154,Pionnat,23,,,231540000B0582,,,,,,,,,,,,,0,,,,,S,sols,,,26,2.042204,46.188618
2021-320701,2021-02-24,000001,Vente,71500,1,,LAPEYRE,B209,23140,23154,Pionnat,23,,,231540000B0583,,,,,,,,,,,,,0,1,Maison,66,4,S,sols,,,455,2.042436,46.188559
2021-320701,2021-02-24,000001,Vente,71500,,,LAPEYRE,B209,23140,23154,Pionnat,23,,,231540000B0584,,,,,,,,,,,,,0,,,,,P,prés,,,4813,2.042949,46.188501
2021-320701,2021-02-24,000001,Vente,71500,,,LAPEYRE,B209,23140,23154,Pionnat,23,,,231540000B0584,,,,,,,,,,,,,0,,,,,PA,pâtures,,,2407,2.042949,46.188501
2021-321266,2021-03-12,000001,Vente,150000,,,FOT,B179,23140,23154,Pionnat,23,,,231540000G0247,,,,,,,,,,,,,0,,,,,P,prés,,,19930,1.998558,46.171756
2021-321266,2021-03-12,000001,Vente,150000,,,FOT,B179,23140,23154,Pionnat,23,,,231540000G0248,,,,,,,,,,,,,0,,,,,E,eaux,MARE,Mare,245,1.999773,46.171371
2021-321266,2021-03-12,000001,Vente,150000,20,,FOT,B179,23140,23154,Pionnat,23,,,231540000G0249,,,,,,,,,,,,,0,1,Maison,86,5,S,sols,,,690,1.999825,46.171466
2021-321266,2021-03-12,000001,Vente,150000,,,FOT,B179,23140,23154,Pionnat,23,,,231540000G0250,,,,,,,,,,,,,0,,,,,J,jardins,,,315,2.000122,46.17143
2021-321288,2021-03-31,000001,Vente,360000,5615,,ROCHE ETROITE,B300,23140,23154,Pionnat,23,,,231540000E1239,,,,,,,,,,,,,0,4,Local industriel. commercial ou assimilé,42,0,BR,futaies résineuses,,,3395,2.023476,46.1271
2021-321288,2021-03-31,000001,Vente,360000,,,ROCHE ETROITE,B300,23140,23154,Pionnat,23,,,231540000E1411,,,,,,,,,,,,,0,,,,,L,landes,,,62,2.024435,46.127084
2021-321288,2021-03-31,000001,Vente,360000,5614,,ROCHE ETROITE,B300,23140,23154,Pionnat,23,,,231540000E1412,,,,,,,,,,,,,0,4,Local industriel. commercial ou assimilé,42,0,S,sols,,,703,2.02422,46.127215
2021-321288,2021-03-31,000001,Vente,360000,,,ROCHE ETROITE,B300,23140,23154,Pionnat,23,,,231540000E1415,,,,,,,,,,,,,0,,,,,BR,futaies résineuses,,,2872,2.023399,46.127331
2021-321352,2021-03-19,000001,Vente,53000,,,LA COSSE,B127,23140,23154,Pionnat,23,,,231540000C0698,,,,,,,,,,,,,0,,,,,S,sols,,,111,2.056592,46.185734
2021-321352,2021-03-19,000001,Vente,53000,7,,LA COSSE,B127,23140,23154,Pionnat,23,,,231540000C0699,,,,,,,,,,,,,0,1,Maison,64,2,S,sols,,,206,2.056424,46.185471
2021-321352,2021-03-19,000001,Vente,53000,,,LA COSSE,B127,23140,23154,Pionnat,23,,,231540000C0700,,,,,,,,,,,,,0,,,,,P,prés,,,674,2.056396,46.185559
2021-321352,2021-03-19,000001,Vente,53000,,,LE PEUX,B264,23140,23154,Pionnat,23,,,231540000C0765,,,,,,,,,,,,,0,,,,,BT,taillis simples,,,1260,2.059246,46.183511
2021-321412,2021-04-14,000001,Vente,2000,,,COTES DU MOULIN,B132,23140,23154,Pionnat,23,,,231540000E0631,,,,,,,,,,,,,0,,,,,BP,peupleraies,,,745,2.013917,46.140606
2021-321412,2021-04-14,000001,Vente,2000,,,COTES DU MOULIN,B132,23140,23154,Pionnat,23,,,231540000E0632,,,,,,,,,,,,,0,,,,,BP,peupleraies,,,4180,2.014034,46.140277
2021-321643,2021-04-27,000001,Vente,2000,,,CHASSOGNE,B084,23140,23154,Pionnat,23,,,231540000D0984,,,,,,,,,,,,,0,,,,,P,prés,,,1190,2.041266,46.165317
2021-321683,2021-04-21,000001,Vente,85000,,,PEU MEAUME,B262,23140,23154,Pionnat,23,,,231540000G0474,,,,,,,,,,,,,0,,,,,T,terres,,,3216,1.990462,46.168839
2021-321683,2021-04-21,000001,Vente,85000,,,PEU MEAUME,B262,23140,23154,Pionnat,23,,,231540000G0483,,,,,,,,,,,,,0,,,,,BT,taillis simples,,,1567,1.984619,46.167806
2021-321683,2021-04-21,000001,Vente,85000,,,PEU MEAUME,B262,23140,23154,Pionnat,23,,,231540000G0484,,,,,,,,,,,,,0,,,,,T,terres,,,4713,1.983658,46.167844
2021-321683,2021-04-21,000001,Vente,85000,,,PEU MEAUME,B262,23140,23154,Pionnat,23,,,231540000G0485,,,,,,,,,,,,,0,,,,,T,terres,,,8270,1.984707,46.168254
2021-321683,2021-04-21,000001,Vente,85000,,,PEU MEAUME,B262,23140,23154,Pionnat,23,,,231540000G0486,,,,,,,,,,,,,0,,,,,BT,taillis simples,,,365,1.985053,46.168014
2021-321683,2021-04-21,000001,Vente,85000,,,PEU MEAUME,B262,23140,23154,Pionnat,23,,,231540000G0487,,,,,,,,,,,,,0,,,,,BT,taillis simples,,,1920,1.985735,46.167999
2021-321683,2021-04-21,000001,Vente,85000,,,PEU MEAUME,B262,23140,23154,Pionnat,23,,,231540000G0488,,,,,,,,,,,,,0,,,,,T,terres,,,1430,1.985635,46.168261
2021-321683,2021-04-21,000001,Vente,85000,,,PEU MEAUME,B262,23140,23154,Pionnat,23,,,231540000G0489,,,,,,,,,,,,,0,,,,,BT,taillis simples,,,6792,1.985829,46.169036
2021-321683,2021-04-21,000001,Vente,85000,,,PEU MEAUME,B262,23140,23154,Pionnat,23,,,231540000G0491,,,,,,,,,,,,,0,,,,,BT,taillis simples,,,3071,1.987099,46.168447
2021-321683,2021-04-21,000001,Vente,85000,,,PEU MEAUME,B262,23140,23154,Pionnat,23,,,231540000G0492,,,,,,,,,,,,,0,,,,,BT,taillis simples,,,2837,1.987726,46.168669
2021-321683,2021-04-21,000001,Vente,85000,,,PEU MEAUME,B262,23140,23154,Pionnat,23,,,231540000G0494,,,,,,,,,,,,,0,,,,,BT,taillis simples,,,1723,1.987405,46.169388
2021-321683,2021-04-21,000001,Vente,85000,,,PEU MEAUME,B262,23140,23154,Pionnat,23,,,231540000G0496,,,,,,,,,,,,,0,,,,,T,terres,,,8342,1.988983,46.169675
2021-321683,2021-04-21,000001,Vente,85000,,,PEU MEAUME,B262,23140,23154,Pionnat,23,,,231540000G0497,,,,,,,,,,,,,0,,,,,T,terres,,,19385,1.987411,46.170365
2021-321683,2021-04-21,000001,Vente,85000,,,PEU MEAUME,B262,23140,23154,Pionnat,23,,,231540000G0499,,,,,,,,,,,,,0,,,,,BT,taillis simples,,,6792,1.985117,46.168935
2021-321683,2021-04-21,000001,Vente,85000,,,PEU MEAUME,B262,23140,23154,Pionnat,23,,,231540000G0500,,,,,,,,,,,,,0,,,,,BT,taillis simples,,,635,1.984504,46.168616
2021-321683,2021-04-21,000001,Vente,85000,,,DU RIES,B298,23140,23154,Pionnat,23,,,231540000G0530,,,,,,,,,,,,,0,,,,,T,terres,,,5306,1.982457,46.168248
2021-321683,2021-04-21,000001,Vente,85000,,,LA VILLETETE,B339,23140,23154,Pionnat,23,,,231540000G0660,,,,,,,,,,,,,0,,,,,T,terres,,,9236,1.983337,46.167535
2021-321683,2021-04-21,000001,Vente,85000,,,LA VILLETETE,B339,23140,23154,Pionnat,23,,,231540000G0661,,,,,,,,,,,,,0,,,,,PA,pâtures,,,17718,1.982645,46.166344
2021-321683,2021-04-21,000001,Vente,85000,,,LA VILLETETE,B339,23140,23154,Pionnat,23,,,231540000G0663,,,,,,,,,,,,,0,,,,,T,terres,,,15632,1.984239,46.166394
2021-321683,2021-04-21,000001,Vente,85000,,,LA VILLETETE,B339,23140,23154,Pionnat,23,,,231540000G0684,,,,,,,,,,,,,0,,,,,BT,taillis simples,,,245,1.986432,46.166593
2021-321683,2021-04-21,000001,Vente,85000,,,LA VILLETETE,B339,23140,23154,Pionnat,23,,,231540000G0685,,,,,,,,,,,,,0,,,,,T,terres,,,7793,1.986112,46.165549
2021-321683,2021-04-21,000001,Vente,85000,,,LA VILLETETE,B339,23140,23154,Pionnat,23,,,231540000G0686,,,,,,,,,,,,,0,,,,,T,terres,,,9120,1.987077,46.165653
2021-321683,2021-04-21,000001,Vente,85000,,,LA VILLETETE,B339,23140,23154,Pionnat,23,,,231540000G0687,,,,,,,,,,,,,0,,,,,BT,taillis simples,,,238,1.987053,46.166395
2021-321683,2021-04-21,000001,Vente,85000,,,LA VILLETETE,B339,23140,23154,Pionnat,23,,,231540000G0688,,,,,,,,,,,,,0,,,,,BT,taillis simples,,,328,1.986761,46.166575
2021-321683,2021-04-21,000001,Vente,85000,,,LES BORDERIES,B341,23140,23154,Pionnat,23,,,231540000G0689,,,,,,,,,,,,,0,,,,,T,terres,,,2195,1.98759,46.166227
2021-321683,2021-04-21,000001,Vente,85000,,,LES BORDERIES,B341,23140,23154,Pionnat,23,,,231540000G0690,,,,,,,,,,,,,0,,,,,T,terres,,,9435,1.987409,46.166947
2021-321683,2021-04-21,000001,Vente,85000,,,LES BORDERIES,B341,23140,23154,Pionnat,23,,,231540000G0696,,,,,,,,,,,,,0,,,,,T,terres,,,2615,1.988768,46.166645
2021-321683,2021-04-21,000001,Vente,85000,,,LES BORDERIES,B341,23140,23154,Pionnat,23,,,231540000G0697,,,,,,,,,,,,,0,,,,,T,terres,,,13245,1.988404,46.165918
2021-321683,2021-04-21,000001,Vente,85000,,,LES BORDERIES,B341,23140,23154,Pionnat,23,,,231540000G0698,,,,,,,,,,,,,0,,,,,T,terres,,,18137,1.988507,46.165005
2021-321683,2021-04-21,000001,Vente,85000,,,LES BORDERIES,B341,23140,23154,Pionnat,23,,,231540000G0700,,,,,,,,,,,,,0,,,,,BT,taillis simples,,,4701,1.989694,46.166144
2021-321683,2021-04-21,000001,Vente,85000,,,CAENE DE L ANE,B057,23140,23154,Pionnat,23,,,231540000G0704,,,,,,,,,,,,,0,,,,,BT,taillis simples,,,4970,1.991081,46.167537
2021-321683,2021-04-21,000001,Vente,85000,,,CAENE DE L ANE,B057,23140,23154,Pionnat,23,,,231540000G0711,,,,,,,,,,,,,0,,,,,BT,taillis simples,,,6731,1.992675,46.166979
2021-321683,2021-04-21,000001,Vente,85000,,,CAENE DE L ANE,B057,23140,23154,Pionnat,23,,,231540000G0713,,,,,,,,,,,,,0,,,,,BT,taillis simples,,,6147,1.993049,46.166273
2021-321683,2021-04-21,000001,Vente,85000,,,LES SAGNES,B367,23140,23154,Pionnat,23,,,231540000G0806,,,,,,,,,,,,,0,,,,,PA,pâtures,,,710,1.990031,46.162356
2021-321683,2021-04-21,000001,Vente,85000,,,LES SAGNES,B367,23140,23154,Pionnat,23,,,231540000G0808,,,,,,,,,,,,,0,,,,,T,terres,,,4715,1.989672,46.162522
2021-321683,2021-04-21,000001,Vente,85000,,,LES SAGNES,B367,23140,23154,Pionnat,23,,,231540000G0812,,,,,,,,,,,,,0,,,,,T,terres,,,83,1.986809,46.165003
2021-321683,2021-04-21,000001,Vente,85000,,,LES SAGNES,B367,23140,23154,Pionnat,23,,,231540000G0813,,,,,,,,,,,,,0,,,,,P,prés,,,2772,1.985979,46.164726
2021-321683,2021-04-21,000001,Vente,85000,,,LES SAGNES,B367,23140,23154,Pionnat,23,,,231540000G0814,,,,,,,,,,,,,0,,,,,T,terres,,,16815,1.986908,46.164397
2021-321683,2021-04-21,000001,Vente,85000,,,LES SAGNES,B367,23140,23154,Pionnat,23,,,231540000G0817,,,,,,,,,,,,,0,,,,,T,terres,,,11715,1.98739,46.163334
2021-321683,2021-04-21,000001,Vente,85000,,,LES SAGNES,B367,23140,23154,Pionnat,23,,,231540000G0818,,,,,,,,,,,,,0,,,,,T,terres,,,9425,1.987757,46.162448
2021-321683,2021-04-21,000001,Vente,85000,,,SOUS LA VILLE,B320,23140,23154,Pionnat,23,,,231540000G0819,,,,,,,,,,,,,0,,,,,P,prés,,,14640,1.987792,46.161393
2021-321683,2021-04-21,000001,Vente,85000,,,SOUS LA VILLE,B320,23140,23154,Pionnat,23,,,231540000G0820,,,,,,,,,,,,,0,,,,,BT,taillis simples,,,431,1.987316,46.16194
2021-321683,2021-04-21,000001,Vente,85000,,,SOUS LA VILLE,B320,23140,23154,Pionnat,23,,,231540000G0823,,,,,,,,,,,,,0,,,,,PA,pâtures,,,7921,1.984217,46.162533
2021-321683,2021-04-21,000001,Vente,85000,,,SOUS LA VILLE,B320,23140,23154,Pionnat,23,,,231540000G0825,,,,,,,,,,,,,0,,,,,PA,pâtures,,,12430,1.982515,46.162708
2021-321683,2021-04-21,000001,Vente,85000,,,SOUS LA VILLE,B320,23140,23154,Pionnat,23,,,231540000G0829,,,,,,,,,,,,,0,,,,,P,prés,,,7026,1.981854,46.163804
2021-321683,2021-04-21,000001,Vente,85000,,,SOUS LA VILLE,B320,23140,23154,Pionnat,23,,,231540000G0832,,,,,,,,,,,,,0,,,,,P,prés,,,5797,1.980761,46.164792
2021-321683,2021-04-21,000001,Vente,85000,,,SOUS LA VILLE,B320,23140,23154,Pionnat,23,,,231540000G0834,,,,,,,,,,,,,0,,,,,PA,pâtures,,,10147,1.980813,46.165689
2021-321683,2021-04-21,000001,Vente,85000,,,PONT A L EVEQUE,B279,23140,23154,Pionnat,23,,,231540000G0835,,,,,,,,,,,,,0,,,,,P,prés,,,11960,1.989183,46.161057
2021-321683,2021-04-21,000001,Vente,85000,,,PONT A L EVEQUE,B279,23140,23154,Pionnat,23,,,231540000G0836,,,,,,,,,,,,,0,,,,,L,landes,,,205,1.990399,46.1602
2021-321683,2021-04-21,000001,Vente,85000,,,FORGES,B177,23140,23154,Pionnat,23,,,231540000G0889,,,,,,,,,,,,,0,,,,,BT,taillis simples,,,65,1.989075,46.162001
2021-321704,2021-04-30,000001,Vente,121000,,,BREJASSOUX,B047,23140,23154,Pionnat,23,,,231540000A0499,,,,,,,,,,,,,0,,,,,S,sols,,,208,2.016334,46.195653
2021-321704,2021-04-30,000001,Vente,121000,9,,BREJASSOUX,B047,23140,23154,Pionnat,23,,,231540000A0500,,,,,,,,,,,,,0,1,Maison,166,5,S,sols,,,339,2.016525,46.195673
2021-321704,2021-04-30,000001,Vente,121000,,,BREJASSOUX,B047,23140,23154,Pionnat,23,,,231540000A0501,,,,,,,,,,,,,0,,,,,T,terres,,,1411,2.016542,46.195866
2021-321947,2021-05-12,000001,Vente,140000,,,LE BOIS,B011,23140,23154,Pionnat,23,,,231540000E0601,,,,,,,,,,,,,0,,,,,BT,taillis simples,,,13240,2.033314,46.143888
2021-321947,2021-05-12,000001,Vente,140000,25,,GDE BALEYTE,B189,23140,23154,Pionnat,23,,,231540000E1431,,,,,,,,,,,,,0,1,Maison,139,7,S,sols,,,1000,2.04362,46.144457
2021-321947,2021-05-12,000001,Vente,140000,25,,GDE BALEYTE,B189,23140,23154,Pionnat,23,,,231540000E1431,,,,,,,,,,,,,0,3,Dépendance,,0,S,sols,,,1000,2.04362,46.144457
2021-321947,2021-05-12,000001,Vente,140000,25,,GDE BALEYTE,B189,23140,23154,Pionnat,23,,,231540000E1431,,,,,,,,,,,,,0,1,Maison,139,7,P,prés,,,1979,2.04362,46.144457
2021-321947,2021-05-12,000001,Vente,140000,25,,GDE BALEYTE,B189,23140,23154,Pionnat,23,,,231540000E1431,,,,,,,,,,,,,0,3,Dépendance,,0,P,prés,,,1979,2.04362,46.144457
2021-322127,2021-05-17,000001,Vente,885,,,LES COMBETTES,B355,23140,23154,Pionnat,23,,,231540000C0619,,,,,,,,,,,,,0,,,,,T,terres,,,821,2.056325,46.186791
2021-322127,2021-05-17,000001,Vente,885,,,LES COMBETTES,B355,23140,23154,Pionnat,23,,,231540000C0620,,,,,,,,,,,,,0,,,,,T,terres,,,1410,2.056379,46.186625
2021-322127,2021-05-17,000001,Vente,885,,,LA COSSE,B127,23140,23154,Pionnat,23,,,231540000C0695,,,,,,,,,,,,,0,,,,,L,landes,,,39,2.056903,46.185457
2021-322127,2021-05-17,000001,Vente,885,,,LA COSSE,B127,23140,23154,Pionnat,23,,,231540000C0696,,,,,,,,,,,,,0,,,,,P,prés,,,1261,2.057108,46.185561
2021-322127,2021-05-17,000001,Vente,885,,,LA COSSE,B127,23140,23154,Pionnat,23,,,231540000C0697,,,,,,,,,,,,,0,,,,,BT,taillis simples,,,497,2.056886,46.185825
2021-322127,2021-05-17,000001,Vente,885,,,LA COSSE,B127,23140,23154,Pionnat,23,,,231540000C0701,,,,,,,,,,,,,0,,,,,T,terres,,,540,2.056079,46.1857
2021-322127,2021-05-17,000001,Vente,885,,,LA COSSE,B127,23140,23154,Pionnat,23,,,231540000C0702,,,,,,,,,,,,,0,,,,,J,jardins,,,350,2.05583,46.185855
2021-322127,2021-05-17,000001,Vente,885,,,LA COSSE,B127,23140,23154,Pionnat,23,,,231540000C0744,,,,,,,,,,,,,0,,,,,BT,taillis simples,,,729,2.05845,46.184734
2021-322163,2021-06-01,000001,Vente,8800,,,LA BUIGE,B050,23140,23154,Pionnat,23,,,231540000E0535,,,,,,,,,,,,,0,,,,,BT,taillis simples,,,1374,2.03713,46.140815
2021-322163,2021-06-01,000001,Vente,8800,,,LA BUIGE,B050,23140,23154,Pionnat,23,,,231540000E0536,,,,,,,,,,,,,0,,,,,BF,futaies feuillues,,,2890,2.037736,46.140961
2021-322163,2021-06-01,000001,Vente,8800,,,LA BUIGE,B050,23140,23154,Pionnat,23,,,231540000E0540,,,,,,,,,,,,,0,,,,,T,terres,,,16760,2.039482,46.140564
2021-322163,2021-06-01,000001,Vente,8800,,,LA BUIGE,B050,23140,23154,Pionnat,23,,,231540000E0541,,,,,,,,,,,,,0,,,,,T,terres,,,16510,2.038833,46.141589
2021-322163,2021-06-01,000001,Vente,8800,,,BEAU LA JOUR,B006,23140,23154,Pionnat,23,,,231540000E0564,,,,,,,,,,,,,0,,,,,T,terres,,,8785,2.039895,46.140259
2021-322188,2021-06-01,000001,Vente,70000,,,CHASSOGNE,B084,23140,23154,Pionnat,23,,,231540000D0552,,,,,,,,,,,,,0,,,,,T,terres,,,1350,2.040858,46.163002
2021-322188,2021-06-01,000001,Vente,70000,,,CHASSOGNE,B084,23140,23154,Pionnat,23,,,231540000D0553,,,,,,,,,,,,,0,,,,,S,sols,,,128,2.040232,46.163493
2021-322188,2021-06-01,000001,Vente,70000,,,CHASSOGNE,B084,23140,23154,Pionnat,23,,,231540000D0554,,,,,,,,,,,,,0,,,,,T,terres,,,2652,2.04069,46.163312
2021-322188,2021-06-01,000001,Vente,70000,,,CHASSOGNE,B084,23140,23154,Pionnat,23,,,231540000D0555,,,,,,,,,,,,,0,,,,,S,sols,,,30,2.041459,46.162946
2021-322188,2021-06-01,000001,Vente,70000,,,CHASSOGNE,B084,23140,23154,Pionnat,23,,,231540000D0556,,,,,,,,,,,,,0,,,,,J,jardins,,,222,2.041496,46.163007
2021-322188,2021-06-01,000001,Vente,70000,6,,CHASSOGNE,B084,23140,23154,Pionnat,23,,,231540000D0557,,,,,,,,,,,,,0,1,Maison,116,5,S,sols,,,289,2.041449,46.163095
2021-322188,2021-06-01,000001,Vente,70000,,,CHASSOGNE,B084,23140,23154,Pionnat,23,,,231540000D1046,,,,,,,,,,,,,0,,,,,T,terres,,,329,2.040969,46.163055
2021-322198,2021-05-17,000001,Vente,1000,,,PIECE CLOSE,B265,23140,23154,Pionnat,23,,,231540000D0347,,,,,,,,,,,,,0,,,,,T,terres,,,2576,2.029692,46.172641
2021-322200,2021-05-17,000001,Vente,10000,,,PIONNAT,B272,23140,23154,Pionnat,23,,,23154000AB0001,,,,,,,,,,,,,0,,,,,T,terres,,,8528,2.022492,46.172127
2021-322200,2021-05-17,000001,Vente,10000,,,LE PECHER,B246,23140,23154,Pionnat,23,,,231540000H0088,,,,,,,,,,,,,0,,,,,P,prés,,,6225,2.022365,46.17303
2021-322200,2021-05-17,000001,Vente,10000,,,LA CHABANNE,B063,23140,23154,Pionnat,23,,,231540000H0544,,,,,,,,,,,,,0,,,,,J,jardins,,,943,2.022182,46.171296
2021-322200,2021-05-17,000001,Vente,10000,,,LA CHABANNE,B063,23140,23154,Pionnat,23,,,231540000H0546,,,,,,,,,,,,,0,,,,,S,sols,,,83,2.022156,46.17121
2021-322210,2021-06-03,000001,Vente,1639.85,,,LE PEU,B258,23140,23154,Pionnat,23,,,231540000G1075,,,,,,,,,,,,,0,,,,,T,terres,,,5744,2.000504,46.157662
2021-322211,2021-06-03,000002,Vente,2360.15,,,LE PEU,B258,23140,23154,Pionnat,23,,,231540000G1074,,,,,,,,,,,,,0,,,,,L,landes,,,8267,2.001285,46.157888
2021-322663,2021-06-18,000001,Vente,350,,,PIONNAT,B272,23140,23154,Pionnat,23,,,23154000AB0313,,,,,,,,,,,,,0,,,,,T,terres,,,174,2.020786,46.169746
2021-322750,2021-07-01,000001,Vente,76056.8,,,BREGERE,B043,23140,23154,Pionnat,23,,,231540000E1408,,,,,,,,,,,,,0,,,,,T,terres,,,1322,2.055348,46.147777
2021-322750,2021-07-01,000001,Vente,76056.8,,,BREGERE,B043,23140,23154,Pionnat,23,,,231540000E1408,,,,,,,,,,,,,0,,,,,P,prés,,,8320,2.055348,46.147777
2021-322750,2021-07-01,000001,Vente,76056.8,,,BREGERE,B043,23140,23154,Pionnat,23,,,231540000E1409,,,,,,,,,,,,,0,,,,,T,terres,,,26785,2.055701,46.146205
2021-322943,2021-07-21,000001,Vente,225000,5696,,LA BUSSIERE,B056,23140,23154,Pionnat,23,,,23154000ZB0031,,,,,,,,,,,,,0,1,Maison,215,8,S,sols,,,500,2.034825,46.201865
2021-322943,2021-07-21,000001,Vente,225000,5696,,LA BUSSIERE,B056,23140,23154,Pionnat,23,,,23154000ZB0031,,,,,,,,,,,,,0,1,Maison,215,8,T,terres,,,3050,2.034825,46.201865
2021-323499,2021-08-12,000001,Vente,10000,,,FAYE,B157,23140,23154,Pionnat,23,,,231540000H0455,,,,,,,,,,,,,0,,,,,T,terres,,,21110,,
2021-323816,2021-09-02,000002,Vente,20000,5,,GDE BALEYTE,B189,23140,23154,Pionnat,23,,,231540000E0239,,,,,,,,,,,,,0,1,Maison,74,3,S,sols,,,64,2.046728,46.144805
2021-323816,2021-09-02,000002,Vente,20000,,,GDE BALEYTE,B189,23140,23154,Pionnat,23,,,231540000E1439,,,,,,,,,,,,,0,,,,,J,jardins,,,346,2.046699,46.144722
2021-323884,2021-09-10,000001,Vente,12200,,,CHAMP BIGENEY,B068,23140,23154,Pionnat,23,,,231540000E0489,,,,,,,,,,,,,0,,,,,PA,pâtures,,,3475,2.034449,46.144979
2021-323884,2021-09-10,000001,Vente,12200,,,CHAMP BIGENEY,B068,23140,23154,Pionnat,23,,,231540000E0490,,,,,,,,,,,,,0,,,,,PA,pâtures,,,800,2.034494,46.144881
2021-323884,2021-09-10,000001,Vente,12200,,,CHABANNE,B062,23140,23154,Pionnat,23,,,231540000E0514,,,,,,,,,,,,,0,,,,,BT,taillis simples,,,2560,2.039864,46.145512
2021-323884,2021-09-10,000001,Vente,12200,,,CHABANNE,B062,23140,23154,Pionnat,23,,,231540000E0515,,,,,,,,,,,,,0,,,,,T,terres,,,7725,2.040674,46.145269
2021-323884,2021-09-10,000001,Vente,12200,,,LA BUIGE,B050,23140,23154,Pionnat,23,,,231540000E0521,,,,,,,,,,,,,0,,,,,T,terres,,,7334,2.042194,46.14351
2021-323884,2021-09-10,000001,Vente,12200,,,LA BUIGE,B050,23140,23154,Pionnat,23,,,231540000E0522,,,,,,,,,,,,,0,,,,,P,prés,,,10270,2.04126,46.14323
2021-323884,2021-09-10,000001,Vente,12200,,,LA BUIGE,B050,23140,23154,Pionnat,23,,,231540000E0527,,,,,,,,,,,,,0,,,,,P,prés,,,8750,2.040566,46.142676
2021-323884,2021-09-10,000001,Vente,12200,,,LA BUIGE,B050,23140,23154,Pionnat,23,,,231540000E0542,,,,,,,,,,,,,0,,,,,T,terres,,,13950,2.04031,46.141958
2021-323884,2021-09-10,000001,Vente,12200,,,LE BOIS,B011,23140,23154,Pionnat,23,,,231540000E0603,,,,,,,,,,,,,0,,,,,BT,taillis simples,,,10610,2.034495,46.144434
2021-324256,2021-10-05,000001,Vente,2000,8,,LES TERNES,B323,23140,23154,Pionnat,23,,,231540000D0671,,,,,,,,,,,,,0,1,Maison,32,0,S,sols,,,43,2.044385,46.167748
2021-324400,2021-11-02,000001,Vente,9810.65,,,MOULIN DES FORGES,B231,23140,23154,Pionnat,23,,,231540000G1112,,,,,,,,,,,,,0,,,,,S,sols,,,66,1.992353,46.155811
2021-324400,2021-11-02,000001,Vente,9810.65,,,MOULIN DES FORGES,B231,23140,23154,Pionnat,23,,,231540000G1113,,,,,,,,,,,,,0,,,,,P,prés,,,14754,1.992897,46.155467
2021-324400,2021-11-02,000001,Vente,9810.65,,,PIERRE BLANCHE,B366,23140,23154,Pionnat,23,,,231540000G1135,,,,,,,,,,,,,0,,,,,L,landes,,,1542,1.996739,46.155739
2021-324400,2021-11-02,000001,Vente,9810.65,,,PIERRE BLANCHE,B366,23140,23154,Pionnat,23,,,231540000G1136,,,,,,,,,,,,,0,,,,,T,terres,,,15315,1.996181,46.156508
2021-324403,2021-11-02,000001,Vente,1434.75,,,PONT A L EVEQUE,B279,23140,23154,Pionnat,23,,,231540000G0853,,,,,,,,,,,,,0,,,,,P,prés,,,6345,1.991298,46.156691
2021-324457,2021-11-02,000001,Vente,2000,,,GDE BALEYTE,B189,23140,23154,Pionnat,23,,,231540000E1440,,,,,,,,,,,,,0,,,,,J,jardins,,,147,2.04654,46.144616
2021-324755,2021-11-08,000001,Vente,23914.5,,,LACHAUD,B364,23140,23154,Pionnat,23,,,231540000G0980,,,,,,,,,,,,,0,,,,,T,terres,,,7051,2.006121,46.161191
2021-324755,2021-11-08,000001,Vente,23914.5,,,LACHAUD,B364,23140,23154,Pionnat,23,,,231540000G1001,,,,,,,,,,,,,0,,,,,T,terres,,,2810,2.00563,46.160062
2021-324755,2021-11-08,000001,Vente,23914.5,,,FONT GELADE,B170,23140,23154,Pionnat,23,,,231540000H0302,,,,,,,,,,,,,0,,,,,T,terres,,,57450,2.023782,46.162639