id_mutation,date_mutation,numero_disposition,nature_mutation,valeur_fonciere,adresse_numero,adresse_suffixe,adresse_nom_voie,adresse_code_voie,code_postal,code_commune,nom_commune,code_departement,ancien_code_commune,ancien_nom_commune,id_parcelle,ancien_id_parcelle,numero_volume,lot1_numero,lot1_surface_carrez,lot2_numero,lot2_surface_carrez,lot3_numero,lot3_surface_carrez,lot4_numero,lot4_surface_carrez,lot5_numero,lot5_surface_carrez,nombre_lots,code_type_local,type_local,surface_reelle_bati,nombre_pieces_principales,code_nature_culture,nature_culture,code_nature_culture_speciale,nature_culture_speciale,surface_terrain,longitude,latitude
2021-327554,2021-03-03,000001,Vente,90000,25,B,LES FLOURIDES,B009,24540,24231,Lavalade,24,,,242310000A0778,,,,,,,,,,,,,0,3,Dépendance,,0,T,terres,,,1730,0.861947,44.691737
2021-327554,2021-03-03,000001,Vente,90000,25,B,LES FLOURIDES,B009,24540,24231,Lavalade,24,,,242310000A0778,,,,,,,,,,,,,0,3,Dépendance,,0,S,sols,,,800,0.861947,44.691737
2021-327554,2021-03-03,000001,Vente,90000,25,B,LES FLOURIDES,B009,24540,24231,Lavalade,24,,,242310000A0778,,,,,,,,,,,,,0,1,Maison,101,4,S,sols,,,800,0.861947,44.691737
2021-327554,2021-03-03,000001,Vente,90000,25,B,LES FLOURIDES,B009,24540,24231,Lavalade,24,,,242310000A0778,,,,,,,,,,,,,0,1,Maison,101,4,T,terres,,,1730,0.861947,44.691737
2021-328897,2021-04-15,000001,Vente,198500,25,C,LES FLOURIDES,B009,24540,24231,Lavalade,24,,,242310000A0859,,,,,,,,,,,,,0,1,Maison,100,3,S,sols,,,820,0.858791,44.691499
2021-328897,2021-04-15,000001,Vente,198500,,,LES FLOURIDES,B009,24540,24231,Lavalade,24,,,242310000A0897,,,,,,,,,,,,,0,,,,,P,prés,,,2500,0.85889,44.691598
2021-329177,2021-04-15,000001,Vente,125000,,,GUINOT,B018,24540,24231,Lavalade,24,,,242310000A0519,,,,,,,,,,,,,0,,,,,T,terres,,,2315,0.852464,44.689477
2021-329177,2021-04-15,000001,Vente,125000,,,GUINOT,B018,24540,24231,Lavalade,24,,,242310000A0732,,,,,,,,,,,,,0,,,,,T,terres,,,2047,0.852753,44.689825
2021-329177,2021-04-15,000001,Vente,125000,,,GUINOT,B018,24540,24231,Lavalade,24,,,242310000A0734,,,,,,,,,,,,,0,,,,,T,terres,,,118,0.852441,44.690042
2021-329177,2021-04-15,000001,Vente,125000,,,GUINOT,B018,24540,24231,Lavalade,24,,,242310000A0736,,,,,,,,,,,,,0,,,,,T,terres,,,7305,0.851789,44.689734
2021-329177,2021-04-15,000001,Vente,125000,,,GUINOT,B018,24540,24231,Lavalade,24,,,242310000A0757,,,,,,,,,,,,,0,,,,,P,prés,,,14,0.85187,44.690373
2021-329177,2021-04-15,000001,Vente,125000,29,A,GUINOT,B018,24540,24231,Lavalade,24,,,242310000A0850,,,,,,,,,,,,,0,3,Dépendance,,0,S,sols,,,1085,0.852266,44.690216
2021-329177,2021-04-15,000001,Vente,125000,29,A,GUINOT,B018,24540,24231,Lavalade,24,,,242310000A0850,,,,,,,,,,,,,0,1,Maison,100,3,S,sols,,,1085,0.852266,44.690216
2021-329177,2021-04-15,000001,Vente,125000,,,GUINOT,B018,24540,24231,Lavalade,24,,,242310000A0851,,,,,,,,,,,,,0,,,,,S,sols,,,864,0.851747,44.690156
2021-329177,2021-04-15,000001,Vente,125000,,,GUINOT,B018,24540,24231,Lavalade,24,,,242310000A0851,,,,,,,,,,,,,0,,,,,P,prés,,,666,0.851747,44.690156
2021-329177,2021-04-15,000001,Vente,125000,,,GUINOT,B018,24540,24231,Lavalade,24,,,242310000A0916,,,,,,,,,,,,,0,,,,,S,sols,,,200,0.852099,44.690358
2021-330448,2021-05-17,000001,Vente,250000,,,GUINOT,B018,24540,24231,Lavalade,24,,,242310000A0544,,,,,,,,,,,,,0,,,,,P,prés,,,1600,0.85073,44.691555
2021-330448,2021-05-17,000001,Vente,250000,32,,GUINOT,B018,24540,24231,Lavalade,24,,,242310000A0908,,,,,,,,,,,,,0,1,Maison,123,5,S,sols,,,200,0.85094,44.691336
2021-330448,2021-05-17,000001,Vente,250000,32,,GUINOT,B018,24540,24231,Lavalade,24,,,242310000A0908,,,,,,,,,,,,,0,1,Maison,123,5,P,prés,,,1350,0.85094,44.691336
2021-330448,2021-05-17,000001,Vente,250000,,,GUINOT,B018,24540,24231,Lavalade,24,,,242310000A0933,,,,,,,,,,,,,0,,,,,T,terres,,,640,0.851145,44.691479
