id_mutation,date_mutation,numero_disposition,nature_mutation,valeur_fonciere,adresse_numero,adresse_suffixe,adresse_nom_voie,adresse_code_voie,code_postal,code_commune,nom_commune,code_departement,ancien_code_commune,ancien_nom_commune,id_parcelle,ancien_id_parcelle,numero_volume,lot1_numero,lot1_surface_carrez,lot2_numero,lot2_surface_carrez,lot3_numero,lot3_surface_carrez,lot4_numero,lot4_surface_carrez,lot5_numero,lot5_surface_carrez,nombre_lots,code_type_local,type_local,surface_reelle_bati,nombre_pieces_principales,code_nature_culture,nature_culture,code_nature_culture_speciale,nature_culture_speciale,surface_terrain,longitude,latitude
2021-326216,2021-01-19,000001,Vente,2000,,,FORET HAUTE,B038,24400,24234,Les Lèches,24,,,24234000WK0014,,,,,,,,,,,,,0,,,,,BR,futaies résineuses,,,13275,0.410492,44.947775
2021-326413,2021-01-27,000001,Vente,16000,,,LES MAZIERES,B054,24400,24234,Les Lèches,24,,,24234000WI0019,,,,,,,,,,,,,0,,,,,BT,taillis simples,,,10000,0.421334,44.95041
2021-326413,2021-01-27,000001,Vente,16000,,,LES MAZIERES,B054,24400,24234,Les Lèches,24,,,24234000WI0019,,,,,,,,,,,,,0,,,,,BR,futaies résineuses,,,30061,0.421334,44.95041
2021-326555,2021-02-04,000001,Vente,151000,9998,,LES BOUYGETTES,B015,24400,24234,Les Lèches,24,,,24234000ZB0206,,,,,,,,,,,,,0,1,Maison,98,4,S,sols,,,800,0.374648,45.001087
2021-326555,2021-02-04,000001,Vente,151000,9998,,LES BOUYGETTES,B015,24400,24234,Les Lèches,24,,,24234000ZB0206,,,,,,,,,,,,,0,1,Maison,98,4,AG,terrains d'agrément,,,769,0.374648,45.001087
2021-327401,2021-03-08,000001,Vente,8500,10,,LE BOURG-NORD,B011,24400,24234,Les Lèches,24,,,24234000ZC0151,,,,,,,,,,,,,0,3,Dépendance,,0,S,sols,,,303,0.383688,44.989873
2021-327401,2021-03-08,000001,Vente,8500,10,,LE BOURG-NORD,B011,24400,24234,Les Lèches,24,,,24234000ZC0151,,,,,,,,,,,,,0,3,Dépendance,,0,S,sols,,,303,0.383688,44.989873
2021-328583,2021-03-17,000001,Vente,110000,,,HAUT TRESSEROUX,B042,24400,24234,Les Lèches,24,,,24234000ZH0032,,,,,,,,,,,,,0,,,,,BS,taillis sous futaie,,,1210,0.403416,44.974791
2021-328583,2021-03-17,000001,Vente,110000,,,HAUT TRESSEROUX,B042,24400,24234,Les Lèches,24,,,24234000ZH0032,,,,,,,,,,,,,0,,,,,BT,taillis simples,,,1220,0.403416,44.974791
2021-329087,2021-04-02,000001,Vente,19500,,,LES GRAULES,B041,24400,24234,Les Lèches,24,,,24234000AB0001,,,,,,,,,,,,,0,,,,,BT,taillis simples,,,4333,0.372983,45.019633
2021-329087,2021-04-02,000001,Vente,19500,,,LES GRAULES,B041,24400,24234,Les Lèches,24,,,24234000AB0012,,,,,,,,,,,,,0,,,,,BT,taillis simples,,,1440,0.376703,45.016511
2021-329087,2021-04-02,000001,Vente,19500,,,LES GRAULES,B041,24400,24234,Les Lèches,24,,,24234000AB0013,,,,,,,,,,,,,0,,,,,T,terres,,,3370,0.37697,45.01695
2021-329087,2021-04-02,000001,Vente,19500,,,LES GRAULES,B041,24400,24234,Les Lèches,24,,,24234000AB0239,,,,,,,,,,,,,0,,,,,BS,taillis sous futaie,,,21395,0.372571,45.018811
2021-329087,2021-04-02,000001,Vente,19500,,,BUREE,B017,24400,24234,Les Lèches,24,,,24234000AB0240,,,,,,,,,,,,,0,,,,,BS,taillis sous futaie,,,960,0.371617,45.018387
2021-329087,2021-04-02,000001,Vente,19500,,,LES GRAULES,B041,24400,24234,Les Lèches,24,,,24234000AB0420,,,,,,,,,,,,,0,,,,,BT,taillis simples,,,2916,0.376963,45.016181
2021-330922,2021-06-04,000002,Vente,22401,,,LES GRAULES,B041,24400,24234,Les Lèches,24,,,24234000AB0624,,,,,,,,,,,,,0,,,,,BT,taillis simples,,,259,0.376863,45.012554
2021-330923,2021-06-04,000003,Vente,,,,LES GRAULES,B041,24400,24234,Les Lèches,24,,,24234000AB0457,,,,,,,,,,,,,0,,,,,BT,taillis simples,,,26,,
2021-330923,2021-06-04,000003,Vente,,,,LES GRAULES,B041,24400,24234,Les Lèches,24,,,24234000AB0624,,,,,,,,,,,,,0,,,,,BT,taillis simples,,,259,0.376863,45.012554
2021-330923,2021-06-04,000003,Vente,,,,LES GRAULES,B041,24400,24234,Les Lèches,24,,,24234000AB0631,,,,,,,,,,,,,0,,,,,BT,taillis simples,,,246,,
2021-330923,2021-06-04,000003,Vente,,480,,LES GRAULES,B041,24400,24234,Les Lèches,24,,,24234000AB0647,,,,,,,,,,,,,0,4,Local industriel. commercial ou assimilé,1697,0,BT,taillis simples,,,3996,0.375521,45.014917
2021-330923,2021-06-04,000003,Vente,,,,LES GRAULES,B041,24400,24234,Les Lèches,24,,,24234000AB0648,,,,,,,,,,,,,0,,,,,BT,taillis simples,,,4112,0.374656,45.015034
2021-330923,2021-06-04,000003,Vente,,,,LES GRAULES,B041,24400,24234,Les Lèches,24,,,24234000AB0649,,,,,,,,,,,,,0,,,,,BT,taillis simples,,,4057,0.375234,45.014403
2021-330923,2021-06-04,000003,Vente,,,,LES GRAULES,B041,24400,24234,Les Lèches,24,,,24234000AB0650,,,,,,,,,,,,,0,,,,,BT,taillis simples,,,215,0.375718,45.014211
2021-330923,2021-06-04,000003,Vente,,,,LES GRAULES,B041,24400,24234,Les Lèches,24,,,24234000AB0651,,,,,,,,,,,,,0,,,,,BT,taillis simples,,,126,0.375672,45.014333
2021-330923,2021-06-04,000003,Vente,,9010,,LES GRAULES,B041,24400,24234,Les Lèches,24,,,24234000ZA0311,,,,,,,,,,,,,0,4,Local industriel. commercial ou assimilé,592,0,T,terres,,,3593,,
2021-330923,2021-06-04,000003,Vente,,,,LES GRAULES,B041,24400,24234,Les Lèches,24,,,24234000ZA0312,,,,,,,,,,,,,0,,,,,T,terres,,,1810,,
2021-331397,2021-06-01,000001,Vente,295950,,,LE PIC-NORD,B065,24400,24234,Les Lèches,24,,,24234000ZA0129,,,,,,,,,,,,,0,,,,,J,jardins,,,569,0.377768,44.99855
2021-331397,2021-06-01,000001,Vente,295950,,,LE PIC-NORD,B065,24400,24234,Les Lèches,24,,,24234000ZA0132,,,,,,,,,,,,,0,,,,,J,jardins,,,556,0.377857,44.999012
2021-331397,2021-06-01,000001,Vente,295950,,,LE PIC-NORD,B065,24400,24234,Les Lèches,24,,,24234000ZA0356,,,,,,,,,,,,,0,,,,,P,prés,,,713,0.37752,44.998533
2021-331397,2021-06-01,000001,Vente,295950,68,,LE PIC-NORD,B065,24400,24234,Les Lèches,24,,,24234000ZA0358,,,,,,,,,,,,,0,3,Dépendance,,0,S,sols,,,1305,0.377806,44.998781
2021-331397,2021-06-01,000001,Vente,295950,68,,LE PIC-NORD,B065,24400,24234,Les Lèches,24,,,24234000ZA0358,,,,,,,,,,,,,0,3,Dépendance,,0,S,sols,,,1305,0.377806,44.998781
2021-331397,2021-06-01,000001,Vente,295950,68,,LE PIC-NORD,B065,24400,24234,Les Lèches,24,,,24234000ZA0358,,,,,,,,,,,,,0,1,Maison,220,5,S,sols,,,1305,0.377806,44.998781
2021-331397,2021-06-01,000001,Vente,295950,,,LE PIC-NORD,B065,24400,24234,Les Lèches,24,,,24234000ZA0361,,,,,,,,,,,,,0,,,,,S,sols,,,254,0.377668,44.998956
2021-331913,2021-06-04,000001,Vente terrain à bâtir,110000,,,LES GRAULES,B041,24400,24234,Les Lèches,24,,,24234000AB0441,,,,,,,,,,,,,0,,,,,BT,taillis simples,,,7675,0.375888,45.015748
2021-331936,2021-06-15,000001,Vente,20000,,,LE TILLET-EST,B076,24400,24234,Les Lèches,24,,,24234000ZI0041,,,,,,,,,,,,,0,,,,,S,sols,,,1300,0.4123,44.958421
2021-333828,2021-08-05,000001,Vente,22900,,,LAFOUILLOUZE,B044,24400,24234,Les Lèches,24,,,24234000ZC0164,,,,,,,,,,,,,0,,,,,P,prés,,,3000,0.370747,44.989128
2021-334764,2021-08-16,000001,Vente,2000,,,FORET HAUTE,B038,24400,24234,Les Lèches,24,,,24234000WK0014,,,,,,,,,,,,,0,,,,,BR,futaies résineuses,,,13275,0.410492,44.947775
2021-334876,2021-07-27,000001,Vente,162000,,,LE PIC-NORD,B065,24400,24234,Les Lèches,24,,,24234000ZA0103,,,,,,,,,,,,,0,,,,,S,sols,,,500,0.379048,44.998973
2021-334876,2021-07-27,000001,Vente,162000,,,LE PIC-NORD,B065,24400,24234,Les Lèches,24,,,24234000ZA0103,,,,,,,,,,,,,0,,,,,T,terres,,,4170,0.379048,44.998973
2021-334876,2021-07-27,000001,Vente,162000,63,B,LE PIC-NORD,B065,24400,24234,Les Lèches,24,,,24234000ZA0104,,,,,,,,,,,,,0,1,Maison,140,4,S,sols,,,463,0.378879,44.998896
2021-334876,2021-07-27,000001,Vente,162000,63,B,LE PIC-NORD,B065,24400,24234,Les Lèches,24,,,24234000ZA0104,,,,,,,,,,,,,0,3,Dépendance,,0,S,sols,,,463,0.378879,44.998896
2021-335035,2021-08-12,000001,Vente,30000,,,LE CLUZEAU,B025,24400,24234,Les Lèches,24,,,24234000ZK0037,,,,,,,,,,,,,0,,,,,S,sols,,,800,0.40562,44.949786
2021-335035,2021-08-12,000001,Vente,30000,,,LE CLUZEAU,B025,24400,24234,Les Lèches,24,,,24234000ZK0037,,,,,,,,,,,,,0,,,,,T,terres,,,3900,0.40562,44.949786
2021-335035,2021-08-12,000001,Vente,30000,,,LE CLUZEAU,B025,24400,24234,Les Lèches,24,,,24234000ZK0039,,,,,,,,,,,,,0,,,,,T,terres,,,19260,0.40358,44.951127
2021-336037,2021-09-14,000001,Vente,239,,,LES MARGAROUX,B053,24400,24234,Les Lèches,24,,,24234000ZM0113,,,,,,,,,,,,,0,,,,,P,prés,,,239,0.379194,44.984531
2021-336534,2021-09-30,000001,Vente,402000,6,,LE BOURG-SUD,B012,24400,24234,Les Lèches,24,,,24234000ZE0142,,,,,,,,,,,,,0,1,Maison,212,6,P,prés,,,9210,0.38655,44.9875
2021-336534,2021-09-30,000001,Vente,402000,6,,LE BOURG-SUD,B012,24400,24234,Les Lèches,24,,,24234000ZE0142,,,,,,,,,,,,,0,3,Dépendance,,0,P,prés,,,9210,0.38655,44.9875
2021-336534,2021-09-30,000001,Vente,402000,6,,LE BOURG-SUD,B012,24400,24234,Les Lèches,24,,,24234000ZE0142,,,,,,,,,,,,,0,1,Maison,212,6,S,sols,,,800,0.38655,44.9875
2021-336534,2021-09-30,000001,Vente,402000,6,,LE BOURG-SUD,B012,24400,24234,Les Lèches,24,,,24234000ZE0142,,,,,,,,,,,,,0,3,Dépendance,,0,P,prés,,,9210,0.38655,44.9875
2021-336534,2021-09-30,000001,Vente,402000,6,,LE BOURG-SUD,B012,24400,24234,Les Lèches,24,,,24234000ZE0142,,,,,,,,,,,,,0,3,Dépendance,,0,S,sols,,,800,0.38655,44.9875
2021-336534,2021-09-30,000001,Vente,402000,6,,LE BOURG-SUD,B012,24400,24234,Les Lèches,24,,,24234000ZE0142,,,,,,,,,,,,,0,3,Dépendance,,0,S,sols,,,800,0.38655,44.9875
2021-336534,2021-09-30,000001,Vente,402000,6,,LE BOURG-SUD,B012,24400,24234,Les Lèches,24,,,24234000ZE0142,,,,,,,,,,,,,0,3,Dépendance,,0,P,prés,,,9210,0.38655,44.9875
2021-336534,2021-09-30,000001,Vente,402000,6,,LE BOURG-SUD,B012,24400,24234,Les Lèches,24,,,24234000ZE0142,,,,,,,,,,,,,0,3,Dépendance,,0,P,prés,,,9210,0.38655,44.9875
2021-336534,2021-09-30,000001,Vente,402000,6,,LE BOURG-SUD,B012,24400,24234,Les Lèches,24,,,24234000ZE0142,,,,,,,,,,,,,0,3,Dépendance,,0,S,sols,,,800,0.38655,44.9875
2021-336534,2021-09-30,000001,Vente,402000,6,,LE BOURG-SUD,B012,24400,24234,Les Lèches,24,,,24234000ZE0142,,,,,,,,,,,,,0,3,Dépendance,,0,S,sols,,,800,0.38655,44.9875
2021-336860,2021-09-28,000001,Vente,1082200,,,LE BOURG-NORD,B011,24400,24234,Les Lèches,24,,,24234000ZC0088,,,,,,,,,,,,,0,,,,,P,prés,,,55764,0.381951,44.991773
2021-336860,2021-09-28,000001,Vente,1082200,23,,LE BOURG-NORD,B011,24400,24234,Les Lèches,24,,,24234000ZC0119,,,,,,,,,,,,,0,1,Maison,701,7,S,sols,,,3604,0.381802,44.991059
2021-336860,2021-09-28,000001,Vente,1082200,23,,LE BOURG-NORD,B011,24400,24234,Les Lèches,24,,,24234000ZC0119,,,,,,,,,,,,,0,3,Dépendance,,0,S,sols,,,3604,0.381802,44.991059
2021-337955,2021-10-20,000001,Vente,244900,,,FERME DE CUMY,B029,24400,24234,Les Lèches,24,,,24234000AB0191,,,,,,,,,,,,,0,1,Maison,140,4,S,sols,,,85,0.361598,45.018154
2021-337955,2021-10-20,000001,Vente,244900,,,FERME DE CUMY,B029,24400,24234,Les Lèches,24,,,24234000AB0191,,,,,,,,,,,,,0,3,Dépendance,,0,S,sols,,,85,0.361598,45.018154
2021-337955,2021-10-20,000001,Vente,244900,,,BUREE,B017,24400,24234,Les Lèches,24,,,24234000AB0193,,,,,,,,,,,,,0,,,,,BS,taillis sous futaie,,,32600,0.363875,45.017842
2021-337955,2021-10-20,000001,Vente,244900,,,FERME DE CUMY,B029,24400,24234,Les Lèches,24,,,24234000AB0434,,,,,,,,,,,,,0,,,,,P,prés,,,9359,0.361854,45.018234
2021-337955,2021-10-20,000001,Vente,244900,,,FERME DE CUMY,B029,24400,24234,Les Lèches,24,,,24234000AB0434,,,,,,,,,,,,,0,,,,,S,sols,,,1000,0.361854,45.018234
2021-338942,2021-11-02,000002,Vente,17064,,,LES GRAULES,B041,24400,24234,Les Lèches,24,,,24234000ZA0349,,,,,,,,,,,,,0,,,,,T,terres,,,1393,0.377101,45.012271
2021-338942,2021-11-02,000002,Vente,17064,,,LES GRAULES,B041,24400,24234,Les Lèches,24,,,24234000ZA0350,,,,,,,,,,,,,0,,,,,T,terres,,,444,0.377168,45.012151
2021-338953,2021-11-02,000001,Vente,14139,,,LES GRAULES,B041,24400,24234,Les Lèches,24,,,24234000ZA0351,,,,,,,,,,,,,0,,,,,T,terres,,,1360,0.377196,45.012
2021-340186,2021-12-23,000001,Vente,195,,,LES BOUYGETTES,B015,24400,24234,Les Lèches,24,,,24234000ZB0189,,,,,,,,,,,,,0,,,,,S,sols,,,390,0.375418,45.004216
