id_mutation,date_mutation,numero_disposition,nature_mutation,valeur_fonciere,adresse_numero,adresse_suffixe,adresse_nom_voie,adresse_code_voie,code_postal,code_commune,nom_commune,code_departement,ancien_code_commune,ancien_nom_commune,id_parcelle,ancien_id_parcelle,numero_volume,lot1_numero,lot1_surface_carrez,lot2_numero,lot2_surface_carrez,lot3_numero,lot3_surface_carrez,lot4_numero,lot4_surface_carrez,lot5_numero,lot5_surface_carrez,nombre_lots,code_type_local,type_local,surface_reelle_bati,nombre_pieces_principales,code_nature_culture,nature_culture,code_nature_culture_speciale,nature_culture_speciale,surface_terrain,longitude,latitude
2021-325586,2021-01-15,000001,Vente,65000,173,,LE BOURG SUD,B006,24230,24501,Saint-Seurin-de-Prats,24,,,245010000C0191,,,,,,,,,,,,,0,1,Maison,79,3,S,sols,,,425,0.077372,44.824772
2021-327028,2021-02-04,000001,Vente,120000,,,LES MONGES,B014,24230,24501,Saint-Seurin-de-Prats,24,,,245010000B1075,,,,,,,,,,,,,0,,,,,P,prés,,,174,0.09274,44.834322
2021-327028,2021-02-04,000001,Vente,120000,123,A,LES MONGES,B014,24230,24501,Saint-Seurin-de-Prats,24,,,245010000B1077,,,,,,,,,,,,,0,1,Maison,33,1,T,terres,,,2369,0.093189,44.833931
2021-327028,2021-02-04,000001,Vente,120000,123,A,LES MONGES,B014,24230,24501,Saint-Seurin-de-Prats,24,,,245010000B1077,,,,,,,,,,,,,0,1,Maison,33,1,S,sols,,,420,0.093189,44.833931
2021-327217,2021-02-10,000003,Echange,235.2,,,PRATS OUEST,B017,24230,24501,Saint-Seurin-de-Prats,24,,,245010000A0740,,,,,,,,,,,,,0,,,,,VE,vergers,,,47,0.053136,44.828255
2021-327217,2021-02-10,000003,Echange,235.2,,,PRATS OUEST,B017,24230,24501,Saint-Seurin-de-Prats,24,,,245010000A0748,,,,,,,,,,,,,0,,,,,VE,vergers,NOYER,Noyeraie ou noyers,1018,0.053508,44.8295
2021-327217,2021-02-10,000003,Echange,235.2,,,PRATS OUEST,B017,24230,24501,Saint-Seurin-de-Prats,24,,,245010000A0750,,,,,,,,,,,,,0,,,,,VE,vergers,,,7,0.053784,44.830367
2021-327217,2021-02-10,000003,Echange,235.2,,,PRATS OUEST,B017,24230,24501,Saint-Seurin-de-Prats,24,,,245010000A0752,,,,,,,,,,,,,0,,,,,VE,vergers,,,66,0.053674,44.830393
2021-327217,2021-02-10,000003,Echange,235.2,,,PRATS OUEST,B017,24230,24501,Saint-Seurin-de-Prats,24,,,245010000A0754,,,,,,,,,,,,,0,,,,,VE,vergers,,,67,0.053014,44.830619
2021-327217,2021-02-10,000003,Echange,235.2,,,PRATS OUEST,B017,24230,24501,Saint-Seurin-de-Prats,24,,,245010000A0755,,,,,,,,,,,,,0,,,,,VE,vergers,,,62,0.053398,44.830457
2021-327217,2021-02-10,000004,Echange,235.2,,,PRATS OUEST,B017,24230,24501,Saint-Seurin-de-Prats,24,,,245010000A0742,,,,,,,,,,,,,0,,,,,VE,vergers,NOYER,Noyeraie ou noyers,37,0.053321,44.828752
2021-327217,2021-02-10,000004,Echange,235.2,,,PRATS OUEST,B017,24230,24501,Saint-Seurin-de-Prats,24,,,245010000A0744,,,,,,,,,,,,,0,,,,,VE,vergers,NOYER,Noyeraie ou noyers,21,0.053073,44.830534
2021-327217,2021-02-10,000004,Echange,235.2,,,PRATS OUEST,B017,24230,24501,Saint-Seurin-de-Prats,24,,,245010000A0746,,,,,,,,,,,,,0,,,,,VE,vergers,NOYER,Noyeraie ou noyers,8,0.053781,44.830311
2021-327531,2021-02-25,000001,Vente,229775,,,LES MONGES,B014,24230,24501,Saint-Seurin-de-Prats,24,,,245010000B0239,,,,,,,,,,,,,0,,,,,J,jardins,,,800,0.090282,44.834664
2021-327531,2021-02-25,000001,Vente,229775,,,LES MONGES,B014,24230,24501,Saint-Seurin-de-Prats,24,,,245010000B0976,,,,,,,,,,,,,0,,,,,S,sols,,,18,0.090408,44.83467
2021-327531,2021-02-25,000001,Vente,229775,136,,LES MONGES,B014,24230,24501,Saint-Seurin-de-Prats,24,,,245010000B0979,,,,,,,,,,,,,0,3,Dépendance,,0,S,sols,,,1015,0.090247,44.834214
2021-327531,2021-02-25,000001,Vente,229775,136,,LES MONGES,B014,24230,24501,Saint-Seurin-de-Prats,24,,,245010000B0979,,,,,,,,,,,,,0,1,Maison,150,7,S,sols,,,1015,0.090247,44.834214
2021-327533,2021-02-26,000001,Vente,100000,,,LE BOURG SUD,B006,24230,24501,Saint-Seurin-de-Prats,24,,,245010000C0435,,,,,,,,,,,,,0,,,,,S,sols,,,6,0.077297,44.824997
2021-327533,2021-02-26,000001,Vente,100000,168,,LE BOURG SUD,B006,24230,24501,Saint-Seurin-de-Prats,24,,,245010000C0436,,,,,,,,,,,,,0,1,Maison,178,4,S,sols,,,543,0.077334,44.825054
2021-328316,2021-03-11,000001,Vente,4000,,,LE BOURG NORD,B005,24230,24501,Saint-Seurin-de-Prats,24,,,245010000B1176,,,,,,,,,,,,,0,,,,,T,terres,,,310,0.074718,44.830544
2021-328316,2021-03-11,000001,Vente,4000,,,LE BOURG NORD,B005,24230,24501,Saint-Seurin-de-Prats,24,,,245010000B1201,,,,,,,,,,,,,0,,,,,T,terres,,,4866,0.074628,44.830167
2021-328316,2021-03-11,000001,Vente,4000,,,LE BOURG NORD,B005,24230,24501,Saint-Seurin-de-Prats,24,,,245010000B1202,,,,,,,,,,,,,0,,,,,T,terres,,,5176,0.074508,44.829492
2021-331536,2021-05-28,000001,Vente,162500,,,LES AUVERGNATS OUEST,B001,24230,24501,Saint-Seurin-de-Prats,24,,,245010000A0188,,,,,,,,,,,,,0,,,,,T,terres,,,3650,0.065082,44.839432
2021-331536,2021-05-28,000001,Vente,162500,,,LES AUVERGNATS OUEST,B001,24230,24501,Saint-Seurin-de-Prats,24,,,245010000A0190,,,,,,,,,,,,,0,,,,,T,terres,,,2590,0.065316,44.841059
2021-331536,2021-05-28,000001,Vente,162500,,,LES AUVERGNATS OUEST,B001,24230,24501,Saint-Seurin-de-Prats,24,,,245010000A0191,,,,,,,,,,,,,0,,,,,T,terres,,,2840,0.065479,44.840928
2021-331536,2021-05-28,000001,Vente,162500,,,LES AUVERGNATS OUEST,B001,24230,24501,Saint-Seurin-de-Prats,24,,,245010000A0192,,,,,,,,,,,,,0,,,,,T,terres,,,3010,0.065743,44.840897
2021-331536,2021-05-28,000001,Vente,162500,,,LES AUVERGNATS OUEST,B001,24230,24501,Saint-Seurin-de-Prats,24,,,245010000A0668,,,,,,,,,,,,,0,,,,,P,prés,,,2817,0.065384,44.83963
2021-331536,2021-05-28,000001,Vente,162500,,,LES AUVERGNATS OUEST,B001,24230,24501,Saint-Seurin-de-Prats,24,,,245010000A0670,,,,,,,,,,,,,0,,,,,S,sols,,,63,0.06561,44.839348
2021-331536,2021-05-28,000001,Vente,162500,83,,LES AUVERGNATS OUEST,B001,24230,24501,Saint-Seurin-de-Prats,24,,,245010000A0671,,,,,,,,,,,,,0,1,Maison,120,4,S,sols,,,1082,0.065981,44.839543
2021-331536,2021-05-28,000001,Vente,162500,83,,LES AUVERGNATS OUEST,B001,24230,24501,Saint-Seurin-de-Prats,24,,,245010000A0671,,,,,,,,,,,,,0,3,Dépendance,,0,S,sols,,,1082,0.065981,44.839543
2021-331536,2021-05-28,000001,Vente,162500,,,LES AUVERGNATS OUEST,B001,24230,24501,Saint-Seurin-de-Prats,24,,,245010000A0711,,,,,,,,,,,,,0,,,,,T,terres,,,4646,0.065084,44.840898
2021-331536,2021-05-28,000001,Vente,162500,,,LES AUVERGNATS OUEST,B001,24230,24501,Saint-Seurin-de-Prats,24,,,245010000A0712,,,,,,,,,,,,,0,,,,,T,terres,,,180,0.064953,44.840261
2021-331536,2021-05-28,000001,Vente,162500,,,LES AUVERGNATS OUEST,B001,24230,24501,Saint-Seurin-de-Prats,24,,,245010000A0714,,,,,,,,,,,,,0,,,,,T,terres,,,203,0.064978,44.840094
2021-332716,2021-07-12,000001,Vente,180000,188,,LE BOURG SUD,B006,24230,24501,Saint-Seurin-de-Prats,24,,,245010000C0491,,,,,,,,,,,,,0,1,Maison,68,3,S,sols,,,897,0.077239,44.825372
2021-332716,2021-07-12,000001,Vente,180000,188,,LE BOURG SUD,B006,24230,24501,Saint-Seurin-de-Prats,24,,,245010000C0491,,,,,,,,,,,,,0,3,Dépendance,,0,S,sols,,,897,0.077239,44.825372
2021-334560,2021-08-05,000001,Vente,275000,191,,PRATS EST,B016,24230,24501,Saint-Seurin-de-Prats,24,,,245010000C0063,,,,,,,,,,,,,0,3,Dépendance,,0,S,sols,,,1390,0.068431,44.823074
2021-334560,2021-08-05,000001,Vente,275000,191,,PRATS EST,B016,24230,24501,Saint-Seurin-de-Prats,24,,,245010000C0063,,,,,,,,,,,,,0,1,Maison,120,6,S,sols,,,1390,0.068431,44.823074
2021-334560,2021-08-05,000001,Vente,275000,,,PRATS EST,B016,24230,24501,Saint-Seurin-de-Prats,24,,,245010000C0064,,,,,,,,,,,,,0,,,,,BT,taillis simples,,,2440,0.068476,44.822449
2021-334560,2021-08-05,000001,Vente,275000,,,PRATS EST,B016,24230,24501,Saint-Seurin-de-Prats,24,,,245010000C0065,,,,,,,,,,,,,0,,,,,T,terres,,,1890,0.069021,44.822805
2021-334560,2021-08-05,000001,Vente,275000,,,PRATS EST,B016,24230,24501,Saint-Seurin-de-Prats,24,,,245010000C0065,,,,,,,,,,,,,0,,,,,BT,taillis simples,,,4000,0.069021,44.822805
2021-334560,2021-08-05,000001,Vente,275000,,,PRATS EST,B016,24230,24501,Saint-Seurin-de-Prats,24,,,245010000C0480,,,,,,,,,,,,,0,,,,,P,prés,,,423,0.068949,44.824005
2021-334560,2021-08-05,000001,Vente,275000,,,PRATS EST,B016,24230,24501,Saint-Seurin-de-Prats,24,,,245010000C0490,,,,,,,,,,,,,0,,,,,P,prés,,,1447,0.06858,44.824008
2021-334560,2021-08-05,000001,Vente,275000,,,PRATS EST,B016,24230,24501,Saint-Seurin-de-Prats,24,,,245010000C0490,,,,,,,,,,,,,0,,,,,BT,taillis simples,,,1303,0.06858,44.824008
2021-334560,2021-08-05,000001,Vente,275000,,,PRATS EST,B016,24230,24501,Saint-Seurin-de-Prats,24,,,245010000C0498,,,,,,,,,,,,,0,,,,,BT,taillis simples,,,3855,0.068945,44.82366
2021-335044,2021-08-16,000001,Vente,225000,7,,LE BOURG SUD,B006,24230,24501,Saint-Seurin-de-Prats,24,,,245010000C0132,,,,,,,,,,,,,0,1,Maison,125,4,S,sols,,,1095,0.074982,44.827419
2021-335044,2021-08-16,000001,Vente,225000,7,,LE BOURG SUD,B006,24230,24501,Saint-Seurin-de-Prats,24,,,245010000C0132,,,,,,,,,,,,,0,3,Dépendance,,0,S,sols,,,1095,0.074982,44.827419
2021-335044,2021-08-16,000001,Vente,225000,,,LE BOURG SUD,B006,24230,24501,Saint-Seurin-de-Prats,24,,,245010000C0345,,,,,,,,,,,,,0,,,,,T,terres,,,672,0.075371,44.827371
2021-335111,2021-09-07,000001,Vente,370000,58,,PRATS OUEST,B017,24230,24501,Saint-Seurin-de-Prats,24,,,245010000A0322,,,,,,,,,,,,,0,1,Maison,117,5,S,sols,,,1340,0.062827,44.827091
2021-335111,2021-09-07,000001,Vente,370000,58,,PRATS OUEST,B017,24230,24501,Saint-Seurin-de-Prats,24,,,245010000A0322,,,,,,,,,,,,,0,3,Dépendance,,0,S,sols,,,1340,0.062827,44.827091
2021-335111,2021-09-07,000001,Vente,370000,58,,PRATS OUEST,B017,24230,24501,Saint-Seurin-de-Prats,24,,,245010000A0322,,,,,,,,,,,,,0,3,Dépendance,,0,S,sols,,,1340,0.062827,44.827091
2021-335111,2021-09-07,000001,Vente,370000,58,,PRATS OUEST,B017,24230,24501,Saint-Seurin-de-Prats,24,,,245010000A0322,,,,,,,,,,,,,0,1,Maison,86,3,S,sols,,,1340,0.062827,44.827091
2021-335111,2021-09-07,000001,Vente,370000,58,,PRATS OUEST,B017,24230,24501,Saint-Seurin-de-Prats,24,,,245010000A0322,,,,,,,,,,,,,0,1,Maison,50,2,S,sols,,,1340,0.062827,44.827091
2021-335111,2021-09-07,000001,Vente,370000,58,A,PRATS OUEST,B017,24230,24501,Saint-Seurin-de-Prats,24,,,245010000A0323,,,,,,,,,,,,,0,1,Maison,30,1,S,sols,,,50,0.062776,44.827205
2021-335111,2021-09-07,000001,Vente,370000,58,A,PRATS OUEST,B017,24230,24501,Saint-Seurin-de-Prats,24,,,245010000A0323,,,,,,,,,,,,,0,3,Dépendance,,0,S,sols,,,50,0.062776,44.827205
2021-335111,2021-09-07,000001,Vente,370000,59,,PRATS OUEST,B017,24230,24501,Saint-Seurin-de-Prats,24,,,245010000A0324,,,,,,,,,,,,,0,1,Maison,45,2,S,sols,,,70,0.062951,44.827179
2021-335111,2021-09-07,000001,Vente,370000,,,PRATS OUEST,B017,24230,24501,Saint-Seurin-de-Prats,24,,,245010000A0514,,,,,,,,,,,,,0,,,,,S,sols,,,37,0.063035,44.827139
2021-335860,2021-09-16,000001,Vente,214930,123,,LE BOURG NORD,B005,24230,24501,Saint-Seurin-de-Prats,24,,,245010000B1229,,,,,,,,,,,,,0,1,Maison,111,4,S,sols,,,800,0.072647,44.828031
2021-335860,2021-09-16,000001,Vente,214930,123,,LE BOURG NORD,B005,24230,24501,Saint-Seurin-de-Prats,24,,,245010000B1229,,,,,,,,,,,,,0,1,Maison,111,4,T,terres,,,1678,0.072647,44.828031
2021-336454,2021-09-13,000001,Vente,180000,186,C,LE BOURG SUD,B006,24230,24501,Saint-Seurin-de-Prats,24,,,245010000C0410,,,,,,,,,,,,,0,3,Dépendance,,0,S,sols,,,1875,0.075415,44.827248
2021-336454,2021-09-13,000001,Vente,180000,186,C,LE BOURG SUD,B006,24230,24501,Saint-Seurin-de-Prats,24,,,245010000C0410,,,,,,,,,,,,,0,1,Maison,163,7,S,sols,,,1875,0.075415,44.827248
2021-336457,2021-09-14,000001,Vente,20000,,,LE SAIMPAY,B019,24230,24501,Saint-Seurin-de-Prats,24,,,245010000B0821,,,,,,,,,,,,,0,,,,,T,terres,,,980,0.067754,44.836324
2021-336457,2021-09-14,000001,Vente,20000,,,LE SAIMPAY,B019,24230,24501,Saint-Seurin-de-Prats,24,,,245010000B0822,,,,,,,,,,,,,0,,,,,T,terres,,,1090,0.067747,44.836413
2021-336457,2021-09-14,000001,Vente,20000,,,LE SAIMPAY,B019,24230,24501,Saint-Seurin-de-Prats,24,,,245010000B0828,,,,,,,,,,,,,0,,,,,T,terres,,,1200,0.06764,44.836482
2021-336457,2021-09-14,000001,Vente,20000,86,,LE SAIMPAY,B019,24230,24501,Saint-Seurin-de-Prats,24,,,245010000B0841,,,,,,,,,,,,,0,1,Maison,55,3,S,sols,,,570,0.067383,44.836626
2021-336457,2021-09-14,000001,Vente,20000,,,LE SAIMPAY,B019,24230,24501,Saint-Seurin-de-Prats,24,,,245010000B1330,,,,,,,,,,,,,0,,,,,T,terres,,,4324,0.067739,44.83677
2021-337021,2021-10-15,000001,Vente,120000,22,,LE BOURG NORD,B005,24230,24501,Saint-Seurin-de-Prats,24,,,245010000B0519,,,,,,,,,,,,,0,1,Maison,90,3,S,sols,,,580,0.073848,44.828221
2021-337021,2021-10-15,000001,Vente,120000,,,LE BOURG NORD,B005,24230,24501,Saint-Seurin-de-Prats,24,,,245010000B1292,,,,,,,,,,,,,0,,,,,P,prés,,,249,0.073826,44.82838
2021-338413,2021-10-26,000002,Vente,100,,,LES GRANGES,B012,24230,24501,Saint-Seurin-de-Prats,24,,,245010000B1364,,,,,,,,,,,,,0,,,,,T,terres,,,57,0.085565,44.833537
2021-338414,2021-10-26,000002,Vente,600,,,DERRIERE LES GRANGES,B008,24230,24501,Saint-Seurin-de-Prats,24,,,245010000B1362,,,,,,,,,,,,,0,,,,,P,prés,,,33,0.091688,44.835426
2021-339779,2021-11-19,000001,Vente,128500,,,PRATS OUEST,B017,24230,24501,Saint-Seurin-de-Prats,24,,,245010000A0311,,,,,,,,,,,,,0,,,,,J,jardins,,,180,0.063609,44.827887
2021-339779,2021-11-19,000001,Vente,128500,,,PRATS OUEST,B017,24230,24501,Saint-Seurin-de-Prats,24,,,245010000A0330,,,,,,,,,,,,,0,,,,,J,jardins,,,42,0.063311,44.827773
2021-339779,2021-11-19,000001,Vente,128500,,,PRATS OUEST,B017,24230,24501,Saint-Seurin-de-Prats,24,,,245010000A0331,,,,,,,,,,,,,0,,,,,J,jardins,,,60,0.063251,44.827771
2021-339779,2021-11-19,000001,Vente,128500,,,PRATS OUEST,B017,24230,24501,Saint-Seurin-de-Prats,24,,,245010000A0333,,,,,,,,,,,,,0,,,,,J,jardins,,,185,0.063247,44.827872
2021-339779,2021-11-19,000001,Vente,128500,,,PRATS OUEST,B017,24230,24501,Saint-Seurin-de-Prats,24,,,245010000A0476,,,,,,,,,,,,,0,,,,,S,sols,,,65,0.063366,44.827771
2021-339779,2021-11-19,000001,Vente,128500,54,A,PRATS OUEST,B017,24230,24501,Saint-Seurin-de-Prats,24,,,245010000A0565,,,,,,,,,,,,,0,1,Maison,125,5,S,sols,,,1092,0.063518,44.827959
2021-339779,2021-11-19,000001,Vente,128500,54,A,PRATS OUEST,B017,24230,24501,Saint-Seurin-de-Prats,24,,,245010000A0565,,,,,,,,,,,,,0,3,Dépendance,,0,S,sols,,,1092,0.063518,44.827959
2021-340505,2021-12-16,000001,Vente,170000,,,LE BOURG NORD,B005,24230,24501,Saint-Seurin-de-Prats,24,,,245010000B1356,,,,,,,,,,,,,0,,,,,P,prés,,,826,0.070614,44.827494
2021-340505,2021-12-16,000001,Vente,170000,27,A,LE BOURG NORD,B005,24230,24501,Saint-Seurin-de-Prats,24,,,245010000B1357,,,,,,,,,,,,,0,1,Maison,84,2,S,sols,,,800,0.070917,44.827449
2021-340505,2021-12-16,000001,Vente,170000,27,A,LE BOURG NORD,B005,24230,24501,Saint-Seurin-de-Prats,24,,,245010000B1357,,,,,,,,,,,,,0,1,Maison,84,2,BP,peupleraies,,,1074,0.070917,44.827449
2021-340506,2021-12-15,000001,Vente,272300,14,,LES GRANGES,B012,24230,24501,Saint-Seurin-de-Prats,24,,,245010000B0391,,,,,,,,,,,,,0,1,Maison,140,4,S,sols,,,800,0.077794,44.833546
2021-340506,2021-12-15,000001,Vente,272300,14,,LES GRANGES,B012,24230,24501,Saint-Seurin-de-Prats,24,,,245010000B0391,,,,,,,,,,,,,0,3,Dépendance,,0,S,sols,,,800,0.077794,44.833546
2021-340506,2021-12-15,000001,Vente,272300,14,,LES GRANGES,B012,24230,24501,Saint-Seurin-de-Prats,24,,,245010000B0391,,,,,,,,,,,,,0,3,Dépendance,,0,T,terres,,,1710,0.077794,44.833546
2021-340506,2021-12-15,000001,Vente,272300,14,,LES GRANGES,B012,24230,24501,Saint-Seurin-de-Prats,24,,,245010000B0391,,,,,,,,,,,,,0,1,Maison,140,4,T,terres,,,1710,0.077794,44.833546
2021-341248,2021-12-30,000001,Vente,130000,9,,LE BOURG SUD,B006,24230,24501,Saint-Seurin-de-Prats,24,,,245010000C0137,,,,,,,,,,,,,0,1,Maison,92,4,S,sols,,,470,0.075035,44.827714
2021-341248,2021-12-30,000001,Vente,130000,9,,LE BOURG SUD,B006,24230,24501,Saint-Seurin-de-Prats,24,,,245010000C0137,,,,,,,,,,,,,0,3,Dépendance,,0,S,sols,,,470,0.075035,44.827714
2021-341248,2021-12-30,000001,Vente,130000,,,LE BOURG SUD,B006,24230,24501,Saint-Seurin-de-Prats,24,,,245010000C0138,,,,,,,,,,,,,0,,,,,J,jardins,,,245,0.075166,44.827734
2021-341248,2021-12-30,000001,Vente,130000,,,LE BOURG SUD,B006,24230,24501,Saint-Seurin-de-Prats,24,,,245010000C0140,,,,,,,,,,,,,0,,,,,S,sols,,,452,0.075414,44.827804
