id_mutation,date_mutation,numero_disposition,nature_mutation,valeur_fonciere,adresse_numero,adresse_suffixe,adresse_nom_voie,adresse_code_voie,code_postal,code_commune,nom_commune,code_departement,ancien_code_commune,ancien_nom_commune,id_parcelle,ancien_id_parcelle,numero_volume,lot1_numero,lot1_surface_carrez,lot2_numero,lot2_surface_carrez,lot3_numero,lot3_surface_carrez,lot4_numero,lot4_surface_carrez,lot5_numero,lot5_surface_carrez,nombre_lots,code_type_local,type_local,surface_reelle_bati,nombre_pieces_principales,code_nature_culture,nature_culture,code_nature_culture_speciale,nature_culture_speciale,surface_terrain,longitude,latitude
2021-325614,2021-01-05,000001,Vente,330000,,,LA CABANE,B003,24370,24574,Veyrignac,24,,,245740000B0597,,,,,,,,,,,,,0,,,,,BT,taillis simples,CHAT,Châtaigneraie,40,1.302193,44.825109
2021-327216,2021-02-11,000002,Vente,2500,,,LE GREZAL,B010,24370,24574,Veyrignac,24,,,245740000B1509,,,,,,,,,,,,,0,,,,,T,terres,,,630,1.309168,44.827667
2021-327474,2021-02-17,000001,Vente,3600,,,GRANDES LANDES,B009,24370,24574,Veyrignac,24,,,245740000B0221,,,,,,,,,,,,,0,,,,,T,terres,,,8960,1.32363,44.812725
2021-328136,2021-03-19,000001,Vente,8500,,,POUCHOU-BAS,B028,24370,24574,Veyrignac,24,,,245740000B0331,,,,,,,,,,,,,0,,,,,BT,taillis simples,CHENE,Chênes,4857,1.319066,44.823264
2021-328136,2021-03-19,000001,Vente,8500,,,POUCHOU-BAS,B028,24370,24574,Veyrignac,24,,,245740000B0334,,,,,,,,,,,,,0,,,,,VE,vergers,NOYER,Noyeraie ou noyers,4520,1.31908,44.823476
2021-328695,2021-03-29,000001,Vente,500000,652,,RTE DE POUCHOU,0175,24370,24574,Veyrignac,24,,,245740000B0389,,,,,,,,,,,,,0,1,Maison,110,4,S,sols,,,1900,1.321725,44.822106
2021-328695,2021-03-29,000001,Vente,500000,,,POUCHOU HAUT,B027,24370,24574,Veyrignac,24,,,245740000B0390,,,,,,,,,,,,,0,,,,,S,sols,,,800,1.321232,44.821883
2021-328695,2021-03-29,000001,Vente,500000,,,POUCHOU HAUT,B027,24370,24574,Veyrignac,24,,,245740000B0391,,,,,,,,,,,,,0,,,,,S,sols,,,670,1.321367,44.822095
2021-328695,2021-03-29,000001,Vente,500000,,,POUCHOU HAUT,B027,24370,24574,Veyrignac,24,,,245740000B0392,,,,,,,,,,,,,0,,,,,S,sols,,,601,1.321496,44.822352
2021-328695,2021-03-29,000001,Vente,500000,,,POUCHOU HAUT,B027,24370,24574,Veyrignac,24,,,245740000B0393,,,,,,,,,,,,,0,,,,,T,terres,,,1380,1.321874,44.82241
2021-328695,2021-03-29,000001,Vente,500000,,,POUCHOU HAUT,B027,24370,24574,Veyrignac,24,,,245740000B0393,,,,,,,,,,,,,0,,,,,T,terres,,,1380,1.321874,44.82241
2021-328695,2021-03-29,000001,Vente,500000,,,POUCHOU HAUT,B027,24370,24574,Veyrignac,24,,,245740000B0395,,,,,,,,,,,,,0,,,,,BT,taillis simples,CHENE,Chênes,1680,1.322733,44.823114
2021-328695,2021-03-29,000001,Vente,500000,,,POUCHOU HAUT,B027,24370,24574,Veyrignac,24,,,245740000B1402,,,,,,,,,,,,,0,,,,,BT,taillis simples,CHENE,Chênes,14702,1.323106,44.822738
2021-328695,2021-03-29,000001,Vente,500000,,,POUCHOU HAUT,B027,24370,24574,Veyrignac,24,,,245740000B1419,,,,,,,,,,,,,0,,,,,T,terres,,,210,1.321868,44.821928
2021-328695,2021-03-29,000001,Vente,500000,,,POUCHOU HAUT,B027,24370,24574,Veyrignac,24,,,245740000B1420,,,,,,,,,,,,,0,,,,,T,terres,,,3501,1.322169,44.822025
2021-328840,2021-03-31,000001,Vente,360000,,,PECH DE NEIGE,B017,24370,24574,Veyrignac,24,,,245740000A0030,,,,,,,,,,,,,0,,,,,T,terres,,,2560,1.315355,44.840463
2021-328840,2021-03-31,000001,Vente,360000,,,PECH DE NEIGE,B017,24370,24574,Veyrignac,24,,,245740000A1090,,,,,,,,,,,,,0,,,,,L,landes,MARAI,Pré marais,590,1.315182,44.840698
2021-329349,2021-04-07,000001,Vente,231740,583,,RTE DU PECH DU LAC,0145,24370,24574,Veyrignac,24,,,245740000B0437,,,,,,,,,,,,,0,3,Dépendance,,0,S,sols,,,1500,1.326374,44.818897
2021-329349,2021-04-07,000001,Vente,231740,583,,RTE DU PECH DU LAC,0145,24370,24574,Veyrignac,24,,,245740000B0437,,,,,,,,,,,,,0,3,Dépendance,,0,S,sols,,,1500,1.326374,44.818897
2021-329349,2021-04-07,000001,Vente,231740,583,,RTE DU PECH DU LAC,0145,24370,24574,Veyrignac,24,,,245740000B0437,,,,,,,,,,,,,0,3,Dépendance,,0,BT,taillis simples,CHENE,Chênes,1474,1.326374,44.818897
2021-329349,2021-04-07,000001,Vente,231740,583,,RTE DU PECH DU LAC,0145,24370,24574,Veyrignac,24,,,245740000B0437,,,,,,,,,,,,,0,3,Dépendance,,0,BT,taillis simples,CHENE,Chênes,1474,1.326374,44.818897
2021-329349,2021-04-07,000001,Vente,231740,583,,RTE DU PECH DU LAC,0145,24370,24574,Veyrignac,24,,,245740000B0437,,,,,,,,,,,,,0,1,Maison,156,5,S,sols,,,1500,1.326374,44.818897
2021-329349,2021-04-07,000001,Vente,231740,583,,RTE DU PECH DU LAC,0145,24370,24574,Veyrignac,24,,,245740000B0437,,,,,,,,,,,,,0,1,Maison,156,5,BT,taillis simples,CHENE,Chênes,1474,1.326374,44.818897
2021-329508,2021-04-23,000001,Vente,120000,,,POUCHOU HAUT,B027,24370,24574,Veyrignac,24,,,245740000B1488,,,,,,,,,,,,,0,,,,,BT,taillis simples,CHENE,Chênes,3656,1.328571,44.820338
2021-329676,2021-04-21,000001,Vente,179500,,,JUMILLES,B011,24370,24574,Veyrignac,24,,,245740000A0841,,,,,,,,,,,,,0,,,,,BT,taillis simples,CHENE,Chênes,1404,1.3376,44.820919
2021-329676,2021-04-21,000001,Vente,179500,,,LE PONCHET,B025,24370,24574,Veyrignac,24,,,245740000A1343,,,,,,,,,,,,,0,,,,,S,sols,,,198,1.338312,44.821583
2021-329676,2021-04-21,000001,Vente,179500,2673,,RTE DE JUMILLES,0110,24370,24574,Veyrignac,24,,,245740000A1345,,,,,,,,,,,,,0,1,Maison,67,3,L,landes,MARAI,Pré marais,230,1.338104,44.821654
2021-329676,2021-04-21,000001,Vente,179500,2673,,RTE DE JUMILLES,0110,24370,24574,Veyrignac,24,,,245740000A1345,,,,,,,,,,,,,0,1,Maison,67,3,S,sols,,,500,1.338104,44.821654
2021-329676,2021-04-21,000001,Vente,179500,40,,LE PONCHET,B025,24370,24574,Veyrignac,24,,,245740000A1348,,,,,,,,,,,,,0,1,Maison,15,1,S,sols,,,100,1.338235,44.821691
2021-329956,2021-05-03,000002,Vente,45000,,,LE GREZAL,B010,24370,24574,Veyrignac,24,,,245740000B1512,,,,,,,,,,,,,0,,,,,T,terres,,,1553,1.309832,44.824321
2021-329956,2021-05-03,000002,Vente,45000,,,LE GREZAL,B010,24370,24574,Veyrignac,24,,,245740000B1513,,,,,,,,,,,,,0,,,,,T,terres,,,1556,1.310184,44.824503
2021-332990,2021-06-25,000001,Vente,293350,,,PETITES LANDES,B023,24370,24574,Veyrignac,24,,,245740000B0099,,,,,,,,,,,,,0,,,,,T,terres,,,1980,1.341331,44.810114
2021-332990,2021-06-25,000001,Vente,293350,,,PETITES LANDES,B023,24370,24574,Veyrignac,24,,,245740000B1392,,,,,,,,,,,,,0,,,,,T,terres,,,120,1.344653,44.809068
2021-332990,2021-06-25,000001,Vente,293350,1638,,RTE DES PETITES LANDES,0160,24370,24574,Veyrignac,24,,,245740000B1394,,,,,,,,,,,,,0,1,Maison,139,3,S,sols,,,1500,1.343569,44.808593
2021-332990,2021-06-25,000001,Vente,293350,1638,,RTE DES PETITES LANDES,0160,24370,24574,Veyrignac,24,,,245740000B1394,,,,,,,,,,,,,0,3,Dépendance,,0,S,sols,,,1500,1.343569,44.808593
2021-332990,2021-06-25,000001,Vente,293350,1638,,RTE DES PETITES LANDES,0160,24370,24574,Veyrignac,24,,,245740000B1394,,,,,,,,,,,,,0,3,Dépendance,,0,P,prés,,,4000,1.343569,44.808593
2021-332990,2021-06-25,000001,Vente,293350,1638,,RTE DES PETITES LANDES,0160,24370,24574,Veyrignac,24,,,245740000B1394,,,,,,,,,,,,,0,1,Maison,139,3,P,prés,,,4000,1.343569,44.808593
2021-332990,2021-06-25,000001,Vente,293350,,,PETITES LANDES,B023,24370,24574,Veyrignac,24,,,245740000B1430,,,,,,,,,,,,,0,,,,,T,terres,,,3716,1.342051,44.810604
2021-332990,2021-06-25,000001,Vente,293350,,,PETITES LANDES,B023,24370,24574,Veyrignac,24,,,245740000B1432,,,,,,,,,,,,,0,,,,,T,terres,,,25872,1.341753,44.809765
2021-335388,2021-08-18,000001,Vente,99000,,,ROC BLANC,B029,24370,24574,Veyrignac,24,,,245740000A0440,,,,,,,,,,,,,0,,,,,BR,futaies résineuses,,,775,1.333293,44.836095
2021-335388,2021-08-18,000001,Vente,99000,,,ROC BLANC,B029,24370,24574,Veyrignac,24,,,245740000A1120,,,,,,,,,,,,,0,,,,,L,landes,,,333,1.333116,44.836322
2021-335388,2021-08-18,000001,Vente,99000,,,ROC BLANC,B029,24370,24574,Veyrignac,24,,,245740000A1121,,,,,,,,,,,,,0,,,,,BT,taillis simples,CHENE,Chênes,560,1.332811,44.836503
2021-335422,2021-08-24,000001,Vente,2000,,,PECH DE NEIGE,B017,24370,24574,Veyrignac,24,,,245740000A0062,,,,,,,,,,,,,0,,,,,BT,taillis simples,CHENE,Chênes,1100,1.317038,44.838295
2021-335422,2021-08-24,000001,Vente,2000,,,PECH DE NEIGE,B017,24370,24574,Veyrignac,24,,,245740000A0120,,,,,,,,,,,,,0,,,,,BT,taillis simples,CHENE,Chênes,1740,1.319777,44.835672
2021-335422,2021-08-24,000001,Vente,2000,,,PECH DE NEIGE,B017,24370,24574,Veyrignac,24,,,245740000A0133,,,,,,,,,,,,,0,,,,,L,landes,MARAI,Pré marais,2140,1.319562,44.83719
2021-335422,2021-08-24,000001,Vente,2000,,,PECH DE NEIGE,B017,24370,24574,Veyrignac,24,,,245740000A0134,,,,,,,,,,,,,0,,,,,BT,taillis simples,CHENE,Chênes,5160,1.319686,44.837493
2021-335422,2021-08-24,000001,Vente,2000,,,COMBE NEGRE,B006,24370,24574,Veyrignac,24,,,245740000A0180,,,,,,,,,,,,,0,,,,,BT,taillis simples,CHENE,Chênes,2680,1.323615,44.834051
2021-335422,2021-08-24,000001,Vente,2000,,,COMBE NEGRE,B006,24370,24574,Veyrignac,24,,,245740000A0183,,,,,,,,,,,,,0,,,,,BT,taillis simples,CHENE,Chênes,2920,1.324864,44.834019
2021-335422,2021-08-24,000001,Vente,2000,,,COMBE NEGRE,B006,24370,24574,Veyrignac,24,,,245740000A0184,,,,,,,,,,,,,0,,,,,BT,taillis simples,CHENE,Chênes,2500,1.324618,44.834355
2021-337911,2021-10-20,000001,Vente,1500,,,MOULIN DU ROC BLANC,B016,24370,24574,Veyrignac,24,,,245740000A0539,,,,,,,,,,,,,0,,,,,BT,taillis simples,CHENE,Chênes,5242,1.332446,44.828123
2021-337911,2021-10-20,000001,Vente,1500,,,LE PONCHET,B025,24370,24574,Veyrignac,24,,,245740000A0624,,,,,,,,,,,,,0,,,,,BT,taillis simples,CHENE,Chênes,1960,1.336808,44.824745
2021-338249,2021-10-21,000001,Vente,230000,1114,A,LE GREZAL,B010,24370,24574,Veyrignac,24,,,245740000B1114,,,,,,,,,,,,,0,3,Dépendance,,0,S,sols,,,1334,1.304102,44.825883
2021-338249,2021-10-21,000001,Vente,230000,1114,A,LE GREZAL,B010,24370,24574,Veyrignac,24,,,245740000B1114,,,,,,,,,,,,,0,1,Maison,130,6,S,sols,,,1334,1.304102,44.825883
2021-338249,2021-10-21,000001,Vente,230000,1114,A,LE GREZAL,B010,24370,24574,Veyrignac,24,,,245740000B1114,,,,,,,,,,,,,0,3,Dépendance,,0,S,sols,,,1334,1.304102,44.825883
2021-338249,2021-10-21,000001,Vente,230000,1114,A,LE GREZAL,B010,24370,24574,Veyrignac,24,,,245740000B1114,,,,,,,,,,,,,0,3,Dépendance,,0,S,sols,,,1334,1.304102,44.825883
2021-338249,2021-10-21,000001,Vente,230000,1114,A,LE GREZAL,B010,24370,24574,Veyrignac,24,,,245740000B1114,,,,,,,,,,,,,0,3,Dépendance,,0,S,sols,,,1334,1.304102,44.825883
2021-339316,2021-11-29,000001,Vente,461310,,,MOULIN DU ROC BLANC,B016,24370,24574,Veyrignac,24,,,245740000A0554,,,,,,,,,,,,,0,,,,,BT,taillis simples,CHENE,Chênes,1982,1.335877,44.826835
2021-339316,2021-11-29,000001,Vente,461310,,,LE PONCHET,B025,24370,24574,Veyrignac,24,,,245740000A0629,,,,,,,,,,,,,0,,,,,BR,futaies résineuses,,,4594,1.334661,44.824109
2021-339316,2021-11-29,000001,Vente,461310,,,LE PONCHET,B025,24370,24574,Veyrignac,24,,,245740000A0630,,,,,,,,,,,,,0,,,,,T,terres,,,6190,1.335276,44.824644
2021-339316,2021-11-29,000001,Vente,461310,,,LE PONCHET,B025,24370,24574,Veyrignac,24,,,245740000A0631,,,,,,,,,,,,,0,,,,,S,sols,,,475,1.335461,44.824945
2021-339316,2021-11-29,000001,Vente,461310,,,LE PONCHET,B025,24370,24574,Veyrignac,24,,,245740000A0631,,,,,,,,,,,,,0,,,,,T,terres,,,1975,1.335461,44.824945
2021-339316,2021-11-29,000001,Vente,461310,,,LE PONCHET,B025,24370,24574,Veyrignac,24,,,245740000A0632,,,,,,,,,,,,,0,,,,,T,terres,,,1800,1.33477,44.825398
2021-339316,2021-11-29,000001,Vente,461310,,,LE PONCHET,B025,24370,24574,Veyrignac,24,,,245740000A0633,,,,,,,,,,,,,0,,,,,J,jardins,POTAG,Jardin potager,430,1.335609,44.825245
2021-339316,2021-11-29,000001,Vente,461310,634,A,LE PONCHET,B025,24370,24574,Veyrignac,24,,,245740000A0634,,,,,,,,,,,,,0,1,Maison,59,2,S,sols,,,1160,1.335716,44.824996
2021-339316,2021-11-29,000001,Vente,461310,634,A,LE PONCHET,B025,24370,24574,Veyrignac,24,,,245740000A0634,,,,,,,,,,,,,0,1,Maison,66,3,S,sols,,,1160,1.335716,44.824996
2021-339316,2021-11-29,000001,Vente,461310,634,A,LE PONCHET,B025,24370,24574,Veyrignac,24,,,245740000A0634,,,,,,,,,,,,,0,1,Maison,148,3,S,sols,,,1160,1.335716,44.824996
2021-339316,2021-11-29,000001,Vente,461310,,,LE PONCHET,B025,24370,24574,Veyrignac,24,,,245740000A1358,,,,,,,,,,,,,0,,,,,BT,taillis simples,CHENE,Chênes,4683,1.334957,44.825654
2021-339316,2021-11-29,000001,Vente,461310,,,LE PONCHET,B025,24370,24574,Veyrignac,24,,,245740000A1360,,,,,,,,,,,,,0,,,,,L,landes,MARAI,Pré marais,1454,1.335496,44.825473
2021-339316,2021-11-29,000001,Vente,461310,,,LE PONCHET,B025,24370,24574,Veyrignac,24,,,245740000A1361,,,,,,,,,,,,,0,,,,,BT,taillis simples,CHENE,Chênes,123,1.335959,44.824719
2021-341212,2021-12-30,000001,Vente,97000,,,SUR LA FON,B007,24370,24574,Veyrignac,24,,,245740000A0409,,,,,,,,,,,,,0,,,,,T,terres,,,440,1.310495,44.833211
2021-341212,2021-12-30,000001,Vente,97000,478,,RTE DES GABARIERS,0090,24370,24574,Veyrignac,24,,,245740000A1284,,,,,,,,,,,,,0,1,Maison,99,5,S,sols,,,505,1.310436,44.833024
