id_mutation,date_mutation,numero_disposition,nature_mutation,valeur_fonciere,adresse_numero,adresse_suffixe,adresse_nom_voie,adresse_code_voie,code_postal,code_commune,nom_commune,code_departement,ancien_code_commune,ancien_nom_commune,id_parcelle,ancien_id_parcelle,numero_volume,lot1_numero,lot1_surface_carrez,lot2_numero,lot2_surface_carrez,lot3_numero,lot3_surface_carrez,lot4_numero,lot4_surface_carrez,lot5_numero,lot5_surface_carrez,nombre_lots,code_type_local,type_local,surface_reelle_bati,nombre_pieces_principales,code_nature_culture,nature_culture,code_nature_culture_speciale,nature_culture_speciale,surface_terrain,longitude,latitude
2021-344767,2021-06-23,000001,Vente,9980,,,SUR LES MONTS,B121,25270,25180,Crouzet-Migette,25,,,25180000ZA0093,,,,,,,,,,,,,0,,,,,T,terres,,,693,6.005876,46.955222
2021-347819,2021-10-28,000001,Vente,190000,,,SUR LES MONTS,B121,25270,25180,Crouzet-Migette,25,,,25180000ZA0095,,,,,,,,,,,,,0,,,,,S,sols,,,86,6.007434,46.955417
2021-347819,2021-10-28,000001,Vente,190000,1,,RUE DES TERRASSES,0073,25270,25180,Crouzet-Migette,25,,,25180000ZA0096,,,,,,,,,,,,,0,1,Maison,78,4,S,sols,,,867,6.007614,46.95542
2021-350664,2021-02-17,000001,Vente,21000,,,AU VILLAGE,B163,25270,25180,Crouzet-Migette,25,,,25180000AB0081,,,,,,,,,,,,,0,,,,,P,prés,,,55,6.010693,46.957183
2021-350664,2021-02-17,000001,Vente,21000,,,AU VILLAGE,B163,25270,25180,Crouzet-Migette,25,,,25180000AB0330,,,,,,,,,,,,,0,,,,,S,sols,,,85,6.010011,46.9574
2021-350664,2021-02-17,000001,Vente,21000,,,AU VILLAGE,B163,25270,25180,Crouzet-Migette,25,,,25180000AB0330,,,,,,,,,,,,,0,,,,,S,sols,,,8,6.010011,46.9574
2021-350664,2021-02-17,000001,Vente,21000,,,AU VILLAGE,B163,25270,25180,Crouzet-Migette,25,,,25180000AB0330,,,,,,,,,,,,,0,,,,,P,prés,,,1297,6.010011,46.9574
2021-350664,2021-02-17,000001,Vente,21000,,,AU VILLAGE,B163,25270,25180,Crouzet-Migette,25,,,25180000AB0333,,,,,,,,,,,,,0,,,,,S,sols,,,195,6.010396,46.957334
2021-350665,2021-02-17,000002,Vente,22500,,,AU VILLAGE,B163,25270,25180,Crouzet-Migette,25,,,25180000AB0074,,,,,,,,,,,,,0,,,,,P,prés,,,440,6.010261,46.957605
2021-350787,2021-03-02,000001,Vente,160000,6,,RUE DES TERRASSES,0073,25270,25180,Crouzet-Migette,25,,,25180000ZA0018,,,,,,,,,,,,,0,3,Dépendance,,0,S,sols,,,1390,6.006544,46.955256
2021-350787,2021-03-02,000001,Vente,160000,6,,RUE DES TERRASSES,0073,25270,25180,Crouzet-Migette,25,,,25180000ZA0018,,,,,,,,,,,,,0,3,Dépendance,,0,S,sols,,,1390,6.006544,46.955256
2021-350787,2021-03-02,000001,Vente,160000,6,,RUE DES TERRASSES,0073,25270,25180,Crouzet-Migette,25,,,25180000ZA0018,,,,,,,,,,,,,0,2,Appartement,73,2,S,sols,,,1390,6.006544,46.955256
2021-350789,2021-03-02,000001,Vente,47000,6,,RUE DES TERRASSES,0073,25270,25180,Crouzet-Migette,25,,,25180000ZA0092,,,,,,,,,,,,,0,3,Dépendance,,0,T,terres,,,2215,6.00617,46.955417
2021-350789,2021-03-02,000001,Vente,47000,6,,RUE DES TERRASSES,0073,25270,25180,Crouzet-Migette,25,,,25180000ZA0092,,,,,,,,,,,,,0,3,Dépendance,,0,S,sols,,,500,6.00617,46.955417
2021-350980,2021-03-23,000001,Vente,78000,1,,RUE DES BEAUX GARCONS,0012,25270,25180,Crouzet-Migette,25,,,25180000AB0095,,,,,,,,,,,,,0,1,Maison,80,3,S,sols,,,600,6.011669,46.956578
2021-350980,2021-03-23,000001,Vente,78000,,,AU VILLAGE,B163,25270,25180,Crouzet-Migette,25,,,25180000AB0298,,,,,,,,,,,,,0,,,,,S,sols,,,43,6.011562,46.95669
2021-350980,2021-03-23,000001,Vente,78000,,,AU VILLAGE,B163,25270,25180,Crouzet-Migette,25,,,25180000AB0300,,,,,,,,,,,,,0,,,,,S,sols,,,74,6.011447,46.95658
2021-350980,2021-03-23,000001,Vente,78000,,,AU VILLAGE,B163,25270,25180,Crouzet-Migette,25,,,25180000AB0307,,,,,,,,,,,,,0,,,,,L,landes,,,181,,
2021-351442,2021-05-17,000001,Vente,138850,6,,RUE COMBE LUETTE,0009,25270,25180,Crouzet-Migette,25,,,25180000ZA0073,,,,,,,,,,,,,0,1,Maison,52,3,S,sols,,,1200,6.008312,46.954929
