id_mutation,date_mutation,numero_disposition,nature_mutation,valeur_fonciere,adresse_numero,adresse_suffixe,adresse_nom_voie,adresse_code_voie,code_postal,code_commune,nom_commune,code_departement,ancien_code_commune,ancien_nom_commune,id_parcelle,ancien_id_parcelle,numero_volume,lot1_numero,lot1_surface_carrez,lot2_numero,lot2_surface_carrez,lot3_numero,lot3_surface_carrez,lot4_numero,lot4_surface_carrez,lot5_numero,lot5_surface_carrez,nombre_lots,code_type_local,type_local,surface_reelle_bati,nombre_pieces_principales,code_nature_culture,nature_culture,code_nature_culture_speciale,nature_culture_speciale,surface_terrain,longitude,latitude
2021-341538,2021-01-25,000001,Vente,11000,8,,RUE DU VILLAGE,0125,25870,25186,Cussey-sur-l'Ognon,25,,,25186000AB0078,,,,,,,,,,,,,0,,,,,S,sols,,,85,5.938378,47.339345
2021-342318,2021-03-09,000002,Echange,2000,,,LES GRENOTS,B042,25870,25186,Cussey-sur-l'Ognon,25,,,25186000ZC0405,,,,,,,,,,,,,0,,,,,P,prés,,,89,5.941529,47.336614
2021-342318,2021-03-09,000003,Echange,2000,,,LES GRENOTS,B042,25870,25186,Cussey-sur-l'Ognon,25,,,25186000ZC0403,,,,,,,,,,,,,0,,,,,S,sols,,,89,5.941913,47.336406
2021-342563,2021-03-31,000001,Vente,239400,5,,RUE DERRIERE LA VILLE,0031,25870,25186,Cussey-sur-l'Ognon,25,,,25186000ZA0260,,,,,,,,,,,,,0,1,Maison,96,6,S,sols,,,583,5.934144,47.340732
2021-342821,2021-04-09,000001,Vente,194000,1,B,RUE DU MOULIN,0092,25870,25186,Cussey-sur-l'Ognon,25,,,25186000AB0226,,,,,,,,,,,,,0,4,Local industriel. commercial ou assimilé,164,0,S,sols,,,438,5.935991,47.338763
2021-342821,2021-04-09,000001,Vente,194000,1,B,RUE DU MOULIN,0092,25870,25186,Cussey-sur-l'Ognon,25,,,25186000AB0226,,,,,,,,,,,,,0,4,Local industriel. commercial ou assimilé,65,0,S,sols,,,438,5.935991,47.338763
2021-342821,2021-04-09,000001,Vente,194000,1,B,RUE DU MOULIN,0092,25870,25186,Cussey-sur-l'Ognon,25,,,25186000AB0226,,,,,,,,,,,,,0,2,Appartement,57,3,S,sols,,,438,5.935991,47.338763
2021-342821,2021-04-09,000001,Vente,194000,,,AU VILLAGE,B075,25870,25186,Cussey-sur-l'Ognon,25,,,25186000AB0318,,,,,,,,,,,,,0,,,,,P,prés,,,100,5.935901,47.338659
2021-343361,2021-05-25,000001,Vente,291000,20,,LOT VAL DE CUSSEY,A045,25870,25186,Cussey-sur-l'Ognon,25,,,25186000ZC0296,,,,,,,,,,,,,0,1,Maison,144,6,S,sols,,,932,5.945865,47.336639
2021-345817,2021-08-09,000001,Vente,100000,,,LES GRENOTS,B042,25870,25186,Cussey-sur-l'Ognon,25,,,25186000ZC0294,,,,,,,,,,,,,0,,,,,P,prés,,,1098,5.942643,47.335498
2021-346041,2021-08-04,000001,Vente,100000,,,LES GRENOTS,B042,25870,25186,Cussey-sur-l'Ognon,25,,,25186000ZC0293,,,,,,,,,,,,,0,,,,,P,prés,,,1100,5.942983,47.335697
2021-346061,2021-08-24,000001,Vente,9520,,,DERRIERE LA VILLE,B024,25870,25186,Cussey-sur-l'Ognon,25,,,25186000AB0346,,,,,,,,,,,,,0,,,,,S,sols,,,153,,
2021-346061,2021-08-24,000001,Vente,9520,,,DERRIERE LA VILLE,B024,25870,25186,Cussey-sur-l'Ognon,25,,,25186000AB0348,,,,,,,,,,,,,0,,,,,P,prés,,,119,,
2021-346079,2021-08-24,000001,Vente,197715,,,DERRIERE LA VILLE,B024,25870,25186,Cussey-sur-l'Ognon,25,,,25186000ZA0283,,,,,,,,,,,,,0,,,,,S,sols,,,18,5.933048,47.34128
2021-346079,2021-08-24,000001,Vente,197715,,,DERRIERE LA VILLE,B024,25870,25186,Cussey-sur-l'Ognon,25,,,25186000ZA0284,,,,,,,,,,,,,0,,,,,AB,terrains a bâtir,,,2478,,
2021-346079,2021-08-24,000001,Vente,197715,,,DERRIERE LA VILLE,B024,25870,25186,Cussey-sur-l'Ognon,25,,,25186000ZA0289,,,,,,,,,,,,,0,,,,,AB,terrains a bâtir,,,2605,,
2021-346079,2021-08-24,000001,Vente,197715,,,DERRIERE LA VILLE,B024,25870,25186,Cussey-sur-l'Ognon,25,,,25186000ZA0290,,,,,,,,,,,,,0,,,,,AB,terrains a bâtir,,,471,,
2021-346079,2021-08-24,000001,Vente,197715,,,DERRIERE LA VILLE,B024,25870,25186,Cussey-sur-l'Ognon,25,,,25186000ZA0291,,,,,,,,,,,,,0,,,,,S,sols,,,95,5.932307,47.341213
2021-346086,2021-08-24,000001,Echange,350,,,DERRIERE LA VILLE,B024,25870,25186,Cussey-sur-l'Ognon,25,,,25186000ZA0291,,,,,,,,,,,,,0,,,,,S,sols,,,95,5.932307,47.341213
2021-346086,2021-08-24,000002,Echange,350,15,,RUE DERRIERE LA VILLE,0031,25870,25186,Cussey-sur-l'Ognon,25,,,25186000ZA0286,,,,,,,,,,,,,0,,,,,S,sols,,,106,,
2021-346086,2021-08-24,000002,Echange,350,,,RUE DERRIERE LA VILLE,0031,25870,25186,Cussey-sur-l'Ognon,25,,,25186000ZA0287,,,,,,,,,,,,,0,,,,,S,sols,,,3,5.932808,47.341301
2021-346086,2021-08-24,000002,Echange,350,,,RUE DERRIERE LA VILLE,0031,25870,25186,Cussey-sur-l'Ognon,25,,,25186000ZA0288,,,,,,,,,,,,,0,,,,,S,sols,,,6,5.932609,47.341318
2021-346272,2021-08-30,000001,Vente,169000,4,,RUE DU VAL DE CUSSEY,0121,25870,25186,Cussey-sur-l'Ognon,25,,,25186000ZC0304,,,,,,,,,,,,,0,1,Maison,110,6,S,sols,,,609,5.944417,47.337728
2021-346274,2021-08-30,000001,Vente,170000,8,,LOT VAL DE CUSSEY,A045,25870,25186,Cussey-sur-l'Ognon,25,,,25186000ZC0302,,,,,,,,,,,,,0,1,Maison,108,5,S,sols,,,660,5.944598,47.337413
2021-347682,2021-10-11,000001,Vente,280300,,,BALLOTTES DESSOUS,B003,25870,25186,Cussey-sur-l'Ognon,25,,,25186000ZC0251,,,,,,,,,,,,,0,,,,,S,sols,,,172,5.94475,47.33614
2021-347682,2021-10-11,000001,Vente,280300,19,,RUE DES BALLOTTES,0009,25870,25186,Cussey-sur-l'Ognon,25,,,25186000ZC0252,,,,,,,,,,,,,0,1,Maison,139,6,S,sols,,,950,5.944876,47.336285
2021-347798,2021-10-11,000001,Vente,1450,10,,GR GRANDE RUE,0055,25870,25186,Cussey-sur-l'Ognon,25,,,25186000AC0107,,,316,,,,,,,,,,1,3,Dépendance,,0,,,,,,5.938094,47.336805
2021-347805,2021-10-27,000001,Vente,156000,,,AU VILLAGE,B075,25870,25186,Cussey-sur-l'Ognon,25,,,25186000AB0349,,,,,,,,,,,,,0,,,,,J,jardins,,,717,5.937808,47.340535
2021-347805,2021-10-27,000001,Vente,156000,2,,GR GRANDE RUE,0055,25870,25186,Cussey-sur-l'Ognon,25,,,25186000AB0351,,,,,,,,,,,,,0,2,Appartement,82,3,S,sols,,,542,5.937973,47.340451
2021-347805,2021-10-27,000001,Vente,156000,2,,GR GRANDE RUE,0055,25870,25186,Cussey-sur-l'Ognon,25,,,25186000AB0351,,,,,,,,,,,,,0,2,Appartement,98,4,S,sols,,,542,5.937973,47.340451
2021-347830,2021-10-15,000001,Vente,79500,,,AU VILLAGE,B075,25870,25186,Cussey-sur-l'Ognon,25,,,25186000AB0339,,,,,,,,,,,,,0,,,,,AB,terrains a bâtir,,,761,5.937112,47.340055
2021-347830,2021-10-15,000001,Vente,79500,,,AU VILLAGE,B075,25870,25186,Cussey-sur-l'Ognon,25,,,25186000AB0344,,,,,,,,,,,,,0,,,,,AB,terrains a bâtir,,,128,5.937479,47.340073
2021-348670,2021-11-23,000001,Vente,111945,10,,GR GRANDE RUE,0055,25870,25186,Cussey-sur-l'Ognon,25,,,25186000AC0107,,,122,,134,,140,54.88,,,,,3,3,Dépendance,,0,,,,,,5.938094,47.336805
2021-348670,2021-11-23,000001,Vente,111945,10,,GR GRANDE RUE,0055,25870,25186,Cussey-sur-l'Ognon,25,,,25186000AC0107,,,122,,134,,140,54.88,,,,,3,2,Appartement,55,2,,,,,,5.938094,47.336805
2021-348670,2021-11-23,000001,Vente,111945,10,,GR GRANDE RUE,0055,25870,25186,Cussey-sur-l'Ognon,25,,,25186000AC0107,,,303,,,,,,,,,,1,3,Dépendance,,0,,,,,,5.938094,47.336805
2021-349356,2021-12-03,000001,Vente,220704,4,,RUE DE LA FOUGERE,0048,25870,25186,Cussey-sur-l'Ognon,25,,,25186000ZD0216,,,,,,,,,,,,,0,1,Maison,88,5,S,sols,,,813,5.941479,47.333474
2021-349356,2021-12-03,000001,Vente,220704,4,,RUE DE LA FOUGERE,0048,25870,25186,Cussey-sur-l'Ognon,25,,,25186000ZD0216,,,,,,,,,,,,,0,1,Maison,88,5,S,sols,,,813,5.941479,47.333474
2021-349609,2021-12-16,000001,Vente,340110,10,,RUE DES CORVEES,0025,25870,25186,Cussey-sur-l'Ognon,25,,,25186000ZA0178,,,,,,,,,,,,,0,3,Dépendance,,0,S,sols,,,800,5.938133,47.335028
2021-349609,2021-12-16,000001,Vente,340110,10,,RUE DES CORVEES,0025,25870,25186,Cussey-sur-l'Ognon,25,,,25186000ZA0178,,,,,,,,,,,,,0,1,Maison,149,6,S,sols,,,800,5.938133,47.335028
2021-349609,2021-12-16,000001,Vente,340110,10,,RUE DES CORVEES,0025,25870,25186,Cussey-sur-l'Ognon,25,,,25186000ZA0178,,,,,,,,,,,,,0,3,Dépendance,,0,S,sols,,,800,5.938133,47.335028
2021-349609,2021-12-16,000001,Vente,340110,,,CUGNOT DES CORVEES,B023,25870,25186,Cussey-sur-l'Ognon,25,,,25186000ZA0179,,,,,,,,,,,,,0,,,,,P,prés,,,24,5.938379,47.335148
2021-349621,2021-12-17,000001,Vente,132950,10,,GR GRANDE RUE,0055,25870,25186,Cussey-sur-l'Ognon,25,,,25186000AC0107,,,108,,143,50.55,,,,,,,2,3,Dépendance,,0,,,,,,5.938094,47.336805
2021-349621,2021-12-17,000001,Vente,132950,10,,GR GRANDE RUE,0055,25870,25186,Cussey-sur-l'Ognon,25,,,25186000AC0107,,,317,,,,,,,,,,1,3,Dépendance,,0,,,,,,5.938094,47.336805
2021-349621,2021-12-17,000001,Vente,132950,10,,GR GRANDE RUE,0055,25870,25186,Cussey-sur-l'Ognon,25,,,25186000AC0107,,,108,,143,50.55,,,,,,,2,2,Appartement,67,3,,,,,,5.938094,47.336805
