id_mutation,date_mutation,numero_disposition,nature_mutation,valeur_fonciere,adresse_numero,adresse_suffixe,adresse_nom_voie,adresse_code_voie,code_postal,code_commune,nom_commune,code_departement,ancien_code_commune,ancien_nom_commune,id_parcelle,ancien_id_parcelle,numero_volume,lot1_numero,lot1_surface_carrez,lot2_numero,lot2_surface_carrez,lot3_numero,lot3_surface_carrez,lot4_numero,lot4_surface_carrez,lot5_numero,lot5_surface_carrez,nombre_lots,code_type_local,type_local,surface_reelle_bati,nombre_pieces_principales,code_nature_culture,nature_culture,code_nature_culture_speciale,nature_culture_speciale,surface_terrain,longitude,latitude
2021-354264,2021-10-01,000001,Vente,2000,,,AUX ENVERS,B034,25380,25589,Vauclusotte,25,,,255890000D0102,,,,,,,,,,,,,0,,,,,BT,taillis simples,,,2000,6.711306,47.273593
2021-354264,2021-10-01,000001,Vente,2000,,,AUX ENVERS,B034,25380,25589,Vauclusotte,25,,,255890000D0103,,,,,,,,,,,,,0,,,,,BR,futaies résineuses,,,2580,6.711487,47.27385
2021-354501,2021-11-03,000001,Vente,175000,,,AU VILLAGE,B078,25380,25589,Vauclusotte,25,,,25589000AB0016,,,,,,,,,,,,,0,,,,,T,terres,,,2112,6.734801,47.279953
2021-354501,2021-11-03,000001,Vente,175000,8,,RUE GRANDE,0025,25380,25589,Vauclusotte,25,,,25589000AB0124,,,,,,,,,,,,,0,1,Maison,134,6,S,sols,,,971,6.733886,47.2802
2021-354501,2021-11-03,000001,Vente,175000,,,AU VILLAGE,B078,25380,25589,Vauclusotte,25,,,25589000AB0141,,,,,,,,,,,,,0,,,,,T,terres,,,1587,6.734253,47.280038
2021-354682,2021-11-04,000001,Vente,145000,4,,RUE DES GENEVRIERS,0022,25380,25589,Vauclusotte,25,,,25589000AB0118,,,,,,,,,,,,,0,1,Maison,102,4,S,sols,,,1003,6.736806,47.277567
2021-354682,2021-11-04,000001,Vente,145000,4,,RUE DES GENEVRIERS,0022,25380,25589,Vauclusotte,25,,,25589000AB0118,,,,,,,,,,,,,0,3,Dépendance,,0,S,sols,,,1003,6.736806,47.277567
2021-354682,2021-11-04,000001,Vente,145000,4,,RUE DES GENEVRIERS,0022,25380,25589,Vauclusotte,25,,,25589000AB0118,,,,,,,,,,,,,0,3,Dépendance,,0,S,sols,,,1003,6.736806,47.277567
2021-354682,2021-11-04,000001,Vente,145000,,,AU VILLAGE,B078,25380,25589,Vauclusotte,25,,,25589000AB0146,,,,,,,,,,,,,0,,,,,VE,vergers,,,387,6.736675,47.277805
