id_mutation,date_mutation,numero_disposition,nature_mutation,valeur_fonciere,adresse_numero,adresse_suffixe,adresse_nom_voie,adresse_code_voie,code_postal,code_commune,nom_commune,code_departement,ancien_code_commune,ancien_nom_commune,id_parcelle,ancien_id_parcelle,numero_volume,lot1_numero,lot1_surface_carrez,lot2_numero,lot2_surface_carrez,lot3_numero,lot3_surface_carrez,lot4_numero,lot4_surface_carrez,lot5_numero,lot5_surface_carrez,nombre_lots,code_type_local,type_local,surface_reelle_bati,nombre_pieces_principales,code_nature_culture,nature_culture,code_nature_culture_speciale,nature_culture_speciale,surface_terrain,longitude,latitude
2021-357904,2021-04-08,000001,Vente,104000,,,LE CHATELARD,B017,26310,26040,Beaurières,26,,,260400000A0296,,,,,,,,,,,,,0,,,,,S,sols,,,126,5.558216,44.571851
2021-357904,2021-04-08,000001,Vente,104000,5030,,LE CHATELARD,B017,26310,26040,Beaurières,26,,,260400000A0304,,,,,,,,,,,,,0,1,Maison,120,5,S,sols,,,100,5.558019,44.57184
2021-357904,2021-04-08,000001,Vente,104000,,,LE CHATELARD,B017,26310,26040,Beaurières,26,,,260400000A0681,,,,,,,,,,,,,0,,,,,J,jardins,,,221,5.558298,44.57178
2021-358325,2021-03-26,000001,Vente,90000,5054,,LE VILLAGE,B076,26310,26040,Beaurières,26,,,260400000B0304,,,,,,,,,,,,,0,1,Maison,98,4,S,sols,,,110,5.558976,44.570635
2021-361143,2021-06-08,000001,Vente,800,,,LE CHATELARD,B017,26310,26040,Beaurières,26,,,260400000A0680,,,,,,,,,,,,,0,,,,,J,jardins,,,49,5.55834,44.571869
2021-362003,2021-06-28,000002,Vente,50000,,,LE CHATELARD,B017,26310,26040,Beaurières,26,,,260400000A0314,,,,,,,,,,,,,0,,,,,L,landes,PATUR,Pâture plantée,7950,5.556327,44.572296
2021-362003,2021-06-28,000002,Vente,50000,,,LE CHATELARD,B017,26310,26040,Beaurières,26,,,260400000A0320,,,,,,,,,,,,,0,,,,,L,landes,PATUR,Pâture plantée,8320,5.555972,44.571092
2021-362003,2021-06-28,000002,Vente,50000,,,LA GARE,B036,26310,26040,Beaurières,26,,,260400000A0344,,,,,,,,,,,,,0,,,,,S,sols,,,730,5.557389,44.571024
2021-362003,2021-06-28,000002,Vente,50000,,,LA GARE,B036,26310,26040,Beaurières,26,,,260400000A0345,,,,,,,,,,,,,0,,,,,T,terres,,,2160,5.557343,44.57075
2021-362003,2021-06-28,000002,Vente,50000,,,LA GARE,B036,26310,26040,Beaurières,26,,,260400000A0677,,,,,,,,,,,,,0,,,,,P,prés,,,1567,5.556886,44.570713
2021-363811,2021-08-30,000001,Vente,158000,5009,,LE VILLAGE,B076,26310,26040,Beaurières,26,,,260400000B0322,,,,,,,,,,,,,0,1,Maison,96,3,S,sols,,,141,5.55932,44.57022
2021-365111,2021-09-09,000001,Vente,80000,,,LE GRAND PRE,B039,26310,26040,Beaurières,26,,,260400000A0376,,,,,,,,,,,,,0,,,,,T,terres,,,955,5.553458,44.569056
2021-365111,2021-09-09,000001,Vente,80000,5022,,LE GRAND PRE,B039,26310,26040,Beaurières,26,,,260400000A0377,,,,,,,,,,,,,0,2,Appartement,50,3,S,sols,,,820,5.5531,44.56885
2021-365111,2021-09-09,000001,Vente,80000,5022,,LE GRAND PRE,B039,26310,26040,Beaurières,26,,,260400000A0377,,,,,,,,,,,,,0,2,Appartement,35,2,S,sols,,,820,5.5531,44.56885
2021-365111,2021-09-09,000001,Vente,80000,5022,,LE GRAND PRE,B039,26310,26040,Beaurières,26,,,260400000A0377,,,,,,,,,,,,,0,3,Dépendance,,0,S,sols,,,820,5.5531,44.56885
2021-365111,2021-09-09,000001,Vente,80000,5022,,LE GRAND PRE,B039,26310,26040,Beaurières,26,,,260400000A0377,,,,,,,,,,,,,0,3,Dépendance,,0,S,sols,,,820,5.5531,44.56885
2021-365111,2021-09-09,000001,Vente,80000,5022,,LE GRAND PRE,B039,26310,26040,Beaurières,26,,,260400000A0377,,,,,,,,,,,,,0,3,Dépendance,,0,S,sols,,,820,5.5531,44.56885
