id_mutation,date_mutation,numero_disposition,nature_mutation,valeur_fonciere,adresse_numero,adresse_suffixe,adresse_nom_voie,adresse_code_voie,code_postal,code_commune,nom_commune,code_departement,ancien_code_commune,ancien_nom_commune,id_parcelle,ancien_id_parcelle,numero_volume,lot1_numero,lot1_surface_carrez,lot2_numero,lot2_surface_carrez,lot3_numero,lot3_surface_carrez,lot4_numero,lot4_surface_carrez,lot5_numero,lot5_surface_carrez,nombre_lots,code_type_local,type_local,surface_reelle_bati,nombre_pieces_principales,code_nature_culture,nature_culture,code_nature_culture_speciale,nature_culture_speciale,surface_terrain,longitude,latitude
2021-355262,2021-01-07,000001,Vente,522000,120,,CHE DE LA FREYDIERE,0188,26160,26045,La Bégude-de-Mazenc,26,,,26045000ZE0092,,,,,,,,,,,,,0,1,Maison,105,2,T,terres,,,2000,4.94495,44.558499
2021-355262,2021-01-07,000001,Vente,522000,120,,CHE DE LA FREYDIERE,0188,26160,26045,La Bégude-de-Mazenc,26,,,26045000ZE0092,,,,,,,,,,,,,0,1,Maison,105,2,S,sols,,,2200,4.94495,44.558499
2021-355476,2021-01-12,000001,Vente,75000,505,,AV EMILE LOUBET,0013,26160,26045,La Bégude-de-Mazenc,26,,,26045000ZK0086,,,,,,,,,,,,,0,1,Maison,62,3,T,terres,,,560,4.928674,44.545325
2021-355476,2021-01-12,000001,Vente,75000,505,,AV EMILE LOUBET,0013,26160,26045,La Bégude-de-Mazenc,26,,,26045000ZK0086,,,,,,,,,,,,,0,1,Maison,62,3,S,sols,,,500,4.928674,44.545325
2021-355808,2021-01-08,000001,Vente,408760,,,LA SAULEE ET LE CLOS,B049,26160,26045,La Bégude-de-Mazenc,26,,,260450000C0212,,,,,,,,,,,,,0,,,,,L,landes,PATUR,Pâture plantée,139,4.951242,44.542081
2021-355808,2021-01-08,000001,Vente,408760,,,LA SAULEE ET LE CLOS,B049,26160,26045,La Bégude-de-Mazenc,26,,,260450000C0552,,,,,,,,,,,,,0,,,,,L,landes,PATUR,Pâture plantée,301,4.952011,44.541841
2021-355808,2021-01-08,000001,Vente,408760,,,LA SAULEE ET LE CLOS,B049,26160,26045,La Bégude-de-Mazenc,26,,,260450000C0553,,,,,,,,,,,,,0,,,,,BT,taillis simples,,,146,4.951662,44.54195
2021-355808,2021-01-08,000001,Vente,408760,,,LA SAULEE ET LE CLOS,B049,26160,26045,La Bégude-de-Mazenc,26,,,260450000C0556,,,,,,,,,,,,,0,,,,,BR,futaies résineuses,,,1000,4.951909,44.541715
2021-355808,2021-01-08,000001,Vente,408760,,,LA SAULEE ET LE CLOS,B049,26160,26045,La Bégude-de-Mazenc,26,,,260450000C0557,,,,,,,,,,,,,0,,,,,T,terres,,,560,4.952498,44.541562
2021-355808,2021-01-08,000001,Vente,408760,,,LA SAULEE ET LE CLOS,B049,26160,26045,La Bégude-de-Mazenc,26,,,260450000C0558,,,,,,,,,,,,,0,,,,,T,terres,,,120,4.952327,44.541607
2021-355808,2021-01-08,000001,Vente,408760,,,LA SAULEE ET LE CLOS,B049,26160,26045,La Bégude-de-Mazenc,26,,,260450000C0560,,,,,,,,,,,,,0,,,,,E,eaux,CANAL,Canal,265,4.952001,44.541741
2021-355808,2021-01-08,000001,Vente,408760,1080,,RTE DE DIEULEFIT,0126,26160,26045,La Bégude-de-Mazenc,26,,,260450000C0561,,,,,,,,,,,,,0,1,Maison,100,4,S,sols,,,420,4.952246,44.541742
2021-355808,2021-01-08,000001,Vente,408760,,,LA SAULEE ET LE CLOS,B049,26160,26045,La Bégude-de-Mazenc,26,,,260450000C0562,,,,,,,,,,,,,0,,,,,S,sols,,,263,4.952554,44.541663
2021-355808,2021-01-08,000001,Vente,408760,,,LA SAULEE ET LE CLOS,B049,26160,26045,La Bégude-de-Mazenc,26,,,260450000C0677,,,,,,,,,,,,,0,,,,,S,sols,,,76,4.952035,44.541909
2021-355808,2021-01-08,000001,Vente,408760,,,LA SAULEE ET LE CLOS,B049,26160,26045,La Bégude-de-Mazenc,26,,,260450000C0678,,,,,,,,,,,,,0,,,,,S,sols,,,195,4.951586,44.542001
2021-355808,2021-01-08,000001,Vente,408760,,,LA SAULEE ET LE CLOS,B049,26160,26045,La Bégude-de-Mazenc,26,,,260450000C0680,,,,,,,,,,,,,0,,,,,S,sols,,,6,4.952211,44.541876
2021-355870,2021-01-29,000001,Vente,323210,,,PAS DE LA CROIX,B036,26160,26045,La Bégude-de-Mazenc,26,,,260450000D0613,,,,,,,,,,,,,0,,,,,T,terres,,,3450,4.938679,44.526953
2021-355870,2021-01-29,000001,Vente,323210,1935,,RTE D ALEYRAC,0002,26160,26045,La Bégude-de-Mazenc,26,,,260450000D0614,,,,,,,,,,,,,0,1,Maison,150,5,S,sols,,,1850,4.938547,44.526445
2021-355870,2021-01-29,000001,Vente,323210,,,PAS DE LA CROIX,B036,26160,26045,La Bégude-de-Mazenc,26,,,260450000D0615,,,,,,,,,,,,,0,,,,,T,terres,,,1292,4.938336,44.526134
2021-355870,2021-01-29,000001,Vente,323210,,,PAS DE LA CROIX,B036,26160,26045,La Bégude-de-Mazenc,26,,,260450000D0669,,,,,,,,,,,,,0,,,,,BR,futaies résineuses,,,24630,4.940107,44.526349
2021-355870,2021-01-29,000001,Vente,323210,,,PAS DE LA CROIX,B036,26160,26045,La Bégude-de-Mazenc,26,,,260450000D0671,,,,,,,,,,,,,0,,,,,T,terres,,,830,4.937901,44.526065
2021-355870,2021-01-29,000001,Vente,323210,,,PAS DE LA CROIX,B036,26160,26045,La Bégude-de-Mazenc,26,,,260450000D0671,,,,,,,,,,,,,0,,,,,T,terres,,,830,4.937901,44.526065
2021-356122,2021-02-03,000002,Vente,127000,,,LA CONDAMINE,B014,26160,26045,La Bégude-de-Mazenc,26,,,26045000ZR0017,,,,,,,,,,,,,0,,,,,T,terres,,,9920,4.929428,44.555118
2021-356122,2021-02-03,000002,Vente,127000,,,LA CONDAMINE,B014,26160,26045,La Bégude-de-Mazenc,26,,,26045000ZR0045,,,,,,,,,,,,,0,,,,,T,terres,,,59986,4.930139,44.552585
2021-356122,2021-02-03,000002,Vente,127000,,,LA CONDAMINE,B014,26160,26045,La Bégude-de-Mazenc,26,,,26045000ZR0073,,,,,,,,,,,,,0,,,,,T,terres,,,16550,4.928396,44.55585
2021-356122,2021-02-03,000002,Vente,127000,,,BEAU PLAN,B004,26160,26045,La Bégude-de-Mazenc,26,,,26045000ZR0096,,,,,,,,,,,,,0,,,,,T,terres,,,23549,4.92965,44.551174
2021-356454,2021-02-09,000001,Vente,100000,520,,GRANDE TUILERIE ET MANOTIE,B025,26160,26045,La Bégude-de-Mazenc,26,,,26045000ZK0023,,,,,,,,,,,,,0,1,Maison,50,3,S,sols,,,320,4.929092,44.541129
2021-356454,2021-02-09,000001,Vente,100000,,,GRANDE TUILERIE ET MANOTIE,B025,26160,26045,La Bégude-de-Mazenc,26,,,26045000ZK0166,,,,,,,,,,,,,0,,,,,T,terres,,,70,4.929055,44.541159
2021-357144,2021-03-02,000001,Vente,,,,LE SAGE,B046,26160,26045,La Bégude-de-Mazenc,26,,,260450000H1470,,,,,,,,,,,,,0,,,,,T,terres,,,56,4.945829,44.543202
2021-357144,2021-03-02,000001,Vente,,,,LE SAGE,B046,26160,26045,La Bégude-de-Mazenc,26,,,260450000H1472,,,,,,,,,,,,,0,,,,,VI,vignes,,,23,4.94549,44.543237
2021-357177,2021-03-08,000001,Vente,90000,,,LES MOURETTES,B033,26160,26045,La Bégude-de-Mazenc,26,,,26045000ZI0242,,,,,,,,,,,,,0,,,,,J,jardins,,,723,4.93671,44.540987
2021-357374,2021-03-12,000001,Vente,67000,,,LES MOURETTES,B033,26160,26045,La Bégude-de-Mazenc,26,,,26045000ZI0243,,,,,,,,,,,,,0,,,,,J,jardins,,,498,4.937024,44.540992
2021-358022,2021-04-06,000001,Vente,84000,1,,PL MAURICE DELOULE,0040,26160,26045,La Bégude-de-Mazenc,26,,,260450000H0873,,,5,58.67,,,,,,,,,1,2,Appartement,56,2,,,,,,4.934742,44.54442
2021-358022,2021-04-06,000001,Vente,84000,1,,PL MAURICE DELOULE,0040,26160,26045,La Bégude-de-Mazenc,26,,,260450000H0873,,,19,,,,,,,,,,1,3,Dépendance,,0,,,,,,4.934742,44.54442
2021-358561,2021-04-15,000002,Vente,2500,,,LES VAUTOURS,B052,26160,26045,La Bégude-de-Mazenc,26,,,26045000ZM0270,,,,,,,,,,,,,0,,,,,T,terres,,,499,4.888618,44.55146
2021-358670,2021-04-06,000001,Vente,278000,1370,,RTE DE DIEULEFIT,0126,26160,26045,La Bégude-de-Mazenc,26,,,260450000C0158,,,,,,,,,,,,,0,1,Maison,140,4,S,sols,,,492,4.955396,44.540798
2021-358670,2021-04-06,000001,Vente,278000,,,LA SAULEE ET LE CLOS,B049,26160,26045,La Bégude-de-Mazenc,26,,,260450000C0159,,,,,,,,,,,,,0,,,,,BT,taillis simples,,,285,4.955362,44.540659
2021-358670,2021-04-06,000001,Vente,278000,,,LA SAULEE ET LE CLOS,B049,26160,26045,La Bégude-de-Mazenc,26,,,260450000C0160,,,,,,,,,,,,,0,,,,,BT,taillis simples,,,65,4.95517,44.540657
2021-358670,2021-04-06,000001,Vente,278000,,,LA SAULEE ET LE CLOS,B049,26160,26045,La Bégude-de-Mazenc,26,,,260450000C0161,,,,,,,,,,,,,0,,,,,S,sols,,,75,4.955173,44.540782
2021-359168,2021-04-12,000001,Vente,1,,,GALLEE,B022,26160,26045,La Bégude-de-Mazenc,26,,,26045000ZK0218,,,,,,,,,,,,,0,,,,,S,sols,,,123,4.927023,44.545873
2021-359168,2021-04-12,000001,Vente,1,,,GALLEE,B022,26160,26045,La Bégude-de-Mazenc,26,,,26045000ZK0408,,,,,,,,,,,,,0,,,,,S,sols,,,74,4.926865,44.545342
2021-359463,2021-04-12,000001,Vente,1,,,GALLEE,B022,26160,26045,La Bégude-de-Mazenc,26,,,26045000ZK0409,,,,,,,,,,,,,0,,,,,S,sols,,,77,4.926851,44.5454
2021-359924,2021-05-20,000001,Vente,103716,,,GRANDE TUILERIE ET MANOTIE,B025,26160,26045,La Bégude-de-Mazenc,26,,,26045000ZK0336,,,,,,,,,,,,,0,,,,,T,terres,,,804,4.928689,44.540264
2021-360406,2021-05-17,000001,Vente,584250,125,,IMP DES ROMARINS,0191,26160,26045,La Bégude-de-Mazenc,26,,,26045000ZI0132,,,,,,,,,,,,,0,3,Dépendance,,0,S,sols,,,300,4.937031,44.540312
2021-360406,2021-05-17,000001,Vente,584250,125,,IMP DES ROMARINS,0191,26160,26045,La Bégude-de-Mazenc,26,,,26045000ZI0132,,,,,,,,,,,,,0,1,Maison,179,7,T,terres,,,2200,4.937031,44.540312
2021-360406,2021-05-17,000001,Vente,584250,125,,IMP DES ROMARINS,0191,26160,26045,La Bégude-de-Mazenc,26,,,26045000ZI0132,,,,,,,,,,,,,0,3,Dépendance,,0,T,terres,,,2200,4.937031,44.540312
2021-360406,2021-05-17,000001,Vente,584250,125,,IMP DES ROMARINS,0191,26160,26045,La Bégude-de-Mazenc,26,,,26045000ZI0132,,,,,,,,,,,,,0,1,Maison,179,7,S,sols,,,300,4.937031,44.540312
2021-360448,2021-05-27,000001,Vente,387790,430,,RTE DE COMBEMONT,0125,26160,26045,La Bégude-de-Mazenc,26,,,26045000ZI0147,,,,,,,,,,,,,0,1,Maison,134,6,S,sols,,,1021,4.938196,44.540698
2021-360448,2021-05-27,000001,Vente,387790,430,,RTE DE COMBEMONT,0125,26160,26045,La Bégude-de-Mazenc,26,,,26045000ZI0147,,,,,,,,,,,,,0,3,Dépendance,,0,S,sols,,,1021,4.938196,44.540698
2021-360448,2021-05-27,000001,Vente,387790,430,,RTE DE COMBEMONT,0125,26160,26045,La Bégude-de-Mazenc,26,,,26045000ZI0147,,,,,,,,,,,,,0,3,Dépendance,,0,S,sols,,,1021,4.938196,44.540698
2021-360448,2021-05-27,000001,Vente,387790,,,LES MOURETTES,B033,26160,26045,La Bégude-de-Mazenc,26,,,26045000ZI0148,,,,,,,,,,,,,0,,,,,S,sols,,,60,4.938414,44.540651
2021-360448,2021-05-27,000001,Vente,387790,,,LES MOURETTES,B033,26160,26045,La Bégude-de-Mazenc,26,,,26045000ZI0236,,,,,,,,,,,,,0,,,,,S,sols,,,182,4.938239,44.540602
2021-360448,2021-05-27,000001,Vente,387790,,,LES MOURETTES,B033,26160,26045,La Bégude-de-Mazenc,26,,,26045000ZI0238,,,,,,,,,,,,,0,,,,,T,terres,,,8,4.937878,44.540587
2021-360462,2021-06-02,000001,Vente,490000,,,PIERRY,B042,26160,26045,La Bégude-de-Mazenc,26,,,260450000H0618,,,,,,,,,,,,,0,,,,,L,landes,PATUR,Pâture plantée,498,4.940004,44.54663
2021-360462,2021-06-02,000001,Vente,490000,,,PIERRY,B042,26160,26045,La Bégude-de-Mazenc,26,,,260450000H0619,,,,,,,,,,,,,0,,,,,BR,futaies résineuses,,,176,4.939797,44.546468
2021-360462,2021-06-02,000001,Vente,490000,335,C,RUE ARISTIDE BRIAND,0171,26160,26045,La Bégude-de-Mazenc,26,,,260450000H0623,,,,,,,,,,,,,0,1,Maison,189,6,S,sols,,,400,4.940697,44.546992
2021-360462,2021-06-02,000001,Vente,490000,335,C,RUE ARISTIDE BRIAND,0171,26160,26045,La Bégude-de-Mazenc,26,,,260450000H0623,,,,,,,,,,,,,0,1,Maison,189,6,L,landes,PATUR,Pâture plantée,950,4.940697,44.546992
2021-360462,2021-06-02,000001,Vente,490000,,,PIERRY,B042,26160,26045,La Bégude-de-Mazenc,26,,,260450000H0624,,,,,,,,,,,,,0,,,,,S,sols,,,568,4.940521,44.54696
2021-360462,2021-06-02,000001,Vente,490000,,,PIERRY,B042,26160,26045,La Bégude-de-Mazenc,26,,,260450000H0625,,,,,,,,,,,,,0,,,,,L,landes,PATUR,Pâture plantée,1510,4.94079,44.547061
2021-360717,2021-05-21,000002,Vente,100000,,,GALLEE,B022,26160,26045,La Bégude-de-Mazenc,26,,,26045000ZK0414,,,,,,,,,,,,,0,,,,,T,terres,,,1197,4.926979,44.544862
2021-360881,2021-05-21,000001,Vente,100000,,,GALLEE,B022,26160,26045,La Bégude-de-Mazenc,26,,,26045000ZK0415,,,,,,,,,,,,,0,,,,,J,jardins,,,1197,4.927123,44.54519
2021-361695,2021-06-16,000001,Vente,298800,75,,CHEM DE CHANTEBISE,0185,26160,26045,La Bégude-de-Mazenc,26,,,26045000ZN0100,,,,,,,,,,,,,0,1,Maison,120,4,S,sols,,,450,4.90217,44.560395
2021-361695,2021-06-16,000001,Vente,298800,75,,CHEM DE CHANTEBISE,0185,26160,26045,La Bégude-de-Mazenc,26,,,26045000ZN0100,,,,,,,,,,,,,0,1,Maison,120,4,T,terres,,,1579,4.90217,44.560395
2021-362383,2021-07-09,000001,Vente,243500,145,,RUE DES RIVES DU JABRON,0174,26160,26045,La Bégude-de-Mazenc,26,,,26045000ZK0267,,,,,,,,,,,,,0,1,Maison,90,5,S,sols,,,601,4.926609,44.544414
2021-362416,2021-07-15,000001,Vente,677000,5284,,LES BASSES BLACHES NORD,B002,26160,26045,La Bégude-de-Mazenc,26,,,26045000ZN0112,,,,,,,,,,,,,0,3,Dépendance,,0,S,sols,,,1150,4.890224,44.559649
2021-362416,2021-07-15,000001,Vente,677000,5284,,LES BASSES BLACHES NORD,B002,26160,26045,La Bégude-de-Mazenc,26,,,26045000ZN0112,,,,,,,,,,,,,0,1,Maison,220,5,T,terres,,,1119,4.890224,44.559649
2021-362416,2021-07-15,000001,Vente,677000,5284,,LES BASSES BLACHES NORD,B002,26160,26045,La Bégude-de-Mazenc,26,,,26045000ZN0112,,,,,,,,,,,,,0,3,Dépendance,,0,T,terres,,,1119,4.890224,44.559649
2021-362416,2021-07-15,000001,Vente,677000,5284,,LES BASSES BLACHES NORD,B002,26160,26045,La Bégude-de-Mazenc,26,,,26045000ZN0112,,,,,,,,,,,,,0,3,Dépendance,,0,T,terres,,,1119,4.890224,44.559649
2021-362416,2021-07-15,000001,Vente,677000,5284,,LES BASSES BLACHES NORD,B002,26160,26045,La Bégude-de-Mazenc,26,,,26045000ZN0112,,,,,,,,,,,,,0,3,Dépendance,,0,T,terres,,,1119,4.890224,44.559649
2021-362416,2021-07-15,000001,Vente,677000,5284,,LES BASSES BLACHES NORD,B002,26160,26045,La Bégude-de-Mazenc,26,,,26045000ZN0112,,,,,,,,,,,,,0,1,Maison,220,5,T,terres,,,7731,4.890224,44.559649
2021-362416,2021-07-15,000001,Vente,677000,5284,,LES BASSES BLACHES NORD,B002,26160,26045,La Bégude-de-Mazenc,26,,,26045000ZN0112,,,,,,,,,,,,,0,3,Dépendance,,0,T,terres,,,7731,4.890224,44.559649
2021-362416,2021-07-15,000001,Vente,677000,5284,,LES BASSES BLACHES NORD,B002,26160,26045,La Bégude-de-Mazenc,26,,,26045000ZN0112,,,,,,,,,,,,,0,3,Dépendance,,0,T,terres,,,7731,4.890224,44.559649
2021-362416,2021-07-15,000001,Vente,677000,5284,,LES BASSES BLACHES NORD,B002,26160,26045,La Bégude-de-Mazenc,26,,,26045000ZN0112,,,,,,,,,,,,,0,3,Dépendance,,0,T,terres,,,7731,4.890224,44.559649
2021-362416,2021-07-15,000001,Vente,677000,5284,,LES BASSES BLACHES NORD,B002,26160,26045,La Bégude-de-Mazenc,26,,,26045000ZN0112,,,,,,,,,,,,,0,1,Maison,220,5,S,sols,,,1150,4.890224,44.559649
2021-362416,2021-07-15,000001,Vente,677000,5284,,LES BASSES BLACHES NORD,B002,26160,26045,La Bégude-de-Mazenc,26,,,26045000ZN0112,,,,,,,,,,,,,0,3,Dépendance,,0,S,sols,,,1150,4.890224,44.559649
2021-362416,2021-07-15,000001,Vente,677000,5284,,LES BASSES BLACHES NORD,B002,26160,26045,La Bégude-de-Mazenc,26,,,26045000ZN0112,,,,,,,,,,,,,0,3,Dépendance,,0,S,sols,,,1150,4.890224,44.559649
2021-362455,2021-07-12,000001,Vente,439900,175,,CHE DE LA PIVERDIERE,0086,26160,26045,La Bégude-de-Mazenc,26,,,26045000ZR0054,,,,,,,,,,,,,0,3,Dépendance,,0,T,terres,,,2128,4.927123,44.550803
2021-362455,2021-07-12,000001,Vente,439900,175,,CHE DE LA PIVERDIERE,0086,26160,26045,La Bégude-de-Mazenc,26,,,26045000ZR0054,,,,,,,,,,,,,0,1,Maison,218,5,T,terres,,,2128,4.927123,44.550803
2021-362455,2021-07-12,000001,Vente,439900,175,,CHE DE LA PIVERDIERE,0086,26160,26045,La Bégude-de-Mazenc,26,,,26045000ZR0054,,,,,,,,,,,,,0,1,Maison,218,5,S,sols,,,500,4.927123,44.550803
2021-362455,2021-07-12,000001,Vente,439900,175,,CHE DE LA PIVERDIERE,0086,26160,26045,La Bégude-de-Mazenc,26,,,26045000ZR0054,,,,,,,,,,,,,0,3,Dépendance,,0,S,sols,,,500,4.927123,44.550803
2021-362455,2021-07-12,000001,Vente,439900,,,BEAU PLAN,B004,26160,26045,La Bégude-de-Mazenc,26,,,26045000ZR0087,,,,,,,,,,,,,0,,,,,T,terres,,,111,4.926823,44.550738
2021-362455,2021-07-12,000001,Vente,439900,,,BEAU PLAN,B004,26160,26045,La Bégude-de-Mazenc,26,,,26045000ZR0089,,,,,,,,,,,,,0,,,,,T,terres,,,1537,4.927071,44.550248
2021-362455,2021-07-12,000001,Vente,439900,,,BEAU PLAN,B004,26160,26045,La Bégude-de-Mazenc,26,,,26045000ZR0091,,,,,,,,,,,,,0,,,,,S,sols,,,648,4.926718,44.55033
2021-362577,2021-04-28,000001,Vente,384200,,,BEAU PLAN,B004,26160,26045,La Bégude-de-Mazenc,26,,,26045000ZR0085,,,,,,,,,,,,,0,,,,,T,terres,,,386,4.926669,44.55018
2021-362577,2021-04-28,000001,Vente,384200,,,BEAU PLAN,B004,26160,26045,La Bégude-de-Mazenc,26,,,26045000ZR0091,,,,,,,,,,,,,0,,,,,S,sols,,,648,4.926718,44.55033
2021-363476,2021-08-12,000001,Vente,472000,,,GIRANNE ET LA GROTTE,B024,26160,26045,La Bégude-de-Mazenc,26,,,26045000ZS0073,,,,,,,,,,,,,0,,,,,T,terres,,,6290,4.936656,44.559515
2021-363476,2021-08-12,000001,Vente,472000,1040,,CHE DES COURROIES,0150,26160,26045,La Bégude-de-Mazenc,26,,,26045000ZS0074,,,,,,,,,,,,,0,1,Maison,88,3,S,sols,,,1785,4.937006,44.559304
2021-363476,2021-08-12,000001,Vente,472000,1040,,CHE DES COURROIES,0150,26160,26045,La Bégude-de-Mazenc,26,,,26045000ZS0074,,,,,,,,,,,,,0,1,Maison,88,3,T,terres,,,2005,4.937006,44.559304
2021-363476,2021-08-12,000001,Vente,472000,,,GIRANNE ET LA GROTTE,B024,26160,26045,La Bégude-de-Mazenc,26,,,26045000ZS0075,,,,,,,,,,,,,0,,,,,T,terres,,,15220,4.937556,44.559208
2021-363498,2021-08-03,000001,Vente,164350,5347,,SAINT MAURICE,B047,26160,26045,La Bégude-de-Mazenc,26,,,26045000ZB0195,,,2,,,,,,,,,,1,1,Maison,100,4,,,,,,4.928182,44.584843
2021-363498,2021-08-03,000001,Vente,164350,1475,,CHE DE LA COLLINE,0080,26160,26045,La Bégude-de-Mazenc,26,,,26045000ZB0203,,,,,,,,,,,,,0,,,,,L,landes,PATUR,Pâture plantée,190,4.928273,44.585002
2021-363649,2021-07-12,000002,Vente,275200,595,A,CHE DU JABELIN,0102,26160,26045,La Bégude-de-Mazenc,26,,,26045000ZM0271,,,,,,,,,,,,,0,,,,,S,sols,,,304,4.898239,44.547217
2021-363649,2021-07-12,000002,Vente,275200,,,LES VAUTOURS,B052,26160,26045,La Bégude-de-Mazenc,26,,,26045000ZM0274,,,,,,,,,,,,,0,,,,,S,sols,,,143,4.898108,44.547265
2021-363661,2021-08-03,000001,Vente,205000,115,B,GRANDE TUILERIE ET MANOTIE,B025,26160,26045,La Bégude-de-Mazenc,26,,,26045000ZK0099,,,,,,,,,,,,,0,1,Maison,67,3,T,terres,,,680,4.933934,44.542591
2021-363661,2021-08-03,000001,Vente,205000,115,B,GRANDE TUILERIE ET MANOTIE,B025,26160,26045,La Bégude-de-Mazenc,26,,,26045000ZK0099,,,,,,,,,,,,,0,1,Maison,67,3,S,sols,,,798,4.933934,44.542591
2021-363772,2021-08-24,000001,Vente,216150,75,,ALL DES PRELES,0068,26160,26045,La Bégude-de-Mazenc,26,,,26045000ZK0323,,,,,,,,,,,,,0,1,Maison,100,4,S,sols,,,331,4.929233,44.540867
2021-363772,2021-08-24,000001,Vente,216150,,,GRANDE TUILERIE ET MANOTIE,B025,26160,26045,La Bégude-de-Mazenc,26,,,26045000ZK0332,,,,,,,,,,,,,0,,,,,T,terres,,,274,4.929031,44.540903
2021-363912,2021-07-13,000002,Vente,15,,,FRILLAUT,B021,26160,26045,La Bégude-de-Mazenc,26,,,26045000ZL0342,,,,,,,,,,,,,0,,,,,S,sols,,,14,4.905672,44.54723
2021-363976,2021-08-03,000001,Vente,195000,140,,ALL DU COUCHANT,0069,26160,26045,La Bégude-de-Mazenc,26,,,26045000ZL0201,,,,,,,,,,,,,0,1,Maison,98,5,S,sols,,,959,4.921036,44.544413
2021-363991,2021-08-03,000001,Vente,41500,140,,ALL DU COUCHANT,0069,26160,26045,La Bégude-de-Mazenc,26,,,26045000ZL0201,,,,,,,,,,,,,0,1,Maison,98,5,S,sols,,,959,4.921036,44.544413
2021-364089,2021-09-01,000002,Vente,165000,,,BOULAGNE,B006,26160,26045,La Bégude-de-Mazenc,26,,,26045000ZL0104,,,,,,,,,,,,,0,,,,,T,terres,,,372,4.921649,44.546314
2021-364089,2021-09-01,000002,Vente,165000,,,BOULAGNE,B006,26160,26045,La Bégude-de-Mazenc,26,,,26045000ZL0344,,,,,,,,,,,,,0,,,,,T,terres,,,755,4.921967,44.546437
2021-364089,2021-09-01,000002,Vente,165000,,,BOULAGNE,B006,26160,26045,La Bégude-de-Mazenc,26,,,26045000ZL0345,,,,,,,,,,,,,0,,,,,T,terres,,,755,4.921782,44.546314
2021-364089,2021-09-01,000002,Vente,165000,,,BOULAGNE,B006,26160,26045,La Bégude-de-Mazenc,26,,,26045000ZL0346,,,,,,,,,,,,,0,,,,,T,terres,,,745,4.921895,44.546052
2021-364188,2021-08-31,000001,Vente,350000,400,,CHE DU MOULIN,0105,26160,26045,La Bégude-de-Mazenc,26,,,26045000ZL0221,,,,,,,,,,,,,0,1,Maison,156,5,S,sols,,,1500,4.920033,44.543722
2021-364992,2021-09-27,000001,Vente,591000,620,,GRANDE TUILERIE ET MANOTIE,B025,26160,26045,La Bégude-de-Mazenc,26,,,26045000ZK0148,,,,,,,,,,,,,0,4,Local industriel. commercial ou assimilé,182,0,S,sols,,,1260,4.927865,44.540934
2021-364992,2021-09-27,000001,Vente,591000,620,,GRANDE TUILERIE ET MANOTIE,B025,26160,26045,La Bégude-de-Mazenc,26,,,26045000ZK0148,,,,,,,,,,,,,0,1,Maison,94,4,S,sols,,,1260,4.927865,44.540934
2021-364992,2021-09-27,000001,Vente,591000,620,,GRANDE TUILERIE ET MANOTIE,B025,26160,26045,La Bégude-de-Mazenc,26,,,26045000ZK0148,,,,,,,,,,,,,0,4,Local industriel. commercial ou assimilé,182,0,T,terres,,,3610,4.927865,44.540934
2021-364992,2021-09-27,000001,Vente,591000,620,,GRANDE TUILERIE ET MANOTIE,B025,26160,26045,La Bégude-de-Mazenc,26,,,26045000ZK0148,,,,,,,,,,,,,0,1,Maison,94,4,T,terres,,,3610,4.927865,44.540934
2021-364992,2021-09-27,000001,Vente,591000,,,GRANDE TUILERIE ET MANOTIE,B025,26160,26045,La Bégude-de-Mazenc,26,,,26045000ZK0383,,,,,,,,,,,,,0,,,,,T,terres,,,2222,4.927766,44.541188
2021-364992,2021-09-27,000001,Vente,591000,,,GRANDE TUILERIE ET MANOTIE,B025,26160,26045,La Bégude-de-Mazenc,26,,,26045000ZK0384,,,,,,,,,,,,,0,,,,,T,terres,,,11748,4.927577,44.542174
2021-366269,2021-10-05,000001,Vente,125000,115,,RUE ARISTIDE BRIAND,0171,26160,26045,La Bégude-de-Mazenc,26,,,260450000H0758,,,8,,,,,,,,,,1,2,Appartement,62,3,,,,,,4.936938,44.545305
2021-366352,2021-10-21,000001,Vente,111000,235,,AV JEAN JAURES,0029,26160,26045,La Bégude-de-Mazenc,26,,,260450000H1489,,,2,73.04,,,,,,,,,1,2,Appartement,73,2,,,,,,4.9336,44.546611
2021-367093,2021-10-25,000001,Vente,442400,5100,F,LES VAUTOURS,B052,26160,26045,La Bégude-de-Mazenc,26,,,26045000ZM0187,,,,,,,,,,,,,0,3,Dépendance,,0,L,landes,PATUR,Pâture plantée,11460,4.897471,44.546412
2021-367093,2021-10-25,000001,Vente,442400,5100,F,LES VAUTOURS,B052,26160,26045,La Bégude-de-Mazenc,26,,,26045000ZM0187,,,,,,,,,,,,,0,2,Appartement,128,4,L,landes,PATUR,Pâture plantée,11460,4.897471,44.546412
2021-367093,2021-10-25,000001,Vente,442400,595,B,CHE DU JABELIN,0102,26160,26045,La Bégude-de-Mazenc,26,,,26045000ZM0188,,,,,,,,,,,,,0,,,,,S,sols,,,470,4.898268,44.546964
2021-367093,2021-10-25,000001,Vente,442400,595,A,CHE DU JABELIN,0102,26160,26045,La Bégude-de-Mazenc,26,,,26045000ZM0272,,,,,,,,,,,,,0,,,,,S,sols,,,96,4.898239,44.547107
2021-367093,2021-10-25,000001,Vente,442400,,,LES VAUTOURS,B052,26160,26045,La Bégude-de-Mazenc,26,,,26045000ZM0273,,,,,,,,,,,,,0,,,,,S,sols,,,267,4.898079,44.546964
2021-367170,2021-11-15,000001,Vente,890000,250,,CHE DE GRANGE ROUGE,0078,26160,26045,La Bégude-de-Mazenc,26,,,26045000ZP0084,,,,,,,,,,,,,0,3,Dépendance,,0,T,terres,,,2272,4.920317,44.556151
2021-367170,2021-11-15,000001,Vente,890000,250,,CHE DE GRANGE ROUGE,0078,26160,26045,La Bégude-de-Mazenc,26,,,26045000ZP0084,,,,,,,,,,,,,0,3,Dépendance,,0,S,sols,,,2400,4.920317,44.556151
2021-367170,2021-11-15,000001,Vente,890000,250,,CHE DE GRANGE ROUGE,0078,26160,26045,La Bégude-de-Mazenc,26,,,26045000ZP0084,,,,,,,,,,,,,0,1,Maison,338,8,S,sols,,,2400,4.920317,44.556151
2021-367170,2021-11-15,000001,Vente,890000,250,,CHE DE GRANGE ROUGE,0078,26160,26045,La Bégude-de-Mazenc,26,,,26045000ZP0084,,,,,,,,,,,,,0,1,Maison,338,8,T,terres,,,2272,4.920317,44.556151
2021-367500,2021-10-05,000002,Vente,190000,,,BLACHE BOUTEILLE,B005,26160,26045,La Bégude-de-Mazenc,26,,,26045000ZC0063,,,,,,,,,,,,,0,,,,,T,terres,,,5550,4.935161,44.574597
2021-367500,2021-10-05,000002,Vente,190000,,,BLACHE BOUTEILLE,B005,26160,26045,La Bégude-de-Mazenc,26,,,26045000ZC0064,,,,,,,,,,,,,0,,,,,L,landes,PATUR,Pâture plantée,400,4.934327,44.572606
2021-367500,2021-10-05,000002,Vente,190000,,,BLACHE BOUTEILLE,B005,26160,26045,La Bégude-de-Mazenc,26,,,26045000ZC0064,,,,,,,,,,,,,0,,,,,T,terres,,,24200,4.934327,44.572606
2021-367500,2021-10-05,000002,Vente,190000,,,BLACHE BOUTEILLE,B005,26160,26045,La Bégude-de-Mazenc,26,,,26045000ZC0105,,,,,,,,,,,,,0,,,,,T,terres,,,3649,4.933791,44.574881
2021-367500,2021-10-05,000002,Vente,190000,,,BLACHE BOUTEILLE,B005,26160,26045,La Bégude-de-Mazenc,26,,,26045000ZC0106,,,,,,,,,,,,,0,,,,,T,terres,,,4517,4.934848,44.575229
2021-367744,2021-11-29,000001,Vente,490000,,,SAINT MAURICE,B047,26160,26045,La Bégude-de-Mazenc,26,,,26045000ZB0144,,,,,,,,,,,,,0,,,,,S,sols,,,900,4.926976,44.573061
2021-367744,2021-11-29,000001,Vente,490000,,,SAINT MAURICE,B047,26160,26045,La Bégude-de-Mazenc,26,,,26045000ZB0147,,,,,,,,,,,,,0,,,,,S,sols,,,1087,4.926916,44.575032