id_mutation,date_mutation,numero_disposition,nature_mutation,valeur_fonciere,adresse_numero,adresse_suffixe,adresse_nom_voie,adresse_code_voie,code_postal,code_commune,nom_commune,code_departement,ancien_code_commune,ancien_nom_commune,id_parcelle,ancien_id_parcelle,numero_volume,lot1_numero,lot1_surface_carrez,lot2_numero,lot2_surface_carrez,lot3_numero,lot3_surface_carrez,lot4_numero,lot4_surface_carrez,lot5_numero,lot5_surface_carrez,nombre_lots,code_type_local,type_local,surface_reelle_bati,nombre_pieces_principales,code_nature_culture,nature_culture,code_nature_culture_speciale,nature_culture_speciale,surface_terrain,longitude,latitude
2021-356417,2021-02-22,000001,Vente,101000,36,,RLE LOU MAY,0161,26120,26100,Combovin,26,,,261000000A0479,,,,,,,,,,,,,0,1,Maison,60,3,S,sols,,,44,5.07861,44.873955
2021-356417,2021-02-22,000001,Vente,101000,,,LE VILLAGE,B103,26120,26100,Combovin,26,,,261000000A0782,,,,,,,,,,,,,0,,,,,S,sols,,,20,5.07857,44.873921
2021-356417,2021-02-22,000001,Vente,101000,,,LE VILLAGE,B103,26120,26100,Combovin,26,,,261000000A0783,,,,,,,,,,,,,0,,,,,S,sols,,,20,5.078616,44.873915
2021-357597,2021-03-15,000001,Vente,8500,,,SAINT GEORGES,B091,26120,26100,Combovin,26,,,261000000A0421,,,,,,,,,,,,,0,,,,,T,terres,,,2100,5.076238,44.873846
2021-358069,2021-03-29,000001,Vente,80000,,,BENOIT,B006,26120,26100,Combovin,26,,,261000000I0057,,,,,,,,,,,,,0,,,,,L,landes,PATUR,Pâture plantée,101070,5.12124,44.831106
2021-358069,2021-03-29,000001,Vente,80000,,,BENOIT,B006,26120,26100,Combovin,26,,,261000000I0058,,,,,,,,,,,,,0,,,,,P,prés,,,7200,5.119813,44.829878
2021-358069,2021-03-29,000001,Vente,80000,,,BENOIT,B006,26120,26100,Combovin,26,,,261000000I0059,,,,,,,,,,,,,0,,,,,L,landes,PATUR,Pâture plantée,52500,5.118444,44.829393
2021-358069,2021-03-29,000001,Vente,80000,,,BENOIT,B006,26120,26100,Combovin,26,,,261000000I0102,,,,,,,,,,,,,0,,,,,L,landes,PATUR,Pâture plantée,20000,5.123059,44.832019
2021-358362,2021-04-14,000001,Vente,116000,30,,RLE LOU MAY,0161,26120,26100,Combovin,26,,,261000000A0481,,,,,,,,,,,,,0,,,,,S,sols,,,72,5.078591,44.873871
2021-358362,2021-04-14,000001,Vente,116000,,,LE VILLAGE,B103,26120,26100,Combovin,26,,,261000000A0782,,,,,,,,,,,,,0,,,,,S,sols,,,20,5.07857,44.873921
2021-359569,2021-04-23,000001,Vente,252000,,,SAINT GEORGES,B091,26120,26100,Combovin,26,,,261000000A0441,,,,,,,,,,,,,0,,,,,S,sols,,,65,5.076198,44.874488
2021-359569,2021-04-23,000001,Vente,252000,105,,IMP DES CONDAMINES,0123,26120,26100,Combovin,26,,,261000000A0638,,,,,,,,,,,,,0,1,Maison,80,4,S,sols,,,747,5.076196,44.874701
2021-359569,2021-04-23,000001,Vente,252000,,,LES CONDAMINES,B027,26120,26100,Combovin,26,,,261000000A0689,,,,,,,,,,,,,0,,,,,S,sols,,,128,5.076402,44.87481
2021-361368,2021-06-08,000002,Vente,50880,,,LES DOUDONS,B035,26120,26100,Combovin,26,,,261000000D0690,,,,,,,,,,,,,0,,,,,T,terres,,,636,5.10254,44.877257
2021-361452,2021-06-11,000001,Vente,242000,35,,ALL DES CONDAMINES,0096,26120,26100,Combovin,26,,,261000000A0640,,,,,,,,,,,,,0,1,Maison,78,3,S,sols,,,764,5.076678,44.874457
2021-361935,2021-06-30,000001,Vente,165500,25,,RLE LE TROUILLAT,0145,26120,26100,Combovin,26,,,261000000A0293,,,,,,,,,,,,,0,3,Dépendance,,0,S,sols,,,75,5.079296,44.873761
2021-361935,2021-06-30,000001,Vente,165500,25,,RLE LE TROUILLAT,0145,26120,26100,Combovin,26,,,261000000A0293,,,,,,,,,,,,,0,1,Maison,40,1,S,sols,,,75,5.079296,44.873761
2021-364022,2021-08-25,000001,Vente,100,,,LE VILLAGE,B103,26120,26100,Combovin,26,,,261000000A0774,,,,,,,,,,,,,0,,,,,S,sols,,,10,5.081087,44.873411
2021-364024,2021-08-23,000002,Vente,1340,,,LES TAILLAS,B099,26120,26100,Combovin,26,,,261000000D0666,,,,,,,,,,,,,0,,,,,BT,taillis simples,,,50,5.083389,44.873156
2021-364024,2021-08-23,000002,Vente,1340,405,,RUE DE SANTON,0138,26120,26100,Combovin,26,,,261000000D0668,,,,,,,,,,,,,0,1,Maison,131,4,,,,,,5.083049,44.873151
2021-364024,2021-08-23,000002,Vente,1340,,,LES TAILLAS,B099,26120,26100,Combovin,26,,,261000000D0683,,,,,,,,,,,,,0,,,,,T,terres,,,12,5.083196,44.873135
2021-364226,2021-08-26,000002,Vente,218000,,,MORAT,B063,26120,26100,Combovin,26,,,261000000A0182,,,,,,,,,,,,,0,,,,,J,jardins,,,317,5.077307,44.877093
2021-364226,2021-08-26,000002,Vente,218000,,,MORAT,B063,26120,26100,Combovin,26,,,261000000A0704,,,,,,,,,,,,,0,,,,,S,sols,,,5,5.07725,44.87741
2021-364226,2021-08-26,000002,Vente,218000,40,,RTE DES CAIRES,0130,26120,26100,Combovin,26,,,261000000A0725,,,,,,,,,,,,,0,,,,,S,sols,,,154,5.077235,44.877392
2021-364226,2021-08-26,000002,Vente,218000,5075,,MORAT,B063,26120,26100,Combovin,26,,,261000000A0785,,,,,,,,,,,,,0,1,Maison,140,4,S,sols,,,6,5.07729,44.877458
2021-364226,2021-08-26,000002,Vente,218000,,,MORAT,B063,26120,26100,Combovin,26,,,261000000A0786,,,,,,,,,,,,,0,,,,,S,sols,,,6,5.077285,44.877471
2021-364262,2021-09-01,000001,Vente,357000,110,,RUE DES ROLLANDS,0140,26120,26100,Combovin,26,,,261000000A0626,,,,,,,,,,,,,0,1,Maison,134,5,S,sols,,,1000,5.078703,44.87179
2021-364349,2021-08-25,000001,Vente,1580,,,LES TAILLAS,B099,26120,26100,Combovin,26,,,261000000D0651,,,,,,,,,,,,,0,,,,,S,sols,,,158,5.081658,44.873327
2021-366714,2021-10-20,000001,Vente,296300,80,,RUE DES FRIOTS,0139,26120,26100,Combovin,26,,,261000000A0395,,,,,,,,,,,,,0,3,Dépendance,,0,S,sols,,,200,5.077344,44.873067
2021-366714,2021-10-20,000001,Vente,296300,80,,RUE DES FRIOTS,0139,26120,26100,Combovin,26,,,261000000A0395,,,,,,,,,,,,,0,1,Maison,80,5,S,sols,,,200,5.077344,44.873067
