id_mutation,date_mutation,numero_disposition,nature_mutation,valeur_fonciere,adresse_numero,adresse_suffixe,adresse_nom_voie,adresse_code_voie,code_postal,code_commune,nom_commune,code_departement,ancien_code_commune,ancien_nom_commune,id_parcelle,ancien_id_parcelle,numero_volume,lot1_numero,lot1_surface_carrez,lot2_numero,lot2_surface_carrez,lot3_numero,lot3_surface_carrez,lot4_numero,lot4_surface_carrez,lot5_numero,lot5_surface_carrez,nombre_lots,code_type_local,type_local,surface_reelle_bati,nombre_pieces_principales,code_nature_culture,nature_culture,code_nature_culture_speciale,nature_culture_speciale,surface_terrain,longitude,latitude
2021-356383,2021-02-15,000001,Vente,379400,3,,PL ANTOINE BERTHOLET,0010,26300,26173,Marches,26,,,261730000D0395,,,,,,,,,,,,,0,1,Maison,145,6,S,sols,,,213,5.107979,44.976518
2021-356383,2021-02-15,000001,Vente,379400,3,,PL ANTOINE BERTHOLET,0010,26300,26173,Marches,26,,,261730000D0395,,,,,,,,,,,,,0,3,Dépendance,,0,S,sols,,,213,5.107979,44.976518
2021-356383,2021-02-15,000001,Vente,379400,,,LE VILLAGE,B042,26300,26173,Marches,26,,,261730000D0396,,,,,,,,,,,,,0,,,,,S,sols,,,167,5.108067,44.976426
2021-356582,2021-02-26,000001,Vente,257100,538,,CHE DES PROMENEURS,0178,26300,26173,Marches,26,,,26173000ZD0076,,,,,,,,,,,,,0,1,Maison,54,2,S,sols,,,633,5.112185,44.981137
2021-356582,2021-02-26,000001,Vente,257100,538,,CHE DES PROMENEURS,0178,26300,26173,Marches,26,,,26173000ZD0076,,,,,,,,,,,,,0,1,Maison,54,2,T,terres,,,1500,5.112185,44.981137
2021-357235,2021-03-19,000001,Vente,304500,2,,TRA DE LA GRANDE OURSE,0110,26300,26173,Marches,26,,,26173000ZI0295,,,,,,,,,,,,,0,1,Maison,125,4,J,jardins,,,269,5.110292,44.974631
2021-357235,2021-03-19,000001,Vente,304500,2,,TRA DE LA GRANDE OURSE,0110,26300,26173,Marches,26,,,26173000ZI0295,,,,,,,,,,,,,0,1,Maison,125,4,S,sols,,,500,5.110292,44.974631
2021-357373,2021-03-08,000001,Vente,50000,,,LE PRE BRUN,B035,26300,26173,Marches,26,,,26173000ZM0038,,,,,,,,,,,,,0,,,,,T,terres,,,2483,5.103372,44.984007
2021-357373,2021-03-08,000001,Vente,50000,,,LE PRE BRUN,B035,26300,26173,Marches,26,,,26173000ZM0038,,,,,,,,,,,,,0,,,,,T,terres,,,4967,5.103372,44.984007
2021-357373,2021-03-08,000001,Vente,50000,,,LE PRE BRUN,B035,26300,26173,Marches,26,,,26173000ZM0070,,,,,,,,,,,,,0,,,,,T,terres,,,5295,5.102261,44.983138
2021-357373,2021-03-08,000001,Vente,50000,,,LE PRE BRUN,B035,26300,26173,Marches,26,,,26173000ZM0070,,,,,,,,,,,,,0,,,,,T,terres,,,2648,5.102261,44.983138
2021-357373,2021-03-08,000001,Vente,50000,,,LE PRE BRUN,B035,26300,26173,Marches,26,,,26173000ZM0073,,,,,,,,,,,,,0,,,,,T,terres,,,195,5.103439,44.984284
2021-357373,2021-03-08,000001,Vente,50000,,,LE PRE BRUN,B035,26300,26173,Marches,26,,,26173000ZM0073,,,,,,,,,,,,,0,,,,,T,terres,,,390,5.103439,44.984284
2021-357373,2021-03-08,000001,Vente,50000,,,LE PRE BRUN,B035,26300,26173,Marches,26,,,26173000ZM0114,,,,,,,,,,,,,0,,,,,T,terres,,,3980,5.103987,44.983699
2021-357373,2021-03-08,000001,Vente,50000,,,LE PRE BRUN,B035,26300,26173,Marches,26,,,26173000ZM0114,,,,,,,,,,,,,0,,,,,VE,vergers,POIRE,Poiriers,3935,5.103987,44.983699
2021-357373,2021-03-08,000001,Vente,50000,,,LE PRE BRUN,B035,26300,26173,Marches,26,,,26173000ZM0114,,,,,,,,,,,,,0,,,,,VI,vignes,,,1157,5.103987,44.983699
2021-357373,2021-03-08,000001,Vente,50000,,,LE PRE BRUN,B035,26300,26173,Marches,26,,,26173000ZM0115,,,,,,,,,,,,,0,,,,,T,terres,,,4347,5.103912,44.98248
2021-357373,2021-03-08,000001,Vente,50000,,,LE PRE BRUN,B035,26300,26173,Marches,26,,,26173000ZM0115,,,,,,,,,,,,,0,,,,,T,terres,,,8695,5.103912,44.98248
2021-357373,2021-03-08,000001,Vente,50000,,,LE PRE BRUN,B035,26300,26173,Marches,26,,,26173000ZM0115,,,,,,,,,,,,,0,,,,,T,terres,,,4348,5.103912,44.98248
2021-357462,2021-03-16,000001,Vente,409.5,,,LE PRE BRUN,B035,26300,26173,Marches,26,,,26173000ZM0072,,,,,,,,,,,,,0,,,,,T,terres,,,390,5.101378,44.984026
2021-357462,2021-03-16,000001,Vente,409.5,,,LE PRE BRUN,B035,26300,26173,Marches,26,,,26173000ZM0072,,,,,,,,,,,,,0,,,,,T,terres,,,195,5.101378,44.984026
2021-357735,2021-03-23,000001,Vente,9300,,,LES ROUTES,B039,26300,26173,Marches,26,,,26173000ZL0040,,,,,,,,,,,,,0,,,,,T,terres,,,5812,5.091977,44.975945
2021-357735,2021-03-23,000001,Vente,9300,,,LES ROUTES,B039,26300,26173,Marches,26,,,26173000ZL0040,,,,,,,,,,,,,0,,,,,T,terres,,,5813,5.091977,44.975945
2021-359078,2021-05-10,000001,Vente,3000,,,LA BAYANNE,B003,26300,26173,Marches,26,,,26173000ZL0096,,,,,,,,,,,,,0,,,,,T,terres,,,2635,5.096432,44.969849
2021-359078,2021-05-10,000001,Vente,3000,,,LA BAYANNE,B003,26300,26173,Marches,26,,,26173000ZL0096,,,,,,,,,,,,,0,,,,,T,terres,,,2635,5.096432,44.969849
2021-359536,2021-05-18,000001,Vente,291555,62,,CHE DU ROCHER DE SABLE,0205,26300,26173,Marches,26,,,26173000ZI0354,,,,,,,,,,,,,0,1,Maison,140,2,S,sols,,,1030,5.105482,44.976773
2021-359632,2021-05-20,000001,Vente,350000,56,,RUE DES BATISSEURS,0025,26300,26173,Marches,26,,,26173000ZC0115,,,,,,,,,,,,,0,1,Maison,150,5,S,sols,,,1000,5.104863,44.989037
2021-359632,2021-05-20,000001,Vente,350000,56,,RUE DES BATISSEURS,0025,26300,26173,Marches,26,,,26173000ZC0115,,,,,,,,,,,,,0,1,Maison,150,5,T,terres,,,1924,5.104863,44.989037
2021-359632,2021-05-20,000001,Vente,350000,56,,RUE DES BATISSEURS,0025,26300,26173,Marches,26,,,26173000ZC0115,,,,,,,,,,,,,0,1,Maison,150,5,T,terres,,,1925,5.104863,44.989037
2021-359645,2021-05-18,000001,Vente,274330,4,,ALL DES ETOILES,0088,26300,26173,Marches,26,,,261730000D0421,,,,,,,,,,,,,0,1,Maison,87,4,S,sols,,,843,5.107768,44.976837
2021-359655,2021-05-17,000001,Vente,100000,,,FONT-CHATOUX,B021,26300,26173,Marches,26,,,26173000ZD0094,,,,,,,,,,,,,0,,,,,S,sols,,,1143,5.122662,44.977354
2021-359898,2021-05-13,000001,Vente,,,,LE VILLAGE-SUD,B044,26300,26173,Marches,26,,,26173000ZI0298,,,,,,,,,,,,,0,,,,,S,sols,,,62,5.110416,44.974663
2021-359898,2021-05-13,000001,Vente,,,,LE VILLAGE-SUD,B044,26300,26173,Marches,26,,,26173000ZI0301,,,,,,,,,,,,,0,,,,,S,sols,,,150,5.110545,44.974522
2021-359898,2021-05-13,000001,Vente,,,,LE VILLAGE-SUD,B044,26300,26173,Marches,26,,,26173000ZI0306,,,,,,,,,,,,,0,,,,,S,sols,,,149,5.110698,44.974406
2021-361004,2021-06-30,000001,Vente,10000,,,LA GARE,B022,26300,26173,Marches,26,,,26173000ZM0152,,,,,,,,,,,,,0,,,,,T,terres,,,2391,5.10355,44.987901
2021-361004,2021-06-30,000001,Vente,10000,,,LA GARE,B022,26300,26173,Marches,26,,,26173000ZM0152,,,,,,,,,,,,,0,,,,,T,terres,,,2392,5.10355,44.987901
2021-361198,2021-06-11,000001,Vente,77900,34,,CHE DES HERONS,0116,26300,26173,Marches,26,,,26173000ZH0088,,,,,,,,,,,,,0,1,Maison,97,2,S,sols,,,500,5.122473,44.966469
2021-361198,2021-06-11,000001,Vente,77900,34,,CHE DES HERONS,0116,26300,26173,Marches,26,,,26173000ZH0088,,,,,,,,,,,,,0,3,Dépendance,,0,S,sols,,,500,5.122473,44.966469
2021-361198,2021-06-11,000001,Vente,77900,34,,CHE DES HERONS,0116,26300,26173,Marches,26,,,26173000ZH0088,,,,,,,,,,,,,0,3,Dépendance,,0,T,terres,,,1536,5.122473,44.966469
2021-361198,2021-06-11,000001,Vente,77900,34,,CHE DES HERONS,0116,26300,26173,Marches,26,,,26173000ZH0088,,,,,,,,,,,,,0,1,Maison,97,2,T,terres,,,1536,5.122473,44.966469
2021-361198,2021-06-11,000001,Vente,77900,,,BEAULIEU,B004,26300,26173,Marches,26,,,26173000ZH0093,,,,,,,,,,,,,0,,,,,S,sols,,,19,5.122404,44.966594
2021-361482,2021-06-23,000001,Vente,214000,6,,ALL DES PLEIADES,0166,26300,26173,Marches,26,,,26173000ZI0172,,,,,,,,,,,,,0,3,Dépendance,,0,S,sols,,,963,5.107398,44.975425
2021-361482,2021-06-23,000001,Vente,214000,6,,ALL DES PLEIADES,0166,26300,26173,Marches,26,,,26173000ZI0172,,,,,,,,,,,,,0,1,Maison,91,3,S,sols,,,963,5.107398,44.975425
2021-361521,2021-07-06,000001,Vente,274800,5,,TRA DU SOLEIL,0231,26300,26173,Marches,26,,,26173000ZI0369,,,,,,,,,,,,,0,1,Maison,126,5,S,sols,,,842,5.10329,44.975162
2021-362794,2021-07-12,000001,Vente,9000,,,LES VALETS,B041,26300,26173,Marches,26,,,26173000ZE0084,,,,,,,,,,,,,0,,,,,L,landes,PATUR,Pâture plantée,1673,5.135906,44.973674
2021-362794,2021-07-12,000001,Vente,9000,,,LES VALETS,B041,26300,26173,Marches,26,,,26173000ZE0084,,,,,,,,,,,,,0,,,,,T,terres,,,698,5.135906,44.973674
2021-362794,2021-07-12,000001,Vente,9000,,,LES VALETS,B041,26300,26173,Marches,26,,,26173000ZE0084,,,,,,,,,,,,,0,,,,,T,terres,,,698,5.135906,44.973674
2021-362794,2021-07-12,000001,Vente,9000,,,LES VALETS,B041,26300,26173,Marches,26,,,26173000ZE0084,,,,,,,,,,,,,0,,,,,T,terres,,,698,5.135906,44.973674
2021-362794,2021-07-12,000001,Vente,9000,,,LES VALETS,B041,26300,26173,Marches,26,,,26173000ZE0084,,,,,,,,,,,,,0,,,,,P,prés,,,4938,5.135906,44.973674
2021-365987,2021-10-04,000001,Vente,20000,,,LE BOIS DES VIGNES,B008,26300,26173,Marches,26,,,26173000ZI0481,,,,,,,,,,,,,0,,,,,S,sols,,,1931,5.102473,44.979589
2021-366321,2021-10-29,000001,Vente,1800,,,CONTON-NORD,B018,26300,26173,Marches,26,,,26173000ZM0169,,,,,,,,,,,,,0,,,,,T,terres,,,3876,5.098809,44.976932
2021-369192,2021-11-25,000002,Vente,1000,9999,,LA GARE,B022,26300,26173,Marches,26,,,26173000ZM0226,,,,,,,,,,,,,0,4,Local industriel. commercial ou assimilé,,0,T,terres,,,257,5.102106,44.989502
