id_mutation,date_mutation,numero_disposition,nature_mutation,valeur_fonciere,adresse_numero,adresse_suffixe,adresse_nom_voie,adresse_code_voie,code_postal,code_commune,nom_commune,code_departement,ancien_code_commune,ancien_nom_commune,id_parcelle,ancien_id_parcelle,numero_volume,lot1_numero,lot1_surface_carrez,lot2_numero,lot2_surface_carrez,lot3_numero,lot3_surface_carrez,lot4_numero,lot4_surface_carrez,lot5_numero,lot5_surface_carrez,nombre_lots,code_type_local,type_local,surface_reelle_bati,nombre_pieces_principales,code_nature_culture,nature_culture,code_nature_culture_speciale,nature_culture_speciale,surface_terrain,longitude,latitude
2021-356667,2021-02-10,000002,Vente,108000,80,D,RUE DE LA DROME,0087,26400,26183,Mirabel-et-Blacons,26,,,26183000AE0006,,,,,,,,,,,,,0,1,Maison,30,2,S,sols,,,26,5.084184,44.711853
2021-356667,2021-02-10,000002,Vente,108000,,,BELLEVUE,B004,26400,26183,Mirabel-et-Blacons,26,,,26183000AE0503,,,,,,,,,,,,,0,,,,,S,sols,,,75,5.08422,44.711854
2021-357332,2021-03-02,000002,Vente,1000,,,DUROND,B018,26400,26183,Mirabel-et-Blacons,26,,,26183000AB0540,,,,,,,,,,,,,0,,,,,J,jardins,,,53,5.103394,44.725149
2021-357332,2021-03-02,000002,Vente,1000,,,DUROND,B018,26400,26183,Mirabel-et-Blacons,26,,,26183000AB0543,,,,,,,,,,,,,0,,,,,T,terres,,,720,5.103382,44.725211
2021-357390,2021-03-03,000001,Vente,84500,,,BELLEVUE,B004,26400,26183,Mirabel-et-Blacons,26,,,26183000AE0463,,,,,,,,,,,,,0,,,,,T,terres,,,800,5.085098,44.711927
2021-357896,2021-02-25,000002,Vente,75000,,,LE MOULIN,B028,26400,26183,Mirabel-et-Blacons,26,,,26183000AH0438,,,,,,,,,,,,,0,,,,,T,terres,,,44,5.092217,44.712903
2021-357896,2021-02-25,000002,Vente,75000,,,LE MOULIN,B028,26400,26183,Mirabel-et-Blacons,26,,,26183000AH0440,,,,,,,,,,,,,0,,,,,T,terres,,,65,5.091866,44.712854
2021-357896,2021-02-25,000002,Vente,75000,,,LE MOULIN,B028,26400,26183,Mirabel-et-Blacons,26,,,26183000AH0441,,,,,,,,,,,,,0,,,,,T,terres,,,384,5.092023,44.712819
2021-357896,2021-02-25,000002,Vente,75000,,,LE MOULIN,B028,26400,26183,Mirabel-et-Blacons,26,,,26183000AH0443,,,,,,,,,,,,,0,,,,,T,terres,,,36,5.091883,44.712963
2021-357896,2021-02-25,000002,Vente,75000,,,LE MOULIN,B028,26400,26183,Mirabel-et-Blacons,26,,,26183000AH0444,,,,,,,,,,,,,0,,,,,T,terres,,,222,5.092102,44.712929
2021-357909,2021-03-19,000001,Vente,270000,,,SERRE MEANT,B050,26400,26183,Mirabel-et-Blacons,26,,,26183000AB0343,,,,,,,,,,,,,0,,,,,VE,vergers,,,100,5.106619,44.728439
2021-357909,2021-03-19,000001,Vente,270000,95,,IMP DU VEYLAN,0066,26400,26183,Mirabel-et-Blacons,26,,,26183000AB0346,,,,,,,,,,,,,0,1,Maison,75,3,VI,vignes,,,400,5.106693,44.728366
2021-357909,2021-03-19,000001,Vente,270000,,,SERRE MEANT,B050,26400,26183,Mirabel-et-Blacons,26,,,26183000AB0349,,,,,,,,,,,,,0,,,,,T,terres,,,1207,5.106784,44.728098
2021-358113,2021-03-25,000002,Vente,22000,,,SAUZET,B043,26400,26183,Mirabel-et-Blacons,26,,,261830000D0110,,,,,,,,,,,,,0,,,,,BT,taillis simples,,,7060,5.153819,44.717049
2021-358113,2021-03-25,000002,Vente,22000,,,SAUZET,B043,26400,26183,Mirabel-et-Blacons,26,,,261830000D0111,,,,,,,,,,,,,0,,,,,T,terres,,,1020,5.153097,44.716722
2021-358113,2021-03-25,000002,Vente,22000,,,SAUZET,B043,26400,26183,Mirabel-et-Blacons,26,,,261830000D0112,,,,,,,,,,,,,0,,,,,T,terres,,,3560,5.152967,44.716212
2021-358113,2021-03-25,000002,Vente,22000,,,SAUZET,B043,26400,26183,Mirabel-et-Blacons,26,,,261830000D0113,,,,,,,,,,,,,0,,,,,BT,taillis simples,,,3672,5.152527,44.715983
2021-358113,2021-03-25,000002,Vente,22000,,,SAUZET,B043,26400,26183,Mirabel-et-Blacons,26,,,261830000D0114,,,,,,,,,,,,,0,,,,,S,sols,,,28,5.152123,44.715629
2021-358113,2021-03-25,000002,Vente,22000,,,SAUZET,B043,26400,26183,Mirabel-et-Blacons,26,,,261830000D0115,,,,,,,,,,,,,0,,,,,BT,taillis simples,,,10200,5.153422,44.716099
2021-358113,2021-03-25,000002,Vente,22000,,,SAUZET,B043,26400,26183,Mirabel-et-Blacons,26,,,261830000D0135,,,,,,,,,,,,,0,,,,,L,landes,PACAG,Pacage,3060,5.156637,44.713042
2021-358113,2021-03-25,000002,Vente,22000,,,SAUZET,B043,26400,26183,Mirabel-et-Blacons,26,,,261830000D0137,,3,,,,,,,,,,,0,,,,,,,,,,5.156427,44.713524
2021-358113,2021-03-25,000002,Vente,22000,,,SAUZET,B043,26400,26183,Mirabel-et-Blacons,26,,,261830000D0139,,,,,,,,,,,,,0,,,,,T,terres,,,11370,5.154511,44.713672
2021-358113,2021-03-25,000002,Vente,22000,,,SAUZET,B043,26400,26183,Mirabel-et-Blacons,26,,,261830000D0141,,,,,,,,,,,,,0,,,,,T,terres,,,3328,5.155957,44.716219
2021-358113,2021-03-25,000002,Vente,22000,,,SAUZET,B043,26400,26183,Mirabel-et-Blacons,26,,,261830000D0145,,,,,,,,,,,,,0,,,,,L,landes,PACAG,Pacage,424,5.157961,44.716599
2021-358113,2021-03-25,000002,Vente,22000,,,SERRE DES TROIS BORNES,B048,26400,26183,Mirabel-et-Blacons,26,,,261830000D0172,,,,,,,,,,,,,0,,,,,L,landes,PACAG,Pacage,11800,5.160728,44.717351
2021-358113,2021-03-25,000002,Vente,22000,,,SERRE DES TROIS BORNES,B048,26400,26183,Mirabel-et-Blacons,26,,,261830000D0173,,,,,,,,,,,,,0,,,,,T,terres,,,11140,5.161437,44.717455
2021-358113,2021-03-25,000002,Vente,22000,,,SAUZET,B043,26400,26183,Mirabel-et-Blacons,26,,,261830000D0388,,,,,,,,,,,,,0,,,,,T,terres,,,809,5.15695,44.712777
2021-358113,2021-03-25,000002,Vente,22000,,,SAUZET,B043,26400,26183,Mirabel-et-Blacons,26,,,261830000D0390,,,,,,,,,,,,,0,,,,,L,landes,PACAG,Pacage,72641,5.15746,44.714957
2021-358113,2021-03-25,000002,Vente,22000,,,SAUZET,B043,26400,26183,Mirabel-et-Blacons,26,,,261830000D0393,,,,,,,,,,,,,0,,,,,T,terres,,,699,5.156651,44.712258
2021-358113,2021-03-25,000002,Vente,22000,,,SAUZET,B043,26400,26183,Mirabel-et-Blacons,26,,,261830000D0395,,,,,,,,,,,,,0,,,,,T,terres,,,7632,5.156085,44.71258
2021-358989,2021-04-20,000001,Vente,235000,115,O,RUE DE SOMME LONGE,0073,26400,26183,Mirabel-et-Blacons,26,,,26183000AD0529,,,,,,,,,,,,,0,1,Maison,90,4,S,sols,,,802,5.088761,44.7169
2021-358989,2021-04-20,000001,Vente,235000,115,O,RUE DE SOMME LONGE,0073,26400,26183,Mirabel-et-Blacons,26,,,26183000AD0529,,,,,,,,,,,,,0,3,Dépendance,,0,S,sols,,,802,5.088761,44.7169
2021-359819,2021-05-11,000001,Vente,1,,,PLAINE DE BLACONS,B035,26400,26183,Mirabel-et-Blacons,26,,,26183000AH0175,,,,,,,,,,,,,0,,,,,E,eaux,CANAL,Canal,578,5.090917,44.708419
2021-360040,2021-05-25,000001,Vente,271000,115,H,RUE DE SOMME LONGE,0073,26400,26183,Mirabel-et-Blacons,26,,,26183000AD0524,,,,,,,,,,,,,0,1,Maison,96,4,S,sols,,,803,5.08951,44.716832
2021-360040,2021-05-25,000001,Vente,271000,115,H,RUE DE SOMME LONGE,0073,26400,26183,Mirabel-et-Blacons,26,,,26183000AD0524,,,,,,,,,,,,,0,3,Dépendance,,0,S,sols,,,803,5.08951,44.716832
2021-360777,2021-06-12,000001,Echange,120000,,,SOMME LONGE SUD,B055,26400,26183,Mirabel-et-Blacons,26,,,26183000AD0094,,,,,,,,,,,,,0,,,,,P,prés,,,1780,5.087507,44.714791
2021-360777,2021-06-12,000001,Echange,120000,315,,AV DU VERCORS,0009,26400,26183,Mirabel-et-Blacons,26,,,26183000AD0095,,,,,,,,,,,,,0,1,Maison,84,4,S,sols,,,570,5.087712,44.714561
2021-360777,2021-06-12,000001,Echange,120000,,,SOMME LONGE SUD,B055,26400,26183,Mirabel-et-Blacons,26,,,26183000AD0097,,,,,,,,,,,,,0,,,,,J,jardins,,,480,5.087468,44.714604
2021-360777,2021-06-12,000001,Echange,120000,,,SOMME LONGE SUD,B055,26400,26183,Mirabel-et-Blacons,26,,,26183000AD0098,,,,,,,,,,,,,0,,,,,VI,vignes,,,864,5.087285,44.714709
2021-360777,2021-06-12,000001,Echange,120000,,,SOMME LONGE SUD,B055,26400,26183,Mirabel-et-Blacons,26,,,26183000AD0099,,,,,,,,,,,,,0,,,,,BT,taillis simples,,,540,5.087051,44.714899
2021-360777,2021-06-12,000001,Echange,120000,,,SOMME LONGE SUD,B055,26400,26183,Mirabel-et-Blacons,26,,,26183000AD0506,,,,,,,,,,,,,0,,,,,P,prés,,,1,5.087461,44.714403
2021-360777,2021-06-12,000001,Echange,120000,,,SOMME LONGE SUD,B055,26400,26183,Mirabel-et-Blacons,26,,,26183000AD0507,,,,,,,,,,,,,0,,,,,P,prés,,,1089,5.087785,44.714379
2021-361093,2021-06-04,000001,Vente,263700,,,PLAINE DE BLACONS,B035,26400,26183,Mirabel-et-Blacons,26,,,26183000AH0212,,,,,,,,,,,,,0,,,,,T,terres,,,1004,5.090265,44.708149
2021-361093,2021-06-04,000001,Vente,263700,215,,AV DE LA GARE,0005,26400,26183,Mirabel-et-Blacons,26,,,26183000AH0213,,,,,,,,,,,,,0,1,Maison,208,7,P,prés,,,5400,5.090958,44.708036
2021-361093,2021-06-04,000001,Vente,263700,215,,AV DE LA GARE,0005,26400,26183,Mirabel-et-Blacons,26,,,26183000AH0213,,,,,,,,,,,,,0,3,Dépendance,,0,S,sols,,,836,5.090958,44.708036
2021-361093,2021-06-04,000001,Vente,263700,215,,AV DE LA GARE,0005,26400,26183,Mirabel-et-Blacons,26,,,26183000AH0213,,,,,,,,,,,,,0,1,Maison,208,7,S,sols,,,836,5.090958,44.708036
2021-361093,2021-06-04,000001,Vente,263700,215,,AV DE LA GARE,0005,26400,26183,Mirabel-et-Blacons,26,,,26183000AH0213,,,,,,,,,,,,,0,3,Dépendance,,0,P,prés,,,5400,5.090958,44.708036
2021-361093,2021-06-04,000001,Vente,263700,,,PLAINE DE BLACONS,B035,26400,26183,Mirabel-et-Blacons,26,,,26183000AH0214,,,,,,,,,,,,,0,,,,,BT,taillis simples,,,3078,5.090613,44.707697
2021-361093,2021-06-04,000001,Vente,263700,,,PLAINE DE BLACONS,B035,26400,26183,Mirabel-et-Blacons,26,,,26183000AH0215,,,,,,,,,,,,,0,,,,,BT,taillis simples,,,242,5.090104,44.707811
2021-362750,2021-07-26,000001,Vente,228500,,,BELLEVUE,B004,26400,26183,Mirabel-et-Blacons,26,,,26183000AE0192,,,,,,,,,,,,,0,,,,,L,landes,PACAG,Pacage,5,5.085376,44.711802
2021-362750,2021-07-26,000001,Vente,228500,,,BELLEVUE,B004,26400,26183,Mirabel-et-Blacons,26,,,26183000AE0193,,,,,,,,,,,,,0,,,,,T,terres,,,219,5.084978,44.711774
2021-362750,2021-07-26,000001,Vente,228500,65,B,CHE DES BIALEIRES,0025,26400,26183,Mirabel-et-Blacons,26,,,26183000AE0194,,,,,,,,,,,,,0,2,Appartement,60,4,S,sols,,,159,5.085367,44.711729
2021-362750,2021-07-26,000001,Vente,228500,65,B,CHE DES BIALEIRES,0025,26400,26183,Mirabel-et-Blacons,26,,,26183000AE0194,,,,,,,,,,,,,0,2,Appartement,40,2,S,sols,,,159,5.085367,44.711729
2021-362750,2021-07-26,000001,Vente,228500,65,B,CHE DES BIALEIRES,0025,26400,26183,Mirabel-et-Blacons,26,,,26183000AE0194,,,,,,,,,,,,,0,3,Dépendance,,0,S,sols,,,159,5.085367,44.711729
2021-364225,2021-08-24,000001,Vente,286232,115,N,RUE DE SOMME LONGE,0073,26400,26183,Mirabel-et-Blacons,26,,,26183000AD0530,,,,,,,,,,,,,0,1,Maison,103,4,S,sols,,,464,5.088533,44.717052
2021-364225,2021-08-24,000001,Vente,286232,,,SOMME LONGE SUD,B055,26400,26183,Mirabel-et-Blacons,26,,,26183000AD0537,,,,,,,,,,,,,0,,,,,S,sols,,,338,5.088387,44.71707
2021-364481,2021-09-03,000001,Vente,1500,,,SANS SOUCI,B042,26400,26183,Mirabel-et-Blacons,26,,,261830000E0175,,,,,,,,,,,,,0,,,,,L,landes,PACAG,Pacage,6272,5.125961,44.710427
2021-364502,2021-09-15,000001,Vente,490000,,,BELLEVUE,B004,26400,26183,Mirabel-et-Blacons,26,,,26183000AE0091,,,,,,,,,,,,,0,,,,,J,jardins,,,214,5.086311,44.712309
2021-364502,2021-09-15,000001,Vente,490000,865,,AV DES TROIS BECS,0007,26400,26183,Mirabel-et-Blacons,26,,,26183000AE0092,,,,,,,,,,,,,0,1,Maison,155,5,S,sols,,,670,5.086548,44.712233
2021-364502,2021-09-15,000001,Vente,490000,865,,AV DES TROIS BECS,0007,26400,26183,Mirabel-et-Blacons,26,,,26183000AE0092,,,,,,,,,,,,,0,3,Dépendance,,0,S,sols,,,670,5.086548,44.712233
2021-364502,2021-09-15,000001,Vente,490000,865,,AV DES TROIS BECS,0007,26400,26183,Mirabel-et-Blacons,26,,,26183000AE0092,,,,,,,,,,,,,0,3,Dépendance,,0,S,sols,,,670,5.086548,44.712233
2021-364502,2021-09-15,000001,Vente,490000,,,BELLEVUE,B004,26400,26183,Mirabel-et-Blacons,26,,,26183000AE0493,,,,,,,,,,,,,0,,,,,S,sols,,,754,5.08661,44.712449
2021-364848,2021-09-07,000001,Vente,352500,345,,IMP DE LA PLAINE,0042,26400,26183,Mirabel-et-Blacons,26,,,26183000AH0283,,,,,,,,,,,,,0,1,Maison,125,5,T,terres,,,1500,5.101545,44.708724
2021-364848,2021-09-07,000001,Vente,352500,345,,IMP DE LA PLAINE,0042,26400,26183,Mirabel-et-Blacons,26,,,26183000AH0283,,,,,,,,,,,,,0,1,Maison,125,5,S,sols,,,500,5.101545,44.708724
2021-366559,2021-11-03,000001,Vente,532095,5437,,CHARSAC,B013,26400,26183,Mirabel-et-Blacons,26,,,26183000AI0192,,,,,,,,,,,,,0,3,Dépendance,,0,S,sols,,,800,5.109696,44.706743
2021-366559,2021-11-03,000001,Vente,532095,5437,,CHARSAC,B013,26400,26183,Mirabel-et-Blacons,26,,,26183000AI0192,,,,,,,,,,,,,0,3,Dépendance,,0,VI,vignes,,,908,5.109696,44.706743
2021-366559,2021-11-03,000001,Vente,532095,5437,,CHARSAC,B013,26400,26183,Mirabel-et-Blacons,26,,,26183000AI0192,,,,,,,,,,,,,0,3,Dépendance,,0,VI,vignes,,,908,5.109696,44.706743
2021-366559,2021-11-03,000001,Vente,532095,5437,,CHARSAC,B013,26400,26183,Mirabel-et-Blacons,26,,,26183000AI0192,,,,,,,,,,,,,0,3,Dépendance,,0,S,sols,,,800,5.109696,44.706743
2021-366559,2021-11-03,000001,Vente,532095,190,,CHE NODON,0018,26400,26183,Mirabel-et-Blacons,26,,,26183000AI0258,,,,,,,,,,,,,0,1,Maison,161,4,T,terres,,,2000,5.109133,44.706445
2021-366559,2021-11-03,000001,Vente,532095,190,,CHE NODON,0018,26400,26183,Mirabel-et-Blacons,26,,,26183000AI0258,,,,,,,,,,,,,0,1,Maison,161,4,S,sols,,,310,5.109133,44.706445
2021-366559,2021-11-03,000001,Vente,532095,,,CHARSAC,B013,26400,26183,Mirabel-et-Blacons,26,,,26183000AI0260,,,,,,,,,,,,,0,,,,,L,landes,PACAG,Pacage,190,5.1086,44.706282
2021-366741,2021-10-19,000001,Vente,270000,,,SOMME LONGE SUD,B055,26400,26183,Mirabel-et-Blacons,26,,,26183000AD0307,,,,,,,,,,,,,0,,,,,AB,terrains a bâtir,,,7623,,
2021-366889,2021-10-07,000002,Vente,112000,,,NICHON,B030,26400,26183,Mirabel-et-Blacons,26,,,261830000E0113,,,,,,,,,,,,,0,,,,,P,prés,,,3450,5.12257,44.702844
2021-366889,2021-10-07,000002,Vente,112000,,,NICHON,B030,26400,26183,Mirabel-et-Blacons,26,,,261830000E0114,,,,,,,,,,,,,0,,,,,T,terres,,,4900,5.123436,44.702489
2021-366889,2021-10-07,000002,Vente,112000,,,NICHON,B030,26400,26183,Mirabel-et-Blacons,26,,,261830000E0118,,,,,,,,,,,,,0,,,,,BR,futaies résineuses,PIN,Pins,2250,5.121034,44.703862
2021-366889,2021-10-07,000002,Vente,112000,,,NICHON,B030,26400,26183,Mirabel-et-Blacons,26,,,261830000E0119,,,,,,,,,,,,,0,,,,,P,prés,,,3450,5.121253,44.703513
2021-366889,2021-10-07,000002,Vente,112000,,,NICHON,B030,26400,26183,Mirabel-et-Blacons,26,,,261830000E0262,,,,,,,,,,,,,0,,,,,T,terres,,,4050,5.120946,44.701812
2021-366889,2021-10-07,000002,Vente,112000,,,NICHON,B030,26400,26183,Mirabel-et-Blacons,26,,,261830000E0262,,,,,,,,,,,,,0,,,,,T,terres,,,6836,5.120946,44.701812
2021-366889,2021-10-07,000002,Vente,112000,,,NICHON,B030,26400,26183,Mirabel-et-Blacons,26,,,261830000E0262,,,,,,,,,,,,,0,,,,,BT,taillis simples,,,1600,5.120946,44.701812
2021-366889,2021-10-07,000002,Vente,112000,945,A,RTE DU DIOIS,0086,26400,26183,Mirabel-et-Blacons,26,,,261830000E0266,,,,,,,,,,,,,0,4,Local industriel. commercial ou assimilé,2336,0,BR,futaies résineuses,PIN,Pins,4000,5.122058,44.699282
2021-366889,2021-10-07,000002,Vente,112000,945,A,RTE DU DIOIS,0086,26400,26183,Mirabel-et-Blacons,26,,,261830000E0266,,,,,,,,,,,,,0,4,Local industriel. commercial ou assimilé,2336,0,T,terres,,,54186,5.122058,44.699282
2021-366889,2021-10-07,000002,Vente,112000,945,A,RTE DU DIOIS,0086,26400,26183,Mirabel-et-Blacons,26,,,261830000E0266,,,,,,,,,,,,,0,4,Local industriel. commercial ou assimilé,2336,0,L,landes,PACAG,Pacage,2300,5.122058,44.699282
2021-366889,2021-10-07,000002,Vente,112000,,,NICHON,B030,26400,26183,Mirabel-et-Blacons,26,,,261830000E0318,,,,,,,,,,,,,0,,,,,T,terres,,,9921,5.120832,44.703067
2021-366889,2021-10-07,000002,Vente,112000,,,NICHON,B030,26400,26183,Mirabel-et-Blacons,26,,,261830000E0320,,,,,,,,,,,,,0,,,,,T,terres,,,20786,5.122349,44.7022
2021-366889,2021-10-07,000002,Vente,112000,,,NICHON,B030,26400,26183,Mirabel-et-Blacons,26,,,261830000E0322,,,,,,,,,,,,,0,,,,,T,terres,,,33076,5.124909,44.701552
2021-366889,2021-10-07,000002,Vente,112000,,,NICHON,B030,26400,26183,Mirabel-et-Blacons,26,,,261830000E0352,,,,,,,,,,,,,0,,,,,S,sols,,,106,5.12157,44.703561
2021-367138,2021-11-08,000001,Vente,54000,5278,A,BRAMEFAIM,B008,26400,26183,Mirabel-et-Blacons,26,,,26183000AI0153,,,,,,,,,,,,,0,3,Dépendance,,0,S,sols,,,45,5.113382,44.707663
2021-367138,2021-11-08,000001,Vente,54000,,,BRAMEFAIM,B008,26400,26183,Mirabel-et-Blacons,26,,,26183000AI0375,,,,,,,,,,,,,0,,,,,T,terres,,,1108,5.113048,44.707812
2021-367138,2021-11-08,000001,Vente,54000,,,BRAMEFAIM,B008,26400,26183,Mirabel-et-Blacons,26,,,26183000AI0377,,,,,,,,,,,,,0,,,,,L,landes,PACAG,Pacage,2187,5.113085,44.707722
2021-367138,2021-11-08,000001,Vente,54000,,,BRAMEFAIM,B008,26400,26183,Mirabel-et-Blacons,26,,,26183000AI0379,,,,,,,,,,,,,0,,,,,T,terres,,,3782,5.113311,44.707653
2021-367458,2021-11-09,000001,Vente,70000,,,LE MOULIN,B028,26400,26183,Mirabel-et-Blacons,26,,,26183000AH0439,,,,,,,,,,,,,0,,,,,T,terres,,,192,5.092445,44.712849
2021-367458,2021-11-09,000001,Vente,70000,,,LE MOULIN,B028,26400,26183,Mirabel-et-Blacons,26,,,26183000AH0442,,,,,,,,,,,,,0,,,,,T,terres,,,414,5.092413,44.712752
2021-367458,2021-11-09,000001,Vente,70000,,,LE MOULIN,B028,26400,26183,Mirabel-et-Blacons,26,,,26183000AH0445,,,,,,,,,,,,,0,,,,,T,terres,,,44,5.092395,44.712912
2021-368216,2021-12-01,000001,Vente,679000,,,SAUZET,B043,26400,26183,Mirabel-et-Blacons,26,,,261830000D0116,,,,,,,,,,,,,0,,,,,L,landes,PACAG,Pacage,10440,5.151867,44.714836
2021-368216,2021-12-01,000001,Vente,679000,,,SAUZET,B043,26400,26183,Mirabel-et-Blacons,26,,,261830000D0117,,,,,,,,,,,,,0,,,,,L,landes,PACAG,Pacage,11780,5.152582,44.71442
2021-368216,2021-12-01,000001,Vente,679000,,,SAUZET,B043,26400,26183,Mirabel-et-Blacons,26,,,261830000D0118,,,,,,,,,,,,,0,,,,,T,terres,,,2980,5.153151,44.714528
2021-368216,2021-12-01,000001,Vente,679000,,,SAUZET,B043,26400,26183,Mirabel-et-Blacons,26,,,261830000D0119,,,,,,,,,,,,,0,,,,,L,landes,PACAG,Pacage,2130,5.15346,44.713884
2021-368216,2021-12-01,000001,Vente,679000,,,SAUZET,B043,26400,26183,Mirabel-et-Blacons,26,,,261830000D0120,,,,,,,,,,,,,0,,,,,T,terres,,,9020,5.153508,44.713272
2021-368216,2021-12-01,000001,Vente,679000,,,SAUZET,B043,26400,26183,Mirabel-et-Blacons,26,,,261830000D0121,,,,,,,,,,,,,0,,,,,L,landes,PACAG,Pacage,29800,5.154047,44.712272
2021-368216,2021-12-01,000001,Vente,679000,,,SAUZET,B043,26400,26183,Mirabel-et-Blacons,26,,,261830000D0122,,,,,,,,,,,,,0,,,,,L,landes,PACAG,Pacage,5100,5.154852,44.71245
2021-368216,2021-12-01,000001,Vente,679000,,,SAUZET,B043,26400,26183,Mirabel-et-Blacons,26,,,261830000D0123,,,,,,,,,,,,,0,,,,,T,terres,,,32980,5.155984,44.711829
2021-368216,2021-12-01,000001,Vente,679000,5031,,SAUZET,B043,26400,26183,Mirabel-et-Blacons,26,,,261830000D0124,,,,,,,,,,,,,0,2,Appartement,104,3,S,sols,,,2220,5.157309,44.71216
2021-368216,2021-12-01,000001,Vente,679000,5031,,SAUZET,B043,26400,26183,Mirabel-et-Blacons,26,,,261830000D0124,,,,,,,,,,,,,0,2,Appartement,80,2,S,sols,,,2220,5.157309,44.71216
2021-368216,2021-12-01,000001,Vente,679000,5031,,SAUZET,B043,26400,26183,Mirabel-et-Blacons,26,,,261830000D0124,,,,,,,,,,,,,0,2,Appartement,80,3,S,sols,,,2220,5.157309,44.71216
2021-368216,2021-12-01,000001,Vente,679000,5031,,SAUZET,B043,26400,26183,Mirabel-et-Blacons,26,,,261830000D0124,,,,,,,,,,,,,0,2,Appartement,83,2,S,sols,,,2220,5.157309,44.71216
2021-368216,2021-12-01,000001,Vente,679000,,,SAUZET,B043,26400,26183,Mirabel-et-Blacons,26,,,261830000D0125,,,,,,,,,,,,,0,,,,,S,sols,,,116,5.157482,44.712399
2021-368216,2021-12-01,000001,Vente,679000,,,SAUZET,B043,26400,26183,Mirabel-et-Blacons,26,,,261830000D0127,,,,,,,,,,,,,0,,,,,T,terres,,,4050,5.15833,44.712592
2021-368216,2021-12-01,000001,Vente,679000,,,SAUZET,B043,26400,26183,Mirabel-et-Blacons,26,,,261830000D0128,,,,,,,,,,,,,0,,,,,L,landes,PACAG,Pacage,2500,5.158739,44.712635
2021-368216,2021-12-01,000001,Vente,679000,,,SAUZET,B043,26400,26183,Mirabel-et-Blacons,26,,,261830000D0129,,,,,,,,,,,,,0,,,,,L,landes,PACAG,Pacage,2200,5.161646,44.714131
2021-368216,2021-12-01,000001,Vente,679000,,,SAUZET,B043,26400,26183,Mirabel-et-Blacons,26,,,261830000D0130,,,,,,,,,,,,,0,,,,,T,terres,,,10760,5.161695,44.714373
2021-368216,2021-12-01,000001,Vente,679000,,,SAUZET,B043,26400,26183,Mirabel-et-Blacons,26,,,261830000D0131,,,,,,,,,,,,,0,,,,,VI,vignes,,,1250,5.161928,44.71511
2021-368216,2021-12-01,000001,Vente,679000,,,SAUZET,B043,26400,26183,Mirabel-et-Blacons,26,,,261830000D0132,,,,,,,,,,,,,0,,,,,VI,vignes,,,1200,5.162968,44.715391
2021-368216,2021-12-01,000001,Vente,679000,,,SAUZET,B043,26400,26183,Mirabel-et-Blacons,26,,,261830000D0133,,,,,,,,,,,,,0,,,,,BT,taillis simples,,,27070,5.161249,44.715002
2021-368216,2021-12-01,000001,Vente,679000,,,SAUZET,B043,26400,26183,Mirabel-et-Blacons,26,,,261830000D0133,,,,,,,,,,,,,0,,,,,BT,taillis simples,,,27070,5.161249,44.715002
2021-368216,2021-12-01,000001,Vente,679000,,,SERRE DES BARATIERES,B046,26400,26183,Mirabel-et-Blacons,26,,,261830000D0190,,,,,,,,,,,,,0,,,,,BT,taillis simples,,,73320,5.165212,44.715029
2021-368216,2021-12-01,000001,Vente,679000,,,SERRE DES BARATIERES,B046,26400,26183,Mirabel-et-Blacons,26,,,261830000D0190,,,,,,,,,,,,,0,,,,,BT,taillis simples,,,73320,5.165212,44.715029
2021-368216,2021-12-01,000001,Vente,679000,,,SERRE DES BARATIERES,B046,26400,26183,Mirabel-et-Blacons,26,,,261830000D0191,,,,,,,,,,,,,0,,,,,L,landes,,,9300,5.164819,44.714815
2021-368216,2021-12-01,000001,Vente,679000,,,SERRE DES BARATIERES,B046,26400,26183,Mirabel-et-Blacons,26,,,261830000D0192,,,,,,,,,,,,,0,,,,,T,terres,,,3430,5.164055,44.715756
2021-368216,2021-12-01,000001,Vente,679000,,,SERRE DES BARATIERES,B046,26400,26183,Mirabel-et-Blacons,26,,,261830000D0193,,,,,,,,,,,,,0,,,,,L,landes,PACAG,Pacage,5420,5.163085,44.715156
2021-368216,2021-12-01,000001,Vente,679000,,,SERRE DES BARATIERES,B046,26400,26183,Mirabel-et-Blacons,26,,,261830000D0194,,,,,,,,,,,,,0,,,,,T,terres,,,3520,5.162723,44.714668
2021-368216,2021-12-01,000001,Vente,679000,,,SERRE DES BARATIERES,B046,26400,26183,Mirabel-et-Blacons,26,,,261830000D0195,,,,,,,,,,,,,0,,,,,L,landes,PACAG,Pacage,3120,5.161625,44.713777
2021-368216,2021-12-01,000001,Vente,679000,,,SERRE DES BARATIERES,B046,26400,26183,Mirabel-et-Blacons,26,,,261830000D0196,,,,,,,,,,,,,0,,,,,BT,taillis simples,,,4140,5.161076,44.713221
2021-368216,2021-12-01,000001,Vente,679000,,,SERRE DES BARATIERES,B046,26400,26183,Mirabel-et-Blacons,26,,,261830000D0197,,,,,,,,,,,,,0,,,,,T,terres,,,3200,5.160951,44.712882
2021-368216,2021-12-01,000001,Vente,679000,,,SERRE DES BARATIERES,B046,26400,26183,Mirabel-et-Blacons,26,,,261830000D0198,,,,,,,,,,,,,0,,,,,L,landes,PACAG,Pacage,4940,5.162082,44.712846
2021-368216,2021-12-01,000001,Vente,679000,,,SERRE DES BARATIERES,B046,26400,26183,Mirabel-et-Blacons,26,,,261830000D0199,,,,,,,,,,,,,0,,,,,T,terres,,,3550,5.16412,44.713019
2021-368216,2021-12-01,000001,Vente,679000,,,SERRE DES BARATIERES,B046,26400,26183,Mirabel-et-Blacons,26,,,261830000D0200,,,,,,,,,,,,,0,,,,,L,landes,PACAG,Pacage,43660,5.164176,44.713461
2021-368216,2021-12-01,000001,Vente,679000,,,SERRE DES BARATIERES,B046,26400,26183,Mirabel-et-Blacons,26,,,261830000D0210,,,,,,,,,,,,,0,,,,,BT,taillis simples,,,35270,5.164278,44.711693
2021-368216,2021-12-01,000001,Vente,679000,,,SERRE PEYPLAT,B053,26400,26183,Mirabel-et-Blacons,26,,,261830000D0211,,,,,,,,,,,,,0,,,,,BT,taillis simples,,,26950,5.163409,44.711063
2021-368216,2021-12-01,000001,Vente,679000,,,SERRE PEYPLAT,B053,26400,26183,Mirabel-et-Blacons,26,,,261830000D0212,,,,,,,,,,,,,0,,,,,L,landes,PACAG,Pacage,2800,5.162108,44.712577
2021-368216,2021-12-01,000001,Vente,679000,,,SERRE PEYPLAT,B053,26400,26183,Mirabel-et-Blacons,26,,,261830000D0213,,,,,,,,,,,,,0,,,,,BT,taillis simples,,,25930,5.161063,44.71168
2021-368216,2021-12-01,000001,Vente,679000,,,SERRE PEYPLAT,B053,26400,26183,Mirabel-et-Blacons,26,,,261830000D0214,,,,,,,,,,,,,0,,,,,L,landes,PACAG,Pacage,4700,5.159479,44.71246
2021-368216,2021-12-01,000001,Vente,679000,,,SERRE PEYPLAT,B053,26400,26183,Mirabel-et-Blacons,26,,,261830000D0215,,,,,,,,,,,,,0,,,,,T,terres,,,8900,5.159177,44.712016
2021-368216,2021-12-01,000001,Vente,679000,,,SERRE PEYPLAT,B053,26400,26183,Mirabel-et-Blacons,26,,,261830000D0216,,,,,,,,,,,,,0,,,,,L,landes,PACAG,Pacage,7060,5.159478,44.711459
2021-368216,2021-12-01,000001,Vente,679000,,,SERRE PEYPLAT,B053,26400,26183,Mirabel-et-Blacons,26,,,261830000D0217,,,,,,,,,,,,,0,,,,,L,landes,PACAG,Pacage,6190,5.16029,44.711287
2021-368216,2021-12-01,000001,Vente,679000,,,SERRE PEYPLAT,B053,26400,26183,Mirabel-et-Blacons,26,,,261830000D0218,,,,,,,,,,,,,0,,,,,BT,taillis simples,,,40560,5.162381,44.710283