id_mutation,date_mutation,numero_disposition,nature_mutation,valeur_fonciere,adresse_numero,adresse_suffixe,adresse_nom_voie,adresse_code_voie,code_postal,code_commune,nom_commune,code_departement,ancien_code_commune,ancien_nom_commune,id_parcelle,ancien_id_parcelle,numero_volume,lot1_numero,lot1_surface_carrez,lot2_numero,lot2_surface_carrez,lot3_numero,lot3_surface_carrez,lot4_numero,lot4_surface_carrez,lot5_numero,lot5_surface_carrez,nombre_lots,code_type_local,type_local,surface_reelle_bati,nombre_pieces_principales,code_nature_culture,nature_culture,code_nature_culture_speciale,nature_culture_speciale,surface_terrain,longitude,latitude
2021-355824,2021-02-04,000001,Vente,2000,,,LE CHAMP DES CHEVAUX,B006,26750,26323,Saint-Paul-lès-Romans,26,,,26323000ZA0215,,,,,,,,,,,,,0,,,,,L,landes,PATUR,Pâture plantée,2082,5.144722,45.072435
2021-356286,2021-01-28,000001,Vente,254900,45,,ALL DES GRIEUX,0014,26750,26323,Saint-Paul-lès-Romans,26,,,26323000ZA0132,,,,,,,,,,,,,0,1,Maison,119,4,S,sols,,,720,5.134854,45.065762
2021-356286,2021-01-28,000001,Vente,254900,,,TRIEVE,B043,26750,26323,Saint-Paul-lès-Romans,26,,,26323000ZA0169,,,,,,,,,,,,,0,,,,,T,terres,,,252,5.13496,45.06567
2021-357168,2021-03-09,000002,Vente,9474,,,GENERIAT ET SERVIAT,B022,26750,26323,Saint-Paul-lès-Romans,26,,,26323000WB0120,,,,,,,,,,,,,0,,,,,T,terres,,,2029,5.149384,45.069446
2021-357168,2021-03-09,000002,Vente,9474,,,GENERIAT ET SERVIAT,B022,26750,26323,Saint-Paul-lès-Romans,26,,,26323000WB0120,,,,,,,,,,,,,0,,,,,T,terres,,,2029,5.149384,45.069446
2021-357168,2021-03-09,000002,Vente,9474,,,GENERIAT ET SERVIAT,B022,26750,26323,Saint-Paul-lès-Romans,26,,,26323000WB0121,,,,,,,,,,,,,0,,,,,T,terres,,,4738,5.149621,45.069049
2021-357168,2021-03-09,000002,Vente,9474,,,GENERIAT ET SERVIAT,B022,26750,26323,Saint-Paul-lès-Romans,26,,,26323000WB0121,,,,,,,,,,,,,0,,,,,T,terres,,,4738,5.149621,45.069049
2021-357319,2021-03-15,000001,Vente,160000,,,LES PETITS MATS,B036,26750,26323,Saint-Paul-lès-Romans,26,,,26323000WD0099,,,,,,,,,,,,,0,,,,,S,sols,,,3484,5.139036,45.064321
2021-357319,2021-03-15,000001,Vente,160000,45,,IMP DES PETITS MAS,0194,26750,26323,Saint-Paul-lès-Romans,26,,,26323000WD0112,,,,,,,,,,,,,0,3,Dépendance,,0,S,sols,,,677,5.13865,45.064576
2021-357319,2021-03-15,000001,Vente,160000,45,,IMP DES PETITS MAS,0194,26750,26323,Saint-Paul-lès-Romans,26,,,26323000WD0112,,,,,,,,,,,,,0,1,Maison,90,5,S,sols,,,677,5.13865,45.064576
2021-357319,2021-03-15,000001,Vente,160000,45,,IMP DES PETITS MAS,0194,26750,26323,Saint-Paul-lès-Romans,26,,,26323000WD0112,,,,,,,,,,,,,0,3,Dépendance,,0,S,sols,,,677,5.13865,45.064576
2021-357378,2021-03-11,000002,Vente,5346,,,LES BLACHES,B004,26750,26323,Saint-Paul-lès-Romans,26,,,26323000WC0097,,,,,,,,,,,,,0,,,,,P,prés,,,742,5.154564,45.065587
2021-357378,2021-03-11,000002,Vente,5346,,,LES BLACHES,B004,26750,26323,Saint-Paul-lès-Romans,26,,,26323000WC0097,,,,,,,,,,,,,0,,,,,P,prés,,,743,5.154564,45.065587
2021-357737,2021-03-24,000001,Vente,1596,,,LES BUISSIERES,B050,26750,26323,Saint-Paul-lès-Romans,26,,,26323000WK0086,,,,,,,,,,,,,0,,,,,L,landes,PATUR,Pâture plantée,1180,5.109959,45.051736
2021-357737,2021-03-24,000001,Vente,1596,,,LES BUISSIERES,B050,26750,26323,Saint-Paul-lès-Romans,26,,,26323000WK0087,,,,,,,,,,,,,0,,,,,J,jardins,,,1080,5.110072,45.051679
2021-357864,2021-04-06,000001,Vente,34000,,,LES ORES,B034,26750,26323,Saint-Paul-lès-Romans,26,,,26323000WN0020,,,,,,,,,,,,,0,,,,,T,terres,,,25194,5.113101,45.06691
2021-357864,2021-04-06,000001,Vente,34000,,,LES ORES,B034,26750,26323,Saint-Paul-lès-Romans,26,,,26323000WN0020,,,,,,,,,,,,,0,,,,,T,terres,,,12596,5.113101,45.06691
2021-357866,2021-04-06,000001,Vente,18000,,,LE COTEAU,B016,26750,26323,Saint-Paul-lès-Romans,26,,,26323000ZK0185,,,,,,,,,,,,,0,,,,,VE,vergers,,,19825,5.106587,45.042575
2021-357962,2021-04-09,000001,Vente,3500,,,LE BOIS,B005,26750,26323,Saint-Paul-lès-Romans,26,,,26323000WI0035,,,,,,,,,,,,,0,,,,,T,terres,,,3118,5.120934,45.039911
2021-357962,2021-04-09,000001,Vente,3500,,,LE BOIS,B005,26750,26323,Saint-Paul-lès-Romans,26,,,26323000WI0035,,,,,,,,,,,,,0,,,,,BT,taillis simples,,,2440,5.120934,45.039911
2021-357962,2021-04-09,000001,Vente,3500,,,LE BOIS,B005,26750,26323,Saint-Paul-lès-Romans,26,,,26323000WI0035,,,,,,,,,,,,,0,,,,,BT,taillis simples,,,1644,5.120934,45.039911
2021-357963,2021-03-19,000001,Vente,226000,5,,RUE DU MANISCEY,0162,26750,26323,Saint-Paul-lès-Romans,26,,,26323000ZO0124,,,,,,,,,,,,,0,1,Maison,88,4,S,sols,,,867,5.125115,45.067036
2021-357963,2021-03-19,000001,Vente,226000,,,LE MANISCEY,B029,26750,26323,Saint-Paul-lès-Romans,26,,,26323000ZO0205,,,,,,,,,,,,,0,,,,,S,sols,,,768,5.124649,45.067268
2021-357963,2021-03-19,000001,Vente,226000,,,LE MANISCEY,B029,26750,26323,Saint-Paul-lès-Romans,26,,,26323000ZO0213,,,,,,,,,,,,,0,,,,,S,sols,,,567,5.124987,45.067542
2021-358730,2021-04-12,000001,Vente,262400,,,LE VILLAGE,B046,26750,26323,Saint-Paul-lès-Romans,26,,,26323000AC0301,,,,,,,,,,,,,0,,,,,S,sols,,,590,5.131126,45.065085
2021-358730,2021-04-12,000001,Vente,262400,40,,RUE DU VIEUX VILLAGE,0047,26750,26323,Saint-Paul-lès-Romans,26,,,26323000AC0302,,,,,,,,,,,,,0,1,Maison,101,4,S,sols,,,744,5.130901,45.065089
2021-358732,2021-04-09,000001,Vente,555200,225,,RUE CHANTALOUETTE,0078,26750,26323,Saint-Paul-lès-Romans,26,,,26323000ZA0253,,,,,,,,,,,,,0,3,Dépendance,,0,S,sols,,,841,5.136377,45.064676
2021-358732,2021-04-09,000001,Vente,555200,225,,RUE CHANTALOUETTE,0078,26750,26323,Saint-Paul-lès-Romans,26,,,26323000ZA0253,,,,,,,,,,,,,0,1,Maison,215,6,S,sols,,,841,5.136377,45.064676
2021-358732,2021-04-09,000001,Vente,555200,,,TRIEVE,B043,26750,26323,Saint-Paul-lès-Romans,26,,,26323000ZA0254,,,,,,,,,,,,,0,,,,,J,jardins,,,778,5.136468,45.064387
2021-358902,2021-04-21,000001,Vente,25000,,,LE VILLAGE,B046,26750,26323,Saint-Paul-lès-Romans,26,,,26323000AC0378,,,,,,,,,,,,,0,,,,,J,jardins,,,24,5.130486,45.06703
2021-358902,2021-04-21,000001,Vente,25000,,,LE VILLAGE,B046,26750,26323,Saint-Paul-lès-Romans,26,,,26323000AC0380,,,,,,,,,,,,,0,,,,,J,jardins,,,178,5.130436,45.067033
2021-358902,2021-04-21,000001,Vente,25000,,,LE VILLAGE,B046,26750,26323,Saint-Paul-lès-Romans,26,,,26323000AC0383,,,,,,,,,,,,,0,,,,,J,jardins,,,205,5.130506,45.066966
2021-358910,2021-04-06,000001,Vente,216000,120,,CHE DE LA MAGNANERIE,0160,26750,26323,Saint-Paul-lès-Romans,26,,,26323000AC0570,,,,,,,,,,,,,0,1,Maison,100,5,AB,terrains a bâtir,,,565,5.131786,45.063726
2021-358910,2021-04-06,000001,Vente,216000,,,LE VILLAGE,B046,26750,26323,Saint-Paul-lès-Romans,26,,,26323000AC0571,,,,,,,,,,,,,0,,,,,S,sols,,,83,5.131462,45.06387
2021-360779,2021-05-28,000001,Vente,140000,30,,IMP DE LA RIVIERE,0038,26750,26323,Saint-Paul-lès-Romans,26,,,26323000AC0186,,,,,,,,,,,,,0,1,Maison,72,3,S,sols,,,390,5.130334,45.066767
2021-361141,2021-06-21,000001,Vente,6624,,,LES BUISSIERES,B050,26750,26323,Saint-Paul-lès-Romans,26,,,26323000WK0186,,,,,,,,,,,,,0,,,,,BT,taillis simples,,,240,5.109368,45.051036
2021-361171,2021-06-04,000002,Vente,209750,40,,CHE DE L'EGLISE,0110,26750,26323,Saint-Paul-lès-Romans,26,,,26323000AC0742,,,,,,,,,,,,,0,1,Maison,104,4,,,,,,5.129918,45.065914
2021-361483,2021-06-30,000002,Vente,4405.5,,,LE CHASSE,B011,26750,26323,Saint-Paul-lès-Romans,26,,,26323000ZM0447,,,,,,,,,,,,,0,,,,,S,sols,,,178,5.099688,45.059219
2021-361483,2021-06-30,000002,Vente,4405.5,,,LE CHASSE,B011,26750,26323,Saint-Paul-lès-Romans,26,,,26323000ZM0449,,,,,,,,,,,,,0,,,,,S,sols,,,89,5.100304,45.058498
2021-362308,2021-07-20,000001,Vente,320000,65,,RUE DU PARC,0180,26750,26323,Saint-Paul-lès-Romans,26,,,26323000ZM0097,,,,,,,,,,,,,0,3,Dépendance,,0,T,terres,,,1666,5.109848,45.056545
2021-362308,2021-07-20,000001,Vente,320000,65,,RUE DU PARC,0180,26750,26323,Saint-Paul-lès-Romans,26,,,26323000ZM0097,,,,,,,,,,,,,0,3,Dépendance,,0,S,sols,,,834,5.109848,45.056545
2021-362308,2021-07-20,000001,Vente,320000,65,,RUE DU PARC,0180,26750,26323,Saint-Paul-lès-Romans,26,,,26323000ZM0097,,,,,,,,,,,,,0,1,Maison,88,4,S,sols,,,834,5.109848,45.056545
2021-362308,2021-07-20,000001,Vente,320000,65,,RUE DU PARC,0180,26750,26323,Saint-Paul-lès-Romans,26,,,26323000ZM0097,,,,,,,,,,,,,0,1,Maison,88,4,T,terres,,,1666,5.109848,45.056545
2021-362412,2021-07-16,000001,Vente,189450,40,,RUE DE LA MAIRIE,0028,26750,26323,Saint-Paul-lès-Romans,26,,,26323000AC0162,,,,,,,,,,,,,0,1,Maison,90,4,S,sols,,,212,5.133275,45.069854
2021-362695,2021-07-26,000001,Vente,367605,,,LE VILLAGE,B046,26750,26323,Saint-Paul-lès-Romans,26,,,26323000AB0286,,,,,,,,,,,,,0,,,,,J,jardins,,,90,5.134975,45.070024
2021-362695,2021-07-26,000001,Vente,367605,75,,IMP DES CIGALES,0088,26750,26323,Saint-Paul-lès-Romans,26,,,26323000AB0288,,,,,,,,,,,,,0,3,Dépendance,,0,S,sols,,,720,5.135527,45.069776
2021-362695,2021-07-26,000001,Vente,367605,75,,IMP DES CIGALES,0088,26750,26323,Saint-Paul-lès-Romans,26,,,26323000AB0288,,,,,,,,,,,,,0,1,Maison,168,5,S,sols,,,720,5.135527,45.069776
2021-362695,2021-07-26,000001,Vente,367605,75,,IMP DES CIGALES,0088,26750,26323,Saint-Paul-lès-Romans,26,,,26323000AB0288,,,,,,,,,,,,,0,3,Dépendance,,0,S,sols,,,720,5.135527,45.069776
2021-362695,2021-07-26,000001,Vente,367605,75,,IMP DES CIGALES,0088,26750,26323,Saint-Paul-lès-Romans,26,,,26323000AB0288,,,,,,,,,,,,,0,3,Dépendance,,0,S,sols,,,720,5.135527,45.069776
2021-362695,2021-07-26,000001,Vente,367605,,,LE VILLAGE,B046,26750,26323,Saint-Paul-lès-Romans,26,,,26323000AB0289,,,,,,,,,,,,,0,,,,,J,jardins,,,654,5.135429,45.069621
2021-362695,2021-07-26,000001,Vente,367605,,,LE VILLAGE,B046,26750,26323,Saint-Paul-lès-Romans,26,,,26323000AB0291,,,,,,,,,,,,,0,,,,,J,jardins,,,85,5.13492,45.069889
2021-362695,2021-07-26,000001,Vente,367605,,,LE VILLAGE,B046,26750,26323,Saint-Paul-lès-Romans,26,,,26323000AB0294,,,,,,,,,,,,,0,,,,,VE,vergers,,,32,5.134859,45.069828
2021-362695,2021-07-26,000001,Vente,367605,,,LE VILLAGE,B046,26750,26323,Saint-Paul-lès-Romans,26,,,26323000AB0295,,,,,,,,,,,,,0,,,,,VE,vergers,,,198,5.134952,45.069707
2021-362695,2021-07-26,000001,Vente,367605,,,LE VILLAGE,B046,26750,26323,Saint-Paul-lès-Romans,26,,,26323000AB0297,,,,,,,,,,,,,0,,,,,VE,vergers,,,484,5.135375,45.069546
2021-362695,2021-07-26,000001,Vente,367605,,,LE VILLAGE,B046,26750,26323,Saint-Paul-lès-Romans,26,,,26323000AB0298,,,,,,,,,,,,,0,,,,,VE,vergers,,,159,5.135306,45.069465
2021-362721,2021-06-17,000001,Vente,170000,,,LE BOIS,B005,26750,26323,Saint-Paul-lès-Romans,26,,,26323000WI0027,,,,,,,,,,,,,0,,,,,L,landes,PATUR,Pâture plantée,2257,5.121961,45.040065
2021-362721,2021-06-17,000001,Vente,170000,1720,,CHE DU GRAND BOIS,0140,26750,26323,Saint-Paul-lès-Romans,26,,,26323000WI0113,,,,,,,,,,,,,0,1,Maison,94,3,S,sols,,,1000,5.121482,45.039741
2021-362721,2021-06-17,000001,Vente,170000,1720,,CHE DU GRAND BOIS,0140,26750,26323,Saint-Paul-lès-Romans,26,,,26323000WI0113,,,,,,,,,,,,,0,1,Maison,94,3,AG,terrains d'agrément,,,399,5.121482,45.039741
2021-363040,2021-07-30,000001,Vente,199054,160,B,RUE CHANTALOUETTE,0078,26750,26323,Saint-Paul-lès-Romans,26,,,26323000ZA0261,,,,,,,,,,,,,0,1,Maison,98,4,S,sols,,,358,5.136068,45.064083
2021-364488,2021-09-09,000002,Vente,86000,,,LE VILLAGE,B046,26750,26323,Saint-Paul-lès-Romans,26,,,26323000AC0716,,,,,,,,,,,,,0,,,,,S,sols,,,62,5.133036,45.06711
2021-365573,2021-10-15,000001,Vente,110000,5,,RUE DU COLOMBIER,0006,26750,26323,Saint-Paul-lès-Romans,26,,,26323000AC0096,,,,,,,,,,,,,0,1,Maison,75,3,S,sols,,,38,5.131422,45.065334
2021-366219,2021-10-06,000002,Vente,11430,,,HAMEAU DES ROUTES,B027,26750,26323,Saint-Paul-lès-Romans,26,,,26323000WC0103,,,,,,,,,,,,,0,,,,,T,terres,,,127,5.159878,45.055895
2021-366219,2021-10-06,000002,Vente,11430,,,HAMEAU DES ROUTES,B027,26750,26323,Saint-Paul-lès-Romans,26,,,26323000WC0104,,,,,,,,,,,,,0,,,,,T,terres,,,20,5.159947,45.055632
2021-367379,2021-11-24,000002,Vente,142100,195,,RUE DU VIEUX VILLAGE,0047,26750,26323,Saint-Paul-lès-Romans,26,,,26323000AC0078,,,,,,,,,,,,,0,1,Maison,70,3,S,sols,,,384,5.130172,45.064065
2021-367379,2021-11-24,000002,Vente,142100,,,LE VILLAGE,B046,26750,26323,Saint-Paul-lès-Romans,26,,,26323000AC0758,,,,,,,,,,,,,0,,,,,T,terres,,,363,5.130256,45.063965
2021-367698,2021-11-17,000001,Vente,25800,,,LE COTEAU,B016,26750,26323,Saint-Paul-lès-Romans,26,,,26323000ZK0185,,,,,,,,,,,,,0,,,,,VE,vergers,,,19825,5.106587,45.042575
2021-367961,2021-11-22,000001,Vente,162600,8,,IMP CANIN,0072,26750,26323,Saint-Paul-lès-Romans,26,,,26323000WI0109,,,,,,,,,,,,,0,1,Maison,89,4,T,terres,,,1228,5.114453,45.036226
2021-367961,2021-11-22,000001,Vente,162600,8,,IMP CANIN,0072,26750,26323,Saint-Paul-lès-Romans,26,,,26323000WI0109,,,,,,,,,,,,,0,4,Local industriel. commercial ou assimilé,15,0,T,terres,,,1228,5.114453,45.036226
2021-367961,2021-11-22,000001,Vente,162600,8,,IMP CANIN,0072,26750,26323,Saint-Paul-lès-Romans,26,,,26323000WI0109,,,,,,,,,,,,,0,1,Maison,89,4,S,sols,,,1000,5.114453,45.036226
2021-367961,2021-11-22,000001,Vente,162600,8,,IMP CANIN,0072,26750,26323,Saint-Paul-lès-Romans,26,,,26323000WI0109,,,,,,,,,,,,,0,4,Local industriel. commercial ou assimilé,15,0,S,sols,,,1000,5.114453,45.036226
2021-368329,2021-11-10,000002,Echange,2706.9,,,LES CHAUSSATS,B013,26750,26323,Saint-Paul-lès-Romans,26,,,26323000ZA0304,,,,,,,,,,,,,0,,,,,T,terres,,,3867,5.142044,45.073644
2021-368540,2021-11-15,000001,Vente,420000,3075,,RTE DEPARTEMENTALE DAUPHINOISE,0100,26750,26323,Saint-Paul-lès-Romans,26,,,26323000AB0045,,,,,,,,,,,,,0,4,Local industriel. commercial ou assimilé,145,0,S,sols,,,86,5.132876,45.070223
2021-368540,2021-11-15,000001,Vente,420000,3075,,RTE DEPARTEMENTALE DAUPHINOISE,0100,26750,26323,Saint-Paul-lès-Romans,26,,,26323000AB0045,,,,,,,,,,,,,0,2,Appartement,54,2,S,sols,,,86,5.132876,45.070223
2021-368540,2021-11-15,000001,Vente,420000,,,LE VILLAGE,B046,26750,26323,Saint-Paul-lès-Romans,26,,,26323000AB0046,,,,,,,,,,,,,0,,,,,S,sols,,,52,5.132972,45.070243
2021-368540,2021-11-15,000001,Vente,420000,,,LE VILLAGE,B046,26750,26323,Saint-Paul-lès-Romans,26,,,26323000AB0047,,,,,,,,,,,,,0,,,,,S,sols,,,62,5.133048,45.070253
2021-368540,2021-11-15,000001,Vente,420000,5,,RUE DU MOULIN,0029,26750,26323,Saint-Paul-lès-Romans,26,,,26323000AB0048,,,,,,,,,,,,,0,1,Maison,90,3,S,sols,,,207,5.132967,45.070315
2021-368540,2021-11-15,000001,Vente,420000,,,LE VILLAGE,B046,26750,26323,Saint-Paul-lès-Romans,26,,,26323000AB0050,,,,,,,,,,,,,0,,,,,S,sols,,,64,5.133032,45.070537
2021-368540,2021-11-15,000001,Vente,420000,,,LE VILLAGE,B046,26750,26323,Saint-Paul-lès-Romans,26,,,26323000AB0051,,,,,,,,,,,,,0,,,,,S,sols,,,51,5.133027,45.070603
2021-368540,2021-11-15,000001,Vente,420000,,,LE VILLAGE,B046,26750,26323,Saint-Paul-lès-Romans,26,,,26323000AB0284,,,,,,,,,,,,,0,,,,,S,sols,,,75,5.132918,45.070574
2021-368567,2021-12-17,000001,Vente,80000,435,A,IMP DES BERGES DE L'ISERE,0064,26750,26323,Saint-Paul-lès-Romans,26,,,26323000WH0079,,,,,,,,,,,,,0,3,Dépendance,,0,S,sols,,,547,5.12965,45.043969
2021-368567,2021-12-17,000001,Vente,80000,435,A,IMP DES BERGES DE L'ISERE,0064,26750,26323,Saint-Paul-lès-Romans,26,,,26323000WH0079,,,,,,,,,,,,,0,1,Maison,80,4,S,sols,,,547,5.12965,45.043969
2021-368567,2021-12-17,000001,Vente,80000,435,A,IMP DES BERGES DE L'ISERE,0064,26750,26323,Saint-Paul-lès-Romans,26,,,26323000WH0079,,,,,,,,,,,,,0,3,Dépendance,,0,S,sols,,,547,5.12965,45.043969
2021-369014,2021-12-29,000001,Vente,470000,,,LE VILLAGE,B046,26750,26323,Saint-Paul-lès-Romans,26,,,26323000AC0188,,,,,,,,,,,,,0,,,,,J,jardins,,,2250,5.130668,45.066514
2021-369014,2021-12-29,000001,Vente,470000,150,,RUE DU COLOMBIER,0006,26750,26323,Saint-Paul-lès-Romans,26,,,26323000AC0643,,,,,,,,,,,,,0,1,Maison,177,5,S,sols,,,873,5.130399,45.066668
2021-369014,2021-12-29,000001,Vente,470000,10,,IMP DE LA RIVIERE,0038,26750,26323,Saint-Paul-lès-Romans,26,,,26323000AC0644,,,,,,,,,,,,,0,1,Maison,94,4,S,sols,,,72,5.130163,45.066464
