id_mutation,date_mutation,numero_disposition,nature_mutation,valeur_fonciere,adresse_numero,adresse_suffixe,adresse_nom_voie,adresse_code_voie,code_postal,code_commune,nom_commune,code_departement,ancien_code_commune,ancien_nom_commune,id_parcelle,ancien_id_parcelle,numero_volume,lot1_numero,lot1_surface_carrez,lot2_numero,lot2_surface_carrez,lot3_numero,lot3_surface_carrez,lot4_numero,lot4_surface_carrez,lot5_numero,lot5_surface_carrez,nombre_lots,code_type_local,type_local,surface_reelle_bati,nombre_pieces_principales,code_nature_culture,nature_culture,code_nature_culture_speciale,nature_culture_speciale,surface_terrain,longitude,latitude
2021-369907,2021-02-18,000001,Vente,400000,,,LE PRE SAINT MARC,B052,27190,27287,Glisolles,27,,,272870000B0098,,,,,,,,,,,,,0,,,,,E,eaux,ETANG,Etangs,346,1.023981,48.982554
2021-369907,2021-02-18,000001,Vente,400000,,,LES COTES,B027,27190,27287,Glisolles,27,,,272870000B0423,,,,,,,,,,,,,0,,,,,P,prés,,,25,1.024375,48.982026
2021-369907,2021-02-18,000001,Vente,400000,,,LES COTES,B027,27190,27287,Glisolles,27,,,272870000B0423,,,,,,,,,,,,,0,,,,,P,prés,,,25,1.024375,48.982026
2021-369907,2021-02-18,000001,Vente,400000,,,LE PRE SAINT MARC,B052,27190,27287,Glisolles,27,,,272870000B0807,,,,,,,,,,,,,0,,,,,P,prés,,,315,1.023165,48.982272
2021-369907,2021-02-18,000001,Vente,400000,,,LE PRE SAINT MARC,B052,27190,27287,Glisolles,27,,,272870000B0807,,,,,,,,,,,,,0,,,,,P,prés,,,315,1.023165,48.982272
2021-369907,2021-02-18,000001,Vente,400000,,,LE PRE SAINT MARC,B052,27190,27287,Glisolles,27,,,272870000B0808,,,,,,,,,,,,,0,,,,,BP,peupleraies,,,2447,1.023608,48.982637
2021-369907,2021-02-18,000001,Vente,400000,,,LE PRE SAINT MARC,B052,27190,27287,Glisolles,27,,,272870000B0808,,,,,,,,,,,,,0,,,,,BP,peupleraies,,,2447,1.023608,48.982637
2021-369907,2021-02-18,000001,Vente,400000,,,LE PRE SAINT MARC,B052,27190,27287,Glisolles,27,,,272870000B0809,,,,,,,,,,,,,0,,,,,BP,peupleraies,,,2683,1.026894,48.982275
2021-369907,2021-02-18,000001,Vente,400000,,,LE PRE SAINT MARC,B052,27190,27287,Glisolles,27,,,272870000B0810,,,,,,,,,,,,,0,,,,,BP,peupleraies,,,38017,1.026582,48.982661
2021-371364,2021-04-01,000001,Vente,180000,134,,ALL DE LA FORET,0018,27190,27287,Glisolles,27,,,272870000B0746,,,,,,,,,,,,,0,1,Maison,133,5,S,sols,,,500,0.997203,48.994494
2021-371364,2021-04-01,000001,Vente,180000,134,,ALL DE LA FORET,0018,27190,27287,Glisolles,27,,,272870000B0746,,,,,,,,,,,,,0,1,Maison,133,5,AG,terrains d'agrément,,,1779,0.997203,48.994494
2021-373077,2021-05-12,000001,Vente,23000,,,BOIS D OISSEL,B003,27190,27287,Glisolles,27,,,272870000A0056,,,,,,,,,,,,,0,,,,,BT,taillis simples,,,5147,0.991444,49.00285
2021-373077,2021-05-12,000001,Vente,23000,,,BOIS D OISSEL,B003,27190,27287,Glisolles,27,,,272870000A0056,,,,,,,,,,,,,0,,,,,BR,futaies résineuses,,,10295,0.991444,49.00285
2021-373077,2021-05-12,000001,Vente,23000,,,LA RUE DES HOUX,B058,27190,27287,Glisolles,27,,,272870000A0570,,,,,,,,,,,,,0,,,,,P,prés,,,7405,0.994419,49.003067
2021-374573,2021-07-07,000001,Vente,116000,56,,ALL DU MONT PLANTE,0030,27190,27287,Glisolles,27,,,272870000B0589,,,,,,,,,,,,,0,1,Maison,38,2,S,sols,,,500,1.003932,48.995445
2021-374573,2021-07-07,000001,Vente,116000,56,,ALL DU MONT PLANTE,0030,27190,27287,Glisolles,27,,,272870000B0589,,,,,,,,,,,,,0,1,Maison,38,2,AG,terrains d'agrément,,,1621,1.003932,48.995445
2021-375135,2021-07-12,000001,Vente,237500,,,CHATEAU DE GLISOLLES,B024,27190,27287,Glisolles,27,,,272870000B0978,,,,,,,,,,,,,0,,,,,T,terres,,,3,1.01688,48.986892
2021-375135,2021-07-12,000001,Vente,237500,5,,IMP DU CHATEAU,0019,27190,27287,Glisolles,27,,,272870000B0992,,,,,,,,,,,,,0,1,Maison,83,3,S,sols,,,500,1.016903,48.986788
2021-375135,2021-07-12,000001,Vente,237500,5,,IMP DU CHATEAU,0019,27190,27287,Glisolles,27,,,272870000B0992,,,,,,,,,,,,,0,1,Maison,83,3,AG,terrains d'agrément,,,522,1.016903,48.986788
2021-375419,2021-07-15,000001,Vente,478000,,,MOULIN DE GRIGNEUSEVILLE,B043,27190,27287,Glisolles,27,,,272870000C0142,,,,,,,,,,,,,0,,,,,P,prés,,,108,0.992284,48.978021
2021-375419,2021-07-15,000001,Vente,478000,,,MOULIN DE GRIGNEUSEVILLE,B043,27190,27287,Glisolles,27,,,272870000C0142,,,,,,,,,,,,,0,,,,,P,prés,,,54,0.992284,48.978021
2021-375419,2021-07-15,000001,Vente,478000,,,MOULIN DE GRIGNEUSEVILLE,B043,27190,27287,Glisolles,27,,,272870000C0146,,,,,,,,,,,,,0,,,,,L,landes,,,7982,0.99263,48.978529
2021-375419,2021-07-15,000001,Vente,478000,,,FERME DE GRIGNEUSEVILLE,B029,27190,27287,Glisolles,27,,,272870000C0148,,,,,,,,,,,,,0,,,,,P,prés,,,117,0.992932,48.978194
2021-375419,2021-07-15,000001,Vente,478000,56,,MOULIN DE GRIGNEUSEVILLE,B043,27190,27287,Glisolles,27,,,272870000C0252,,,,,,,,,,,,,0,1,Maison,188,7,L,landes,,,25271,0.989245,48.977145
2021-375419,2021-07-15,000001,Vente,478000,56,,MOULIN DE GRIGNEUSEVILLE,B043,27190,27287,Glisolles,27,,,272870000C0252,,,,,,,,,,,,,0,3,Dépendance,,0,BT,taillis simples,,,4931,0.989245,48.977145
2021-375419,2021-07-15,000001,Vente,478000,56,,MOULIN DE GRIGNEUSEVILLE,B043,27190,27287,Glisolles,27,,,272870000C0252,,,,,,,,,,,,,0,3,Dépendance,,0,L,landes,,,25271,0.989245,48.977145
2021-375419,2021-07-15,000001,Vente,478000,56,,MOULIN DE GRIGNEUSEVILLE,B043,27190,27287,Glisolles,27,,,272870000C0252,,,,,,,,,,,,,0,3,Dépendance,,0,L,landes,,,25271,0.989245,48.977145
2021-375419,2021-07-15,000001,Vente,478000,56,,MOULIN DE GRIGNEUSEVILLE,B043,27190,27287,Glisolles,27,,,272870000C0252,,,,,,,,,,,,,0,1,Maison,188,7,BT,taillis simples,,,4931,0.989245,48.977145
2021-375419,2021-07-15,000001,Vente,478000,56,,MOULIN DE GRIGNEUSEVILLE,B043,27190,27287,Glisolles,27,,,272870000C0252,,,,,,,,,,,,,0,3,Dépendance,,0,BT,taillis simples,,,4931,0.989245,48.977145
2021-375442,2021-07-16,000001,Vente,178000,7,,IMP DU CHATEAU,0019,27190,27287,Glisolles,27,,,272870000B0994,,,,,,,,,,,,,0,1,Maison,85,4,S,sols,,,500,1.017449,48.986693
2021-375442,2021-07-16,000001,Vente,178000,7,,IMP DU CHATEAU,0019,27190,27287,Glisolles,27,,,272870000B0994,,,,,,,,,,,,,0,1,Maison,85,4,AG,terrains d'agrément,,,798,1.017449,48.986693
2021-375503,2021-07-16,000001,Vente,39000,,,CHATEAU DE GLISOLLES,B024,27190,27287,Glisolles,27,,,272870000B1000,,,,,,,,,,,,,0,,,,,AB,terrains a bâtir,,,1138,1.017095,48.985895
2021-375742,2021-07-01,000001,Vente,237900,131,,RTE DE FERRIERES HAUT CLOCHER,0017,27190,27287,Glisolles,27,,,272870000B0740,,,,,,,,,,,,,0,1,Maison,166,5,AG,terrains d'agrément,,,2130,0.997668,48.993483
2021-375742,2021-07-01,000001,Vente,237900,131,,RTE DE FERRIERES HAUT CLOCHER,0017,27190,27287,Glisolles,27,,,272870000B0740,,,,,,,,,,,,,0,1,Maison,166,5,S,sols,,,500,0.997668,48.993483
2021-376163,2021-07-09,000001,Vente,186262.2,41,,ANGERVILLE,B001,27190,27287,Glisolles,27,,,272870000B0143,,,,,,,,,,,,,0,1,Maison,50,3,S,sols,,,762,1.008814,48.978924
2021-376163,2021-07-09,000001,Vente,186262.2,,,ANGERVILLE,B001,27190,27287,Glisolles,27,,,272870000B0961,,,,,,,,,,,,,0,,,,,P,prés,,,628,1.008709,48.978709
2021-376486,2021-08-06,000001,Vente,190000,135,,ALL DE LA FORET,0018,27190,27287,Glisolles,27,,,272870000B0748,,,,,,,,,,,,,0,1,Maison,112,6,AG,terrains d'agrément,,,1933,0.99775,48.994723
2021-376486,2021-08-06,000001,Vente,190000,135,,ALL DE LA FORET,0018,27190,27287,Glisolles,27,,,272870000B0748,,,,,,,,,,,,,0,1,Maison,112,6,S,sols,,,500,0.99775,48.994723
2021-377560,2021-08-10,000001,Vente,365000,1,,EGLISE DE GLISOLLES,B028,27190,27287,Glisolles,27,,,272870000B0955,,,,,,,,,,,,,0,1,Maison,203,5,AG,terrains d'agrément,,,665,1.018687,48.984456
2021-377560,2021-08-10,000001,Vente,365000,1,,EGLISE DE GLISOLLES,B028,27190,27287,Glisolles,27,,,272870000B0955,,,,,,,,,,,,,0,3,Dépendance,,0,S,sols,,,500,1.018687,48.984456
2021-377560,2021-08-10,000001,Vente,365000,1,,EGLISE DE GLISOLLES,B028,27190,27287,Glisolles,27,,,272870000B0955,,,,,,,,,,,,,0,1,Maison,203,5,S,sols,,,500,1.018687,48.984456
2021-377560,2021-08-10,000001,Vente,365000,1,,EGLISE DE GLISOLLES,B028,27190,27287,Glisolles,27,,,272870000B0955,,,,,,,,,,,,,0,3,Dépendance,,0,AG,terrains d'agrément,,,665,1.018687,48.984456
2021-377560,2021-08-10,000001,Vente,365000,,,EGLISE DE GLISOLLES,B028,27190,27287,Glisolles,27,,,272870000B0958,,,,,,,,,,,,,0,,,,,S,sols,,,348,1.018527,48.984248
2021-378144,2021-09-09,000001,Vente,236700,12,,LE BOIS DES FORTIERES,B007,27190,27287,Glisolles,27,,,272870000C0168,,,,,,,,,,,,,0,1,Maison,89,4,AG,terrains d'agrément,,,2046,0.987988,48.98008
2021-378144,2021-09-09,000001,Vente,236700,12,,LE BOIS DES FORTIERES,B007,27190,27287,Glisolles,27,,,272870000C0168,,,,,,,,,,,,,0,1,Maison,89,4,S,sols,,,500,0.987988,48.98008
2021-378773,2021-09-09,000002,Vente,130000,60,,BOIS D OISSEL,B003,27190,27287,Glisolles,27,,,272870000A0585,,,,,,,,,,,,,0,1,Maison,130,5,,,,,,0.996419,48.998397
2021-378776,2021-09-15,000001,Vente,84000,135,,BOIS D OISSEL,B003,27190,27287,Glisolles,27,,,272870000A0441,,,,,,,,,,,,,0,3,Dépendance,,0,S,sols,,,1330,0.995769,48.999149
2021-378776,2021-09-15,000001,Vente,84000,135,,BOIS D OISSEL,B003,27190,27287,Glisolles,27,,,272870000A0441,,,,,,,,,,,,,0,1,Maison,61,3,S,sols,,,1330,0.995769,48.999149
2021-378776,2021-09-15,000001,Vente,84000,,,BOIS D OISSEL,B003,27190,27287,Glisolles,27,,,272870000A0442,,,,,,,,,,,,,0,,,,,AG,terrains d'agrément,,,428,0.995895,48.999019
2021-378927,2021-09-18,000001,Vente,150000,6,,RUE DU DUC DE CLERMONT TONNERR,0016,27190,27287,Glisolles,27,,,272870000B0909,,,,,,,,,,,,,0,1,Maison,60,3,S,sols,,,500,1.018117,48.984322
2021-378927,2021-09-18,000001,Vente,150000,6,,RUE DU DUC DE CLERMONT TONNERR,0016,27190,27287,Glisolles,27,,,272870000B0909,,,,,,,,,,,,,0,1,Maison,60,3,AG,terrains d'agrément,,,522,1.018117,48.984322
2021-379308,2021-09-29,000001,Vente,70000,9440,,RTE DE FERRIERES HAUT CLOCHER,0017,27190,27287,Glisolles,27,,,272870000A0440,,,,,,,,,,,,,0,1,Maison,61,3,S,sols,,,1561,0.995593,48.999565
2021-379308,2021-09-29,000001,Vente,70000,9440,,RTE DE FERRIERES HAUT CLOCHER,0017,27190,27287,Glisolles,27,,,272870000A0440,,,,,,,,,,,,,0,3,Dépendance,,0,S,sols,,,1561,0.995593,48.999565
2021-380750,2021-10-29,000001,Vente,70000,92,,ALL DES BOULEAUX,0008,27190,27287,Glisolles,27,,,272870000B0662,,,,,,,,,,,,,0,1,Maison,50,3,S,sols,,,500,1.008482,48.993675
2021-380750,2021-10-29,000001,Vente,70000,92,,ALL DES BOULEAUX,0008,27190,27287,Glisolles,27,,,272870000B0662,,,,,,,,,,,,,0,1,Maison,50,3,AG,terrains d'agrément,,,2345,1.008482,48.993675
2021-381151,2021-11-26,000001,Vente,185000,,,LA BRETONNIERE,B018,27190,27287,Glisolles,27,,,272870000A0590,,,,,,,,,,,,,0,,,,,S,sols,,,26,1.004775,49.003755
2021-381985,2021-12-15,000001,Vente,95599.15,,,GLISOLLES,B036,27190,27287,Glisolles,27,,,272870000B0089,,,,,,,,,,,,,0,,,,,J,jardins,POTAG,Jardin potager,1645,1.022739,48.982808
2021-381985,2021-12-15,000001,Vente,95599.15,3,,RTE DE DAMVILLE,0064,27190,27287,Glisolles,27,,,272870000B0090,,,,,,,,,,,,,0,1,Maison,80,3,S,sols,,,1660,1.022607,48.983248
