id_mutation,date_mutation,numero_disposition,nature_mutation,valeur_fonciere,adresse_numero,adresse_suffixe,adresse_nom_voie,adresse_code_voie,code_postal,code_commune,nom_commune,code_departement,ancien_code_commune,ancien_nom_commune,id_parcelle,ancien_id_parcelle,numero_volume,lot1_numero,lot1_surface_carrez,lot2_numero,lot2_surface_carrez,lot3_numero,lot3_surface_carrez,lot4_numero,lot4_surface_carrez,lot5_numero,lot5_surface_carrez,nombre_lots,code_type_local,type_local,surface_reelle_bati,nombre_pieces_principales,code_nature_culture,nature_culture,code_nature_culture_speciale,nature_culture_speciale,surface_terrain,longitude,latitude
2021-370119,2021-03-11,000001,Vente,225000,34,B,RUE DE LA PLANQUETTE,0015,27610,27493,Romilly-sur-Andelle,27,,,27493000AD0146,,,,,,,,,,,,,0,1,Maison,130,7,S,sols,,,1060,1.267656,49.333299
2021-370168,2021-02-23,000001,Vente,89235.61,8,,RUE BONAPARTE,0090,27610,27493,Romilly-sur-Andelle,27,,,27493000AD0413,,,,,,,,,,,,,0,1,Maison,127,5,S,sols,,,802,1.271597,49.33116
2021-371101,2021-03-23,000001,Vente,57000,,,LA BERGERIE,B001,27610,27493,Romilly-sur-Andelle,27,,,274930000A0454,,,,,,,,,,,,,0,,,,,AB,terrains a bâtir,,,486,1.25381,49.334222
2021-371120,2021-03-19,000001,Vente,68900,,,L EPINETTE,B010,27610,27493,Romilly-sur-Andelle,27,,,27493000ZB0040,,,,,,,,,,,,,0,,,,,AB,terrains a bâtir,,,586,1.244404,49.327319
2021-371375,2021-04-13,000001,Vente,68900,,,L EPINETTE,B010,27610,27493,Romilly-sur-Andelle,27,,,27493000ZB0041,,,,,,,,,,,,,0,,,,,AB,terrains a bâtir,,,589,1.244484,49.327146
2021-371384,2021-03-30,000001,Vente,66500,,,L EPINETTE,B010,27610,27493,Romilly-sur-Andelle,27,,,27493000ZB0051,,,,,,,,,,,,,0,,,,,AB,terrains a bâtir,,,612,1.245119,49.32719
2021-371389,2021-04-15,000001,Vente,67000,,,L EPINETTE,B010,27610,27493,Romilly-sur-Andelle,27,,,27493000ZB0050,,,,,,,,,,,,,0,,,,,AB,terrains a bâtir,,,623,1.24524,49.327027
2021-371390,2021-04-02,000001,Vente,67000,,,L EPINETTE,B010,27610,27493,Romilly-sur-Andelle,27,,,27493000ZB0049,,,,,,,,,,,,,0,,,,,AB,terrains a bâtir,,,621,1.245352,49.326883
2021-371475,2021-04-03,000001,Vente,63900,,,L EPINETTE,B010,27610,27493,Romilly-sur-Andelle,27,,,27493000ZB0054,,,,,,,,,,,,,0,,,,,AB,terrains a bâtir,,,667,1.244862,49.327764
2021-371481,2021-04-20,000001,Vente,68000,,,L EPINETTE,B010,27610,27493,Romilly-sur-Andelle,27,,,27493000ZB0043,,,,,,,,,,,,,0,,,,,AB,terrains a bâtir,,,554,1.244715,49.326872
2021-371498,2021-04-16,000001,Vente,69900,,,L EPINETTE,B010,27610,27493,Romilly-sur-Andelle,27,,,27493000ZB0046,,,,,,,,,,,,,0,,,,,AB,terrains a bâtir,,,647,1.245733,49.326439
2021-371754,2021-04-02,000001,Vente,82000,48,,RUE SAINT GEORGES,0045,27610,27493,Romilly-sur-Andelle,27,,,27493000AB0053,,,,,,,,,,,,,0,1,Maison,49,3,S,sols,,,223,1.260445,49.33359
2021-371754,2021-04-02,000001,Vente,82000,48,,RUE SAINT GEORGES,0045,27610,27493,Romilly-sur-Andelle,27,,,27493000AB0053,,,,,,,,,,,,,0,3,Dépendance,,0,S,sols,,,223,1.260445,49.33359
2021-371785,2021-04-23,000001,Vente,69500,,,L EPINETTE,B010,27610,27493,Romilly-sur-Andelle,27,,,27493000ZB0037,,,,,,,,,,,,,0,,,,,AB,terrains a bâtir,,,618,1.244529,49.327676
2021-372014,2021-04-20,000001,Vente,110000,17,,RUE NEUVE,0040,27610,27493,Romilly-sur-Andelle,27,,,27493000AB0370,,,,,,,,,,,,,0,3,Dépendance,,0,S,sols,,,129,1.25712,49.33085
2021-372014,2021-04-20,000001,Vente,110000,17,,RUE NEUVE,0040,27610,27493,Romilly-sur-Andelle,27,,,27493000AB0370,,,,,,,,,,,,,0,1,Maison,69,4,S,sols,,,129,1.25712,49.33085
2021-372014,2021-04-20,000001,Vente,110000,,,LE MARAIS,B021,27610,27493,Romilly-sur-Andelle,27,,,27493000AB0374,,,,,,,,,,,,,0,,,,,S,sols,,,15,1.257266,49.330638
2021-372053,2021-04-29,000001,Vente,120000,1404,,RUE BLINGUE,0005,27610,27493,Romilly-sur-Andelle,27,,,27493000AH0325,,,,,,,,,,,,,0,1,Maison,49,3,S,sols,,,164,1.256464,49.327856
2021-372053,2021-04-29,000001,Vente,120000,,,RUE BLINGUE,0005,27610,27493,Romilly-sur-Andelle,27,,,27493000AH0327,,,,,,,,,,,,,0,,,,,S,sols,,,70,1.256488,49.327978
2021-372123,2021-04-24,000001,Vente,300000,7,,CHE DU MOULIN POUCHET,0036,27610,27493,Romilly-sur-Andelle,27,,,27493000AD0186,,,,,,,,,,,,,0,1,Maison,163,7,S,sols,,,490,1.273756,49.328773
2021-372123,2021-04-24,000001,Vente,300000,7,,CHE DU MOULIN POUCHET,0036,27610,27493,Romilly-sur-Andelle,27,,,27493000AD0186,,,,,,,,,,,,,0,4,Local industriel. commercial ou assimilé,107,0,S,sols,,,490,1.273756,49.328773
2021-372253,2021-04-22,000001,Vente,150000,,,PERPIGNAN FONDERIE ROMILLY,B032,27610,27493,Romilly-sur-Andelle,27,,,27493000AE0220,,,,,,,,,,,,,0,,,,,S,sols,,,196,1.252932,49.322779
2021-372253,2021-04-22,000001,Vente,150000,9003,,AV DE LA GARE,0050,27610,27493,Romilly-sur-Andelle,27,,,27493000AE0222,,,,,,,,,,,,,0,4,Local industriel. commercial ou assimilé,207,0,S,sols,,,2865,1.251907,49.322703
2021-372381,2021-05-14,000001,Vente,65500,,,L EPINETTE,B010,27610,27493,Romilly-sur-Andelle,27,,,27493000ZB0047,,,,,,,,,,,,,0,,,,,AB,terrains a bâtir,,,605,1.24551,49.32658
2021-372389,2021-05-14,000001,Vente,69900,,,L EPINETTE,B010,27610,27493,Romilly-sur-Andelle,27,,,27493000ZB0039,,,,,,,,,,,,,0,,,,,AB,terrains a bâtir,,,702,1.244331,49.327453
2021-372530,2021-05-17,000001,Vente,67900,,,L EPINETTE,B010,27610,27493,Romilly-sur-Andelle,27,,,27493000ZB0052,,,,,,,,,,,,,0,,,,,AB,terrains a bâtir,,,602,1.245032,49.327321
2021-372553,2021-05-17,000001,Vente,177000,111,,RUE DE LA LIBERATION,0010,27610,27493,Romilly-sur-Andelle,27,,,274930000A0207,,,,,,,,,,,,,0,1,Maison,73,5,J,jardins,POTAG,Jardin potager,1092,1.246662,49.331508
2021-372553,2021-05-17,000001,Vente,177000,111,,RUE DE LA LIBERATION,0010,27610,27493,Romilly-sur-Andelle,27,,,274930000A0207,,,,,,,,,,,,,0,1,Maison,73,5,S,sols,,,88,1.246662,49.331508
2021-372746,2021-05-06,000001,Vente,128000,134,,RUE BLINGUE,0005,27610,27493,Romilly-sur-Andelle,27,,,27493000AD0058,,,,,,,,,,,,,0,1,Maison,100,4,S,sols,,,100,1.271327,49.332184
2021-372746,2021-05-06,000001,Vente,128000,134,,RUE BLINGUE,0005,27610,27493,Romilly-sur-Andelle,27,,,27493000AD0058,,,,,,,,,,,,,0,3,Dépendance,,0,S,sols,,,100,1.271327,49.332184
2021-372746,2021-05-06,000001,Vente,128000,,,LA RUE BLINGUE,B046,27610,27493,Romilly-sur-Andelle,27,,,27493000AD0059,,,,,,,,,,,,,0,,,,,S,sols,,,91,1.271409,49.332144
2021-372746,2021-05-06,000001,Vente,128000,,,LA RUE BLINGUE,B046,27610,27493,Romilly-sur-Andelle,27,,,27493000AD0060,,,,,,,,,,,,,0,,,,,S,sols,,,337,1.271463,49.332063
2021-372746,2021-05-06,000001,Vente,128000,,,LA RUE BLINGUE,B046,27610,27493,Romilly-sur-Andelle,27,,,27493000AD0239,,,,,,,,,,,,,0,,,,,S,sols,,,29,1.271521,49.332296
2021-372746,2021-05-06,000001,Vente,128000,,,LA RUE BLINGUE,B046,27610,27493,Romilly-sur-Andelle,27,,,27493000AD0240,,,,,,,,,,,,,0,,,,,J,jardins,POTAG,Jardin potager,134,1.271436,49.33227
2021-372746,2021-05-06,000001,Vente,128000,,,LA RUE BLINGUE,B046,27610,27493,Romilly-sur-Andelle,27,,,27493000AD0241,,,,,,,,,,,,,0,,,,,S,sols,,,35,1.271613,49.332179
2021-372746,2021-05-06,000001,Vente,128000,,,LA RUE BLINGUE,B046,27610,27493,Romilly-sur-Andelle,27,,,27493000AD0242,,,,,,,,,,,,,0,,,,,S,sols,,,37,1.271427,49.332236
2021-372933,2021-05-07,000002,Vente,150000,337,,CHE DU MACONNAIS,0025,27610,27493,Romilly-sur-Andelle,27,,,27493000AE0418,,,,,,,,,,,,,0,3,Dépendance,,0,,,,,,1.253884,49.325215
2021-372933,2021-05-07,000002,Vente,150000,337,,CHE DU MACONNAIS,0025,27610,27493,Romilly-sur-Andelle,27,,,27493000AE0418,,,,,,,,,,,,,0,1,Maison,115,3,,,,,,1.253884,49.325215
2021-372933,2021-05-07,000002,Vente,150000,337,,CHE DU MACONNAIS,0025,27610,27493,Romilly-sur-Andelle,27,,,27493000AE0418,,,,,,,,,,,,,0,1,Maison,131,5,,,,,,1.253884,49.325215
2021-372933,2021-05-07,000002,Vente,150000,337,,CHE DU MACONNAIS,0025,27610,27493,Romilly-sur-Andelle,27,,,27493000AE0418,,,,,,,,,,,,,0,3,Dépendance,,0,,,,,,1.253884,49.325215
2021-372933,2021-05-07,000002,Vente,150000,,,CHE DU MACONNAIS,0025,27610,27493,Romilly-sur-Andelle,27,,,27493000AE0420,,,,,,,,,,,,,0,,,,,S,sols,,,287,1.253649,49.325216
2021-372933,2021-05-07,000002,Vente,150000,,,CHE DU MACONNAIS,0025,27610,27493,Romilly-sur-Andelle,27,,,27493000AE0421,,,,,,,,,,,,,0,,,,,S,sols,,,52,1.253401,49.325455
2021-373051,2021-05-10,000001,Vente,96500,18,C,RUE DES HAUTES RIVES,0022,27610,27493,Romilly-sur-Andelle,27,,,27493000AC0371,,,,,,,,,,,,,0,1,Maison,71,3,S,sols,,,105,1.25943,49.324631
2021-373051,2021-05-10,000001,Vente,96500,,,LE MOULIN DES DEUX AMANTS,B025,27610,27493,Romilly-sur-Andelle,27,,,27493000AC0378,,,,,,,,,,,,,0,,,,,S,sols,,,104,1.258924,49.324579
2021-373051,2021-05-10,000001,Vente,96500,,,LE MOULIN DES DEUX AMANTS,B025,27610,27493,Romilly-sur-Andelle,27,,,27493000AC0379,,,,,,,,,,,,,0,,,,,S,sols,,,141,1.259365,49.324733
2021-373051,2021-05-10,000001,Vente,96500,,,LE MOULIN DES DEUX AMANTS,B025,27610,27493,Romilly-sur-Andelle,27,,,27493000AC0386,,,,,,,,,,,,,0,,,,,S,sols,,,220,1.259087,49.324682
2021-373051,2021-05-10,000001,Vente,96500,,,PERPIGNAN FONDERIE ROMILLY,B032,27610,27493,Romilly-sur-Andelle,27,,,27493000AE0152,,,,,,,,,,,,,0,,,,,S,sols,,,346,1.258326,49.32437
2021-373051,2021-05-10,000001,Vente,96500,,,PERPIGNAN FONDERIE ROMILLY,B032,27610,27493,Romilly-sur-Andelle,27,,,27493000AE0153,,,,,,,,,,,,,0,,,,,S,sols,,,319,1.258268,49.324419
2021-373084,2021-05-07,000001,Vente,150000,,,PERPIGNAN FONDERIE ROMILLY,B032,27610,27493,Romilly-sur-Andelle,27,,,27493000AE0208,,,,,,,,,,,,,0,,,,,AG,terrains d'agrément,,,184,1.253855,49.325638
2021-373084,2021-05-07,000001,Vente,150000,,,PERPIGNAN FONDERIE ROMILLY,B032,27610,27493,Romilly-sur-Andelle,27,,,27493000AE0211,,,,,,,,,,,,,0,,,,,AG,terrains d'agrément,,,528,1.253546,49.325523
2021-373084,2021-05-07,000001,Vente,150000,337,B,CHE DU MACONNAIS,0025,27610,27493,Romilly-sur-Andelle,27,,,27493000AE0419,,,,,,,,,,,,,0,1,Maison,131,5,S,sols,,,470,1.253919,49.32544
2021-373084,2021-05-07,000001,Vente,150000,337,B,CHE DU MACONNAIS,0025,27610,27493,Romilly-sur-Andelle,27,,,27493000AE0419,,,,,,,,,,,,,0,3,Dépendance,,0,S,sols,,,470,1.253919,49.32544
2021-373168,2021-05-28,000001,Vente,132050,,,LA GRANDE RUELLE,B017,27610,27493,Romilly-sur-Andelle,27,,,27493000AH0642,,,,,,,,,,,,,0,,,,,S,sols,,,80,1.252164,49.332579
2021-373168,2021-05-28,000001,Vente,132050,,,LA GRANDE RUELLE,B017,27610,27493,Romilly-sur-Andelle,27,,,27493000AH0643,,,,,,,,,,,,,0,,,,,S,sols,,,32,1.252201,49.33263
2021-373168,2021-05-28,000001,Vente,132050,,,RUE DE LA LIBERATION,0010,27610,27493,Romilly-sur-Andelle,27,,,27493000AH0646,,,,,,,,,,,,,0,,,,,S,sols,,,143,1.252346,49.332662
2021-373183,2021-05-19,000001,Vente,141000,,,LA GRANDE RUELLE,B017,27610,27493,Romilly-sur-Andelle,27,,,27493000AH0641,,,,,,,,,,,,,0,,,,,S,sols,,,96,1.252101,49.332672
2021-373183,2021-05-19,000001,Vente,141000,,,LA GRANDE RUELLE,B017,27610,27493,Romilly-sur-Andelle,27,,,27493000AH0642,,,,,,,,,,,,,0,,,,,S,sols,,,80,1.252164,49.332579
2021-373183,2021-05-19,000001,Vente,141000,,,RUE DE LA LIBERATION,0010,27610,27493,Romilly-sur-Andelle,27,,,27493000AH0645,,,,,,,,,,,,,0,,,,,S,sols,,,156,1.252285,49.332738
2021-373270,2021-05-20,000001,Vente,70000,5,,RUE CLAUDE MONET,0031,27610,27493,Romilly-sur-Andelle,27,,,27493000AD0200,,,,,,,,,,,,,0,3,Dépendance,,0,AG,terrains d'agrément,,,748,1.270885,49.329952
2021-373270,2021-05-20,000001,Vente,70000,5,,RUE CLAUDE MONET,0031,27610,27493,Romilly-sur-Andelle,27,,,27493000AD0200,,,,,,,,,,,,,0,1,Maison,84,3,AG,terrains d'agrément,,,748,1.270885,49.329952
2021-373270,2021-05-20,000001,Vente,70000,5,,RUE CLAUDE MONET,0031,27610,27493,Romilly-sur-Andelle,27,,,27493000AD0200,,,,,,,,,,,,,0,3,Dépendance,,0,S,sols,,,500,1.270885,49.329952
2021-373270,2021-05-20,000001,Vente,70000,5,,RUE CLAUDE MONET,0031,27610,27493,Romilly-sur-Andelle,27,,,27493000AD0200,,,,,,,,,,,,,0,1,Maison,84,3,S,sols,,,500,1.270885,49.329952
2021-373322,2021-05-28,000001,Vente,1500000,,,FORET DE LONGBOEL,B012,27610,27493,Romilly-sur-Andelle,27,,,274930000A0225,,,,,,,,,,,,,0,,,,,BS,taillis sous futaie,,,919680,1.273758,49.342464
2021-373410,2021-05-10,000002,Vente,214500,,,LE VILLAGE,B056,27610,27493,Romilly-sur-Andelle,27,,,27493000AB0799,,1,,,,,,,,,,,0,,,,,,,,,,1.260698,49.330781
2021-373410,2021-05-10,000002,Vente,214500,2,,RUE AUX ORMES,0041,27610,27493,Romilly-sur-Andelle,27,,,27493000AB0800,,,,,,,,,,,,,0,1,Maison,88,4,S,sols,,,338,1.260791,49.330648
2021-373410,2021-05-10,000002,Vente,214500,,,RUE AUX ORMES,0041,27610,27493,Romilly-sur-Andelle,27,,,27493000AB0888,,,,,,,,,,,,,0,,,,,S,sols,,,20,1.260891,49.330556
2021-373568,2021-05-31,000001,Vente,233200,186,,AV DE LA GARE,0050,27610,27493,Romilly-sur-Andelle,27,,,274930000C0146,,,,,,,,,,,,,0,1,Maison,119,4,S,sols,,,805,1.247592,49.329443
2021-373575,2021-06-01,000001,Vente,67000,,,LE MOULIN DES DEUX AMANTS,B025,27610,27493,Romilly-sur-Andelle,27,,,27493000AC0378,,,,,,,,,,,,,0,,,,,S,sols,,,104,1.258924,49.324579
2021-373575,2021-06-01,000001,Vente,67000,,,LE MOULIN DES DEUX AMANTS,B025,27610,27493,Romilly-sur-Andelle,27,,,27493000AC0379,,,,,,,,,,,,,0,,,,,S,sols,,,141,1.259365,49.324733
2021-373575,2021-06-01,000001,Vente,67000,,,LE MOULIN DES DEUX AMANTS,B025,27610,27493,Romilly-sur-Andelle,27,,,27493000AC0386,,,,,,,,,,,,,0,,,,,S,sols,,,220,1.259087,49.324682
2021-373575,2021-06-01,000001,Vente,67000,22,B,RUE DES HAUTES RIVES,0022,27610,27493,Romilly-sur-Andelle,27,,,27493000AE0146,,,,,,,,,,,,,0,3,Dépendance,,0,S,sols,,,100,1.258299,49.324267
2021-373575,2021-06-01,000001,Vente,67000,22,B,RUE DES HAUTES RIVES,0022,27610,27493,Romilly-sur-Andelle,27,,,27493000AE0146,,,,,,,,,,,,,0,1,Maison,57,3,S,sols,,,100,1.258299,49.324267
2021-373575,2021-06-01,000001,Vente,67000,,,PERPIGNAN FONDERIE ROMILLY,B032,27610,27493,Romilly-sur-Andelle,27,,,27493000AE0152,,,,,,,,,,,,,0,,,,,S,sols,,,346,1.258326,49.32437
2021-373575,2021-06-01,000001,Vente,67000,,,PERPIGNAN FONDERIE ROMILLY,B032,27610,27493,Romilly-sur-Andelle,27,,,27493000AE0153,,,,,,,,,,,,,0,,,,,S,sols,,,319,1.258268,49.324419
2021-373575,2021-06-01,000001,Vente,67000,,,PERPIGNAN FONDERIE ROMILLY,B032,27610,27493,Romilly-sur-Andelle,27,,,27493000AE0169,,,,,,,,,,,,,0,,,,,S,sols,,,32,1.258099,49.324413
2021-373575,2021-06-01,000001,Vente,67000,,,PERPIGNAN FONDERIE ROMILLY,B032,27610,27493,Romilly-sur-Andelle,27,,,27493000AE0170,,,,,,,,,,,,,0,,,,,S,sols,,,32,1.258162,49.324445
2021-373726,2021-05-19,000002,Vente,130000,,,LA GRANDE RUELLE,B017,27610,27493,Romilly-sur-Andelle,27,,,27493000AH0644,,,,,,,,,,,,,0,,,,,VE,vergers,,,62,1.252227,49.332531
2021-373726,2021-05-19,000002,Vente,130000,,,RUE DE LA LIBERATION,0010,27610,27493,Romilly-sur-Andelle,27,,,27493000AH0647,,,,,,,,,,,,,0,,,,,S,sols,,,144,1.252367,49.332575
2021-373946,2021-06-10,000001,Vente,151000,40,,RUE NEUVE,0040,27610,27493,Romilly-sur-Andelle,27,,,27493000AH0121,,,,,,,,,,,,,0,1,Maison,70,4,S,sols,,,83,1.249476,49.32877
2021-373946,2021-06-10,000001,Vente,151000,40,,RUE NEUVE,0040,27610,27493,Romilly-sur-Andelle,27,,,27493000AH0121,,,,,,,,,,,,,0,1,Maison,70,4,J,jardins,POTAG,Jardin potager,902,1.249476,49.32877
2021-374467,2021-06-24,000002,Vente,115000,923,,RUE BLINGUE,0005,27610,27493,Romilly-sur-Andelle,27,,,27493000AC0638,,,,,,,,,,,,,0,4,Local industriel. commercial ou assimilé,250,0,S,sols,,,724,1.262505,49.329412
2021-374467,2021-06-24,000002,Vente,115000,923,,RUE BLINGUE,0005,27610,27493,Romilly-sur-Andelle,27,,,27493000AC0638,,,,,,,,,,,,,0,1,Maison,84,4,S,sols,,,724,1.262505,49.329412
2021-374737,2021-07-03,000001,Vente,295000,8,,CHE DU CALVAIRE,0007,27610,27493,Romilly-sur-Andelle,27,,,27493000AH0584,,,,,,,,,,,,,0,1,Maison,130,5,S,sols,,,1082,1.253231,49.328508
2021-374893,2021-06-14,000001,Vente,3500,,,PERPIGNAN FONDERIE ROMILLY,B032,27610,27493,Romilly-sur-Andelle,27,,,27493000AE0323,,,,,,,,,,,,,0,,,,,S,sols,,,57,1.251744,49.325348
2021-374893,2021-06-14,000001,Vente,3500,,,PERPIGNAN FONDERIE ROMILLY,B032,27610,27493,Romilly-sur-Andelle,27,,,27493000AE0331,,,,,,,,,,,,,0,,,,,S,sols,,,19,1.252041,49.325521
2021-374893,2021-06-14,000001,Vente,3500,,,PERPIGNAN FONDERIE ROMILLY,B032,27610,27493,Romilly-sur-Andelle,27,,,27493000AE0334,,,,,,,,,,,,,0,,,,,S,sols,,,190,1.252022,49.325454
2021-374909,2021-06-14,000001,Vente,3500,,,PERPIGNAN FONDERIE ROMILLY,B032,27610,27493,Romilly-sur-Andelle,27,,,27493000AE0323,,,,,,,,,,,,,0,,,,,S,sols,,,57,1.251744,49.325348
2021-374909,2021-06-14,000001,Vente,3500,,,PERPIGNAN FONDERIE ROMILLY,B032,27610,27493,Romilly-sur-Andelle,27,,,27493000AE0329,,,,,,,,,,,,,0,,,,,S,sols,,,19,1.251949,49.325492
2021-374909,2021-06-14,000001,Vente,3500,,,PERPIGNAN FONDERIE ROMILLY,B032,27610,27493,Romilly-sur-Andelle,27,,,27493000AE0334,,,,,,,,,,,,,0,,,,,S,sols,,,190,1.252022,49.325454
2021-375197,2021-06-29,000001,Vente,295000,1633,,RUE BLINGUE,0005,27610,27493,Romilly-sur-Andelle,27,,,27493000AH0106,,,,,,,,,,,,,0,3,Dépendance,,0,AG,terrains d'agrément,,,1190,1.253836,49.327587
2021-375197,2021-06-29,000001,Vente,295000,1633,,RUE BLINGUE,0005,27610,27493,Romilly-sur-Andelle,27,,,27493000AH0106,,,,,,,,,,,,,0,1,Maison,119,4,AG,terrains d'agrément,,,1190,1.253836,49.327587
2021-375197,2021-06-29,000001,Vente,295000,1633,,RUE BLINGUE,0005,27610,27493,Romilly-sur-Andelle,27,,,27493000AH0106,,,,,,,,,,,,,0,1,Maison,119,4,S,sols,,,500,1.253836,49.327587
2021-375197,2021-06-29,000001,Vente,295000,1633,,RUE BLINGUE,0005,27610,27493,Romilly-sur-Andelle,27,,,27493000AH0106,,,,,,,,,,,,,0,3,Dépendance,,0,S,sols,,,500,1.253836,49.327587
2021-375251,2021-06-29,000001,Vente,179000,7,,RUE DU PRIEURE,0093,27610,27493,Romilly-sur-Andelle,27,,,27493000AB0734,,,,,,,,,,,,,0,1,Maison,88,4,S,sols,,,890,1.259592,49.335271
2021-375254,2021-06-25,000001,Vente,45000,,,LE VILLAGE,B056,27610,27493,Romilly-sur-Andelle,27,,,27493000AB0883,,,,,,,,,,,,,0,,,,,VE,vergers,,,103,1.263499,49.332009
2021-375433,2021-07-19,000001,Vente,130000,18,,RUE DES HAUTES RIVES,0022,27610,27493,Romilly-sur-Andelle,27,,,27493000AC0368,,,,,,,,,,,,,0,1,Maison,77,4,S,sols,,,280,1.259671,49.324756
2021-375433,2021-07-19,000001,Vente,130000,,,LE MOULIN DES DEUX AMANTS,B025,27610,27493,Romilly-sur-Andelle,27,,,27493000AC0378,,,,,,,,,,,,,0,,,,,S,sols,,,104,1.258924,49.324579
2021-375433,2021-07-19,000001,Vente,130000,,,LE MOULIN DES DEUX AMANTS,B025,27610,27493,Romilly-sur-Andelle,27,,,27493000AC0379,,,,,,,,,,,,,0,,,,,S,sols,,,141,1.259365,49.324733
2021-375433,2021-07-19,000001,Vente,130000,,,LE MOULIN DES DEUX AMANTS,B025,27610,27493,Romilly-sur-Andelle,27,,,27493000AC0386,,,,,,,,,,,,,0,,,,,S,sols,,,220,1.259087,49.324682
2021-375433,2021-07-19,000001,Vente,130000,,,PERPIGNAN FONDERIE ROMILLY,B032,27610,27493,Romilly-sur-Andelle,27,,,27493000AE0152,,,,,,,,,,,,,0,,,,,S,sols,,,346,1.258326,49.32437
2021-375433,2021-07-19,000001,Vente,130000,,,PERPIGNAN FONDERIE ROMILLY,B032,27610,27493,Romilly-sur-Andelle,27,,,27493000AE0153,,,,,,,,,,,,,0,,,,,S,sols,,,319,1.258268,49.324419
2021-375446,2021-07-19,000001,Vente,163500,2,A,RUE SAINT GEORGES,0045,27610,27493,Romilly-sur-Andelle,27,,,27493000AB0796,,,,,,,,,,,,,0,2,Appartement,70,3,S,sols,,,119,1.260121,49.33472
2021-375446,2021-07-19,000001,Vente,163500,2,A,RUE SAINT GEORGES,0045,27610,27493,Romilly-sur-Andelle,27,,,27493000AB0796,,,,,,,,,,,,,0,2,Appartement,47,2,S,sols,,,119,1.260121,49.33472
2021-375446,2021-07-19,000001,Vente,163500,2,D,RUE SAINT GEORGES,0045,27610,27493,Romilly-sur-Andelle,27,,,27493000AB0797,,2,,,,,,,,,,,0,,,,,,,,,,1.260043,49.334765
2021-375580,2021-07-24,000001,Vente,117600,13,,RUE SAINT GEORGES,0045,27610,27493,Romilly-sur-Andelle,27,,,27493000AB0362,,,,,,,,,,,,,0,1,Maison,78,5,S,sols,,,400,1.261292,49.334506
2021-375580,2021-07-24,000001,Vente,117600,,,LE VILLAGE,B056,27610,27493,Romilly-sur-Andelle,27,,,27493000AB0363,,,,,,,,,,,,,0,,,,,S,sols,,,4,1.261397,49.334554
2021-375622,2021-07-26,000001,Vente,215250,14,,SEN DES JARDINS DU LEVANT,0008,27610,27493,Romilly-sur-Andelle,27,,,27493000AC0084,,,,,,,,,,,,,0,3,Dépendance,,0,J,jardins,POTAG,Jardin potager,278,1.262674,49.330671
2021-375622,2021-07-26,000001,Vente,215250,14,,SEN DES JARDINS DU LEVANT,0008,27610,27493,Romilly-sur-Andelle,27,,,27493000AC0084,,,,,,,,,,,,,0,3,Dépendance,,0,S,sols,,,323,1.262674,49.330671
2021-375622,2021-07-26,000001,Vente,215250,14,,SEN DES JARDINS DU LEVANT,0008,27610,27493,Romilly-sur-Andelle,27,,,27493000AC0084,,,,,,,,,,,,,0,1,Maison,92,4,J,jardins,POTAG,Jardin potager,278,1.262674,49.330671
2021-375622,2021-07-26,000001,Vente,215250,14,,SEN DES JARDINS DU LEVANT,0008,27610,27493,Romilly-sur-Andelle,27,,,27493000AC0084,,,,,,,,,,,,,0,1,Maison,92,4,S,sols,,,323,1.262674,49.330671
2021-376167,2021-07-26,000001,Vente,202000,14,,RUE CHRISTIAN MAX ARINAL,0101,27610,27493,Romilly-sur-Andelle,27,,,27493000AB0781,,,,,,,,,,,,,0,1,Maison,104,5,S,sols,,,611,1.254137,49.332048
2021-376534,2021-06-25,000001,Vente,79357.94,4,,RUE DU CARILLON DE LA BASTILLE,0091,27610,27493,Romilly-sur-Andelle,27,,,27493000AE0378,,,,,,,,,,,,,0,1,Maison,100,5,S,sols,,,603,1.246472,49.328213
2021-376703,2021-06-25,000003,Vente,24000,,,LE VILLAGE,B056,27610,27493,Romilly-sur-Andelle,27,,,27493000AB0884,,,,,,,,,,,,,0,,,,,VE,vergers,,,180,1.263358,49.331954
2021-376718,2021-07-30,000001,Vente,197000,1006,,RUE BLINGUE,0005,27610,27493,Romilly-sur-Andelle,27,,,27493000AC0053,,,,,,,,,,,,,0,1,Maison,106,4,J,jardins,POTAG,Jardin potager,349,1.260898,49.329146
2021-376718,2021-07-30,000001,Vente,197000,1006,,RUE BLINGUE,0005,27610,27493,Romilly-sur-Andelle,27,,,27493000AC0053,,,,,,,,,,,,,0,3,Dépendance,,0,J,jardins,POTAG,Jardin potager,349,1.260898,49.329146
2021-376718,2021-07-30,000001,Vente,197000,1006,,RUE BLINGUE,0005,27610,27493,Romilly-sur-Andelle,27,,,27493000AC0053,,,,,,,,,,,,,0,1,Maison,106,4,S,sols,,,198,1.260898,49.329146
2021-376718,2021-07-30,000001,Vente,197000,1006,,RUE BLINGUE,0005,27610,27493,Romilly-sur-Andelle,27,,,27493000AC0053,,,,,,,,,,,,,0,3,Dépendance,,0,S,sols,,,198,1.260898,49.329146
2021-376718,2021-07-30,000001,Vente,197000,,,LE VILLAGE,B056,27610,27493,Romilly-sur-Andelle,27,,,27493000AC0161,,,,,,,,,,,,,0,,,,,J,jardins,POTAG,Jardin potager,146,1.261015,49.329179
2021-376724,2021-07-29,000001,Vente,90000,,,LE VILLAGE,B056,27610,27493,Romilly-sur-Andelle,27,,,27493000AB0059,,,,,,,,,,,,,0,,,,,J,jardins,POTAG,Jardin potager,347,1.259792,49.333737
2021-376724,2021-07-29,000001,Vente,90000,32,,RUE SAINT GEORGES,0045,27610,27493,Romilly-sur-Andelle,27,,,27493000AB0071,,,,,,,,,,,,,0,1,Maison,63,3,S,sols,,,98,1.26047,49.333986
2021-376845,2021-08-13,000001,Vente,150000,1598,,RUE BLINGUE,0005,27610,27493,Romilly-sur-Andelle,27,,,27493000AH0009,,,,,,,,,,,,,0,3,Dépendance,,0,VE,vergers,,,1220,1.25361,49.327996
2021-376845,2021-08-13,000001,Vente,150000,1598,,RUE BLINGUE,0005,27610,27493,Romilly-sur-Andelle,27,,,27493000AH0009,,,,,,,,,,,,,0,3,Dépendance,,0,S,sols,,,470,1.25361,49.327996
2021-376845,2021-08-13,000001,Vente,150000,1598,,RUE BLINGUE,0005,27610,27493,Romilly-sur-Andelle,27,,,27493000AH0009,,,,,,,,,,,,,0,1,Maison,123,5,S,sols,,,470,1.25361,49.327996
2021-376845,2021-08-13,000001,Vente,150000,1598,,RUE BLINGUE,0005,27610,27493,Romilly-sur-Andelle,27,,,27493000AH0009,,,,,,,,,,,,,0,1,Maison,123,5,VE,vergers,,,1220,1.25361,49.327996
2021-376936,2021-08-06,000001,Vente,68500,,,L EPINETTE,B010,27610,27493,Romilly-sur-Andelle,27,,,27493000ZB0045,,,,,,,,,,,,,0,,,,,AB,terrains a bâtir,,,531,1.244954,49.326547
2021-377597,2021-08-18,000001,Vente,252150,159,,AV DE LA GARE,0050,27610,27493,Romilly-sur-Andelle,27,,,27493000AH0462,,,,,,,,,,,,,0,1,Maison,106,5,S,sols,,,800,1.248516,49.329955
2021-377597,2021-08-18,000001,Vente,252150,,,LA BERGERIE,B001,27610,27493,Romilly-sur-Andelle,27,,,27493000AH0463,,,,,,,,,,,,,0,,,,,S,sols,,,94,1.248077,49.329831
2021-377637,2021-09-13,000001,Vente,228000,12,,RUE SAINT GEORGES,0045,27610,27493,Romilly-sur-Andelle,27,,,27493000AB0076,,,,,,,,,,,,,0,1,Maison,193,8,S,sols,,,250,1.260115,49.334283
2021-377637,2021-09-13,000001,Vente,228000,12,,RUE SAINT GEORGES,0045,27610,27493,Romilly-sur-Andelle,27,,,27493000AB0077,,,,,,,,,,,,,0,,,,,S,sols,,,50,1.260359,49.334382