id_mutation,date_mutation,numero_disposition,nature_mutation,valeur_fonciere,adresse_numero,adresse_suffixe,adresse_nom_voie,adresse_code_voie,code_postal,code_commune,nom_commune,code_departement,ancien_code_commune,ancien_nom_commune,id_parcelle,ancien_id_parcelle,numero_volume,lot1_numero,lot1_surface_carrez,lot2_numero,lot2_surface_carrez,lot3_numero,lot3_surface_carrez,lot4_numero,lot4_surface_carrez,lot5_numero,lot5_surface_carrez,nombre_lots,code_type_local,type_local,surface_reelle_bati,nombre_pieces_principales,code_nature_culture,nature_culture,code_nature_culture_speciale,nature_culture_speciale,surface_terrain,longitude,latitude
2021-370980,2021-03-13,000001,Vente,170,,,INTREMARE,B029,27110,27677,Venon,27,,,276770000C0398,,,,,,,,,,,,,0,,,,,S,sols,,,164,1.070007,49.165861
2021-370998,2021-03-13,000001,Vente,207800,12,,RTE DU TRAVERSIN,0048,27110,27677,Venon,27,,,276770000C0379,,,,,,,,,,,,,0,1,Maison,78,2,S,sols,,,500,1.070189,49.165771
2021-370998,2021-03-13,000001,Vente,207800,12,,RTE DU TRAVERSIN,0048,27110,27677,Venon,27,,,276770000C0379,,,,,,,,,,,,,0,1,Maison,78,2,J,jardins,,,710,1.070189,49.165771
2021-370998,2021-03-13,000001,Vente,207800,,,INTREMARE,B029,27110,27677,Venon,27,,,276770000C0398,,,,,,,,,,,,,0,,,,,S,sols,,,164,1.070007,49.165861
2021-372287,2021-04-27,000001,Echange,21100,,,LA MOTTE NORMAND,B033,27110,27677,Venon,27,,,276770000A0468,,,,,,,,,,,,,0,,,,,T,terres,,,12643,1.029575,49.1774
2021-372287,2021-04-27,000001,Echange,21100,,,LA MOTTE NORMAND,B033,27110,27677,Venon,27,,,276770000A0469,,,,,,,,,,,,,0,,,,,T,terres,,,10341,1.029802,49.177012
2021-372287,2021-04-27,000002,Echange,21100,,,LA MARE DUBOS,B032,27110,27677,Venon,27,,,276770000D0107,,,,,,,,,,,,,0,,,,,T,terres,,,3780,1.046375,49.170078
2021-372287,2021-04-27,000002,Echange,21100,,,LA MARE DUBOS,B032,27110,27677,Venon,27,,,276770000D0108,,,,,,,,,,,,,0,,,,,T,terres,,,1662,1.045974,49.16987
2021-372287,2021-04-27,000002,Echange,21100,,,LA MARE DUBOS,B032,27110,27677,Venon,27,,,276770000D0110,,,,,,,,,,,,,0,,,,,T,terres,,,562,1.045799,49.169862
2021-372287,2021-04-27,000002,Echange,21100,,,LA MARE DUBOS,B032,27110,27677,Venon,27,,,276770000D0115,,,,,,,,,,,,,0,,,,,BS,taillis sous futaie,,,2174,1.045572,49.169537
2021-372287,2021-04-27,000002,Echange,21100,,,LA MARE DUBOS,B032,27110,27677,Venon,27,,,276770000D0115,,,,,,,,,,,,,0,,,,,BT,taillis simples,,,2175,1.045572,49.169537
2021-372287,2021-04-27,000002,Echange,21100,,,LES BOSQUETS,B003,27110,27677,Venon,27,,,276770000D0118,,,,,,,,,,,,,0,,,,,T,terres,,,2426,1.044474,49.169488
2021-372287,2021-04-27,000002,Echange,21100,,,LES BOSQUETS,B003,27110,27677,Venon,27,,,276770000D0119,,,,,,,,,,,,,0,,,,,T,terres,,,1811,1.044338,49.169605
2021-372287,2021-04-27,000002,Echange,21100,,,LES BOSQUETS,B003,27110,27677,Venon,27,,,276770000D0120,,,,,,,,,,,,,0,,,,,T,terres,,,750,1.044012,49.169331
2021-372287,2021-04-27,000002,Echange,21100,,,LES BOSQUETS,B003,27110,27677,Venon,27,,,276770000D0121,,,,,,,,,,,,,0,,,,,BS,taillis sous futaie,,,743,1.044392,49.169977
2021-372287,2021-04-27,000002,Echange,21100,,,LES BOSQUETS,B003,27110,27677,Venon,27,,,276770000D0122,,,,,,,,,,,,,0,,,,,T,terres,,,791,1.044103,49.169776
2021-372287,2021-04-27,000002,Echange,21100,,,LES BOSQUETS,B003,27110,27677,Venon,27,,,276770000D0122,,,,,,,,,,,,,0,,,,,T,terres,,,790,1.044103,49.169776
2021-372287,2021-04-27,000002,Echange,21100,,,LA MARE DUBOS,B032,27110,27677,Venon,27,,,276770000D0211,,,,,,,,,,,,,0,,,,,P,prés,,,6095,1.047229,49.170092
2021-372288,2021-04-27,000001,Echange,171000,,,LA FOSSE PIETRY,B026,27110,27677,Venon,27,,,276770000A0041,,,,,,,,,,,,,0,,,,,BS,taillis sous futaie,,,660,1.034202,49.176181
2021-372288,2021-04-27,000001,Echange,171000,,,LA FOSSE PIETRY,B026,27110,27677,Venon,27,,,276770000A0044,,,,,,,,,,,,,0,,,,,BS,taillis sous futaie,,,540,1.034111,49.176124
2021-372288,2021-04-27,000001,Echange,171000,,,LA FOSSE PIETRY,B026,27110,27677,Venon,27,,,276770000A0045,,,,,,,,,,,,,0,,,,,BS,taillis sous futaie,,,472,1.033969,49.17613
2021-372288,2021-04-27,000001,Echange,171000,,,LA FOSSE PIETRY,B026,27110,27677,Venon,27,,,276770000A0048,,,,,,,,,,,,,0,,,,,BS,taillis sous futaie,,,457,1.033922,49.17607
2021-372288,2021-04-27,000001,Echange,171000,,,LA FOSSE PIETRY,B026,27110,27677,Venon,27,,,276770000A0049,,,,,,,,,,,,,0,,,,,BS,taillis sous futaie,,,1489,1.033769,49.175975
2021-372288,2021-04-27,000001,Echange,171000,,,LA FOSSE PIETRY,B026,27110,27677,Venon,27,,,276770000A0052,,,,,,,,,,,,,0,,,,,BS,taillis sous futaie,,,279,1.033553,49.17589
2021-372288,2021-04-27,000001,Echange,171000,,,LA FOSSE PIETRY,B026,27110,27677,Venon,27,,,276770000A0054,,,,,,,,,,,,,0,,,,,BS,taillis sous futaie,,,250,1.033481,49.175858
2021-372288,2021-04-27,000001,Echange,171000,,,LA FOSSE PIETRY,B026,27110,27677,Venon,27,,,276770000A0055,,,,,,,,,,,,,0,,,,,BS,taillis sous futaie,,,93,1.033448,49.175842
2021-372288,2021-04-27,000001,Echange,171000,,,LA FOSSE PIETRY,B026,27110,27677,Venon,27,,,276770000A0061,,,,,,,,,,,,,0,,,,,BS,taillis sous futaie,,,3561,1.035472,49.17476
2021-372288,2021-04-27,000001,Echange,171000,,,LA BATAILLE,B001,27110,27677,Venon,27,,,27677000ZA0002,,,,,,,,,,,,,0,,,,,T,terres,,,1054,1.03456,49.176343
2021-372288,2021-04-27,000001,Echange,171000,,,LA BATAILLE,B001,27110,27677,Venon,27,,,27677000ZA0018,,,,,,,,,,,,,0,,,,,P,prés,,,7101,1.036997,49.172978
2021-372288,2021-04-27,000001,Echange,171000,,,LA BATAILLE,B001,27110,27677,Venon,27,,,27677000ZA0018,,,,,,,,,,,,,0,,,,,T,terres,,,5364,1.036997,49.172978
2021-372288,2021-04-27,000001,Echange,171000,,,LA BATAILLE,B001,27110,27677,Venon,27,,,27677000ZA0020,,,,,,,,,,,,,0,,,,,P,prés,,,10183,1.037767,49.17325
2021-372288,2021-04-27,000001,Echange,171000,,,LA BATAILLE,B001,27110,27677,Venon,27,,,27677000ZA0022,,,,,,,,,,,,,0,,,,,T,terres,,,5075,1.038223,49.172655
2021-372288,2021-04-27,000001,Echange,171000,,,LA BATAILLE,B001,27110,27677,Venon,27,,,27677000ZA0039,,,,,,,,,,,,,0,,,,,T,terres,,,2680,1.039311,49.17338
2021-372288,2021-04-27,000001,Echange,171000,,,LA BATAILLE,B001,27110,27677,Venon,27,,,27677000ZA0039,,,,,,,,,,,,,0,,,,,T,terres,,,13399,1.039311,49.17338
2021-372288,2021-04-27,000001,Echange,171000,,,LA BATAILLE,B001,27110,27677,Venon,27,,,27677000ZA0039,,,,,,,,,,,,,0,,,,,T,terres,,,10514,1.039311,49.17338
2021-372288,2021-04-27,000001,Echange,171000,,,LA BATAILLE,B001,27110,27677,Venon,27,,,27677000ZA0040,,,,,,,,,,,,,0,,,,,T,terres,,,125854,1.038353,49.174271
2021-372288,2021-04-27,000002,Echange,171000,,,LE REPOSOIR,B037,27110,27677,Venon,27,,,276770000D0018,,,,,,,,,,,,,0,,,,,T,terres,,,168,1.038073,49.171562
2021-372288,2021-04-27,000002,Echange,171000,,,LE REPOSOIR,B037,27110,27677,Venon,27,,,276770000D0020,,,,,,,,,,,,,0,,,,,BT,taillis simples,,,4653,1.038387,49.171097
2021-372288,2021-04-27,000002,Echange,171000,,,LE REPOSOIR,B037,27110,27677,Venon,27,,,276770000D0042,,,,,,,,,,,,,0,,,,,BT,taillis simples,,,3066,1.039406,49.170565
2021-372288,2021-04-27,000002,Echange,171000,,,LA MARE DUBOS,B032,27110,27677,Venon,27,,,276770000D0113,,,,,,,,,,,,,0,,,,,BS,taillis sous futaie,,,2944,1.046272,49.168898
2021-372288,2021-04-27,000002,Echange,171000,,,LES BOSQUETS,B003,27110,27677,Venon,27,,,276770000D0124,,,,,,,,,,,,,0,,,,,T,terres,,,2283,1.043216,49.17052
2021-372288,2021-04-27,000002,Echange,171000,,,LES BOSQUETS,B003,27110,27677,Venon,27,,,276770000D0124,,,,,,,,,,,,,0,,,,,T,terres,,,2282,1.043216,49.17052
2021-372288,2021-04-27,000002,Echange,171000,,,LES BOSQUETS,B003,27110,27677,Venon,27,,,276770000D0125,,,,,,,,,,,,,0,,,,,T,terres,,,10916,1.042561,49.16978
2021-372288,2021-04-27,000002,Echange,171000,,,LES BOSQUETS,B003,27110,27677,Venon,27,,,276770000D0125,,,,,,,,,,,,,0,,,,,T,terres,,,10915,1.042561,49.16978
2021-372288,2021-04-27,000002,Echange,171000,,,LE REPOSOIR,B037,27110,27677,Venon,27,,,276770000D0206,,,,,,,,,,,,,0,,,,,BS,taillis sous futaie,,,281,1.038248,49.1716
2021-372288,2021-04-27,000002,Echange,171000,,,LE REPOSOIR,B037,27110,27677,Venon,27,,,276770000D0207,,,,,,,,,,,,,0,,,,,S,sols,,,30,1.037915,49.171529
2021-372288,2021-04-27,000002,Echange,171000,,,LES BOSQUETS,B003,27110,27677,Venon,27,,,276770000D0215,,,,,,,,,,,,,0,,,,,P,prés,,,26677,1.04389,49.170806
2021-372288,2021-04-27,000002,Echange,171000,,,LES BOSQUETS,B003,27110,27677,Venon,27,,,276770000D0215,,,,,,,,,,,,,0,,,,,P,prés,,,53354,1.04389,49.170806
2021-372288,2021-04-27,000002,Echange,171000,,,LE REPOSOIR,B037,27110,27677,Venon,27,,,276770000D0225,,,,,,,,,,,,,0,,,,,T,terres,,,6312,1.039388,49.171222
2021-372288,2021-04-27,000002,Echange,171000,,,LE CHAMP DE LA LIBERATION,B008,27110,27677,Venon,27,,,276770000D0237,,,,,,,,,,,,,0,,,,,T,terres,,,20206,1.035948,49.170074
2021-372288,2021-04-27,000002,Echange,171000,,,LE REPOSOIR,B037,27110,27677,Venon,27,,,276770000D0372,,,,,,,,,,,,,0,,,,,AB,terrains a bâtir,,,1253,1.037397,49.170651
2021-372288,2021-04-27,000002,Echange,171000,,,LE REPOSOIR,B037,27110,27677,Venon,27,,,276770000D0373,,,,,,,,,,,,,0,,,,,AB,terrains a bâtir,,,1599,1.037663,49.170816
2021-372288,2021-04-27,000002,Echange,171000,,,LE REPOSOIR,B037,27110,27677,Venon,27,,,276770000D0374,,,,,,,,,,,,,0,,,,,P,prés,,,4653,1.037623,49.171293
2021-372288,2021-04-27,000002,Echange,171000,,,LE CHEMIN DE MONTAURE,B013,27110,27677,Venon,27,,,27677000ZC0059,,,,,,,,,,,,,0,,,,,T,terres,,,39853,1.050907,49.17493
2021-372488,2021-05-04,000001,Vente,215000,12,,RUE DE LIGNON,0028,27110,27677,Venon,27,,,27677000ZC0097,,,,,,,,,,,,,0,3,Dépendance,,0,J,jardins,,,2010,,
2021-372488,2021-05-04,000001,Vente,215000,12,,RUE DE LIGNON,0028,27110,27677,Venon,27,,,27677000ZC0097,,,,,,,,,,,,,0,1,Maison,80,2,J,jardins,,,2010,,
2021-372488,2021-05-04,000001,Vente,215000,12,,RUE DE LIGNON,0028,27110,27677,Venon,27,,,27677000ZC0097,,,,,,,,,,,,,0,3,Dépendance,,0,S,sols,,,1374,,
2021-372488,2021-05-04,000001,Vente,215000,12,,RUE DE LIGNON,0028,27110,27677,Venon,27,,,27677000ZC0097,,,,,,,,,,,,,0,1,Maison,80,2,S,sols,,,1374,,
2021-377623,2021-09-01,000001,Vente,229000,5,,RTE DE DAUBEUF,0010,27110,27677,Venon,27,,,276770000A0459,,,,,,,,,,,,,0,1,Maison,112,4,J,jardins,,,1580,1.035013,49.17234
2021-377623,2021-09-01,000001,Vente,229000,5,,RTE DE DAUBEUF,0010,27110,27677,Venon,27,,,276770000A0459,,,,,,,,,,,,,0,3,Dépendance,,0,J,jardins,,,1580,1.035013,49.17234
2021-377623,2021-09-01,000001,Vente,229000,5,,RTE DE DAUBEUF,0010,27110,27677,Venon,27,,,276770000A0459,,,,,,,,,,,,,0,1,Maison,112,4,S,sols,,,500,1.035013,49.17234
2021-377623,2021-09-01,000001,Vente,229000,5,,RTE DE DAUBEUF,0010,27110,27677,Venon,27,,,276770000A0459,,,,,,,,,,,,,0,3,Dépendance,,0,S,sols,,,500,1.035013,49.17234
2021-378983,2021-09-18,000001,Vente,360000,6,,CHEM SAINT SATURNIN,0046,27110,27677,Venon,27,,,276770000D0356,,,,,,,,,,,,,0,1,Maison,161,5,S,sols,,,800,1.049347,49.171518
2021-378983,2021-09-18,000001,Vente,360000,,,LES FORRIERES SUD DE VENON,B025,27110,27677,Venon,27,,,276770000D0360,,,,,,,,,,,,,0,,,,,AB,terrains a bâtir,,,400,1.049671,49.171431
2021-378983,2021-09-18,000001,Vente,360000,,,LES FORRIERES SUD DE VENON,B025,27110,27677,Venon,27,,,276770000D0363,,,,,,,,,,,,,0,,,,,S,sols,,,47,1.049191,49.171712
2021-379006,2021-09-25,000001,Vente,49900,,,INTREMARE,B029,27110,27677,Venon,27,,,276770000C0399,,,,,,,,,,,,,0,,,,,VE,vergers,,,531,1.069564,49.165786
2021-379006,2021-09-25,000001,Vente,49900,,,INTREMARE,B029,27110,27677,Venon,27,,,276770000C0399,,,,,,,,,,,,,0,,,,,AB,terrains a bâtir,,,2000,1.069564,49.165786
2021-379620,2021-10-19,000001,Echange,251468,,,LE CHAMP CROCHU,B007,27110,27677,Venon,27,,,27677000ZB0002,,,,,,,,,,,,,0,,,,,T,terres,,,180372,1.048439,49.177606
2021-379620,2021-10-19,000001,Echange,251468,,,LE CHAMP CROCHU,B007,27110,27677,Venon,27,,,27677000ZB0004,,,,,,,,,,,,,0,,,,,T,terres,,,71096,1.051301,49.179055
2021-379621,2021-10-19,000002,Echange,228699,,,LES TRAVERSINS,B040,27110,27677,Venon,27,,,27677000ZD0049,,,,,,,,,,,,,0,,,,,T,terres,,,21479,1.067064,49.17041
2021-379621,2021-10-19,000002,Echange,228699,,,LES TRAVERSINS,B040,27110,27677,Venon,27,,,27677000ZD0053,,,,,,,,,,,,,0,,,,,T,terres,,,8996,1.065541,49.170231
2021-381495,2021-12-15,000001,Vente,291600,,,LES BUISSONNETS,B006,27110,27677,Venon,27,,,276770000C0002,,,,,,,,,,,,,0,,,,,J,jardins,,,625,1.05029,49.172478
2021-381495,2021-12-15,000001,Vente,291600,,,LES BUISSONNETS,B006,27110,27677,Venon,27,,,276770000C0343,,,,,,,,,,,,,0,,,,,VE,vergers,,,705,1.050226,49.172268
2021-381495,2021-12-15,000001,Vente,291600,26,,RUE DES DRAPIERS,0013,27110,27677,Venon,27,,,276770000C0365,,,,,,,,,,,,,0,3,Dépendance,,0,S,sols,,,415,1.050227,49.17259
2021-381495,2021-12-15,000001,Vente,291600,26,,RUE DES DRAPIERS,0013,27110,27677,Venon,27,,,276770000C0365,,,,,,,,,,,,,0,1,Maison,180,8,S,sols,,,415,1.050227,49.17259
2021-381495,2021-12-15,000001,Vente,291600,26,,RUE DES DRAPIERS,0013,27110,27677,Venon,27,,,276770000C0365,,,,,,,,,,,,,0,3,Dépendance,,0,S,sols,,,415,1.050227,49.17259
2021-381495,2021-12-15,000001,Vente,291600,,,LES BUISSONNETS,B006,27110,27677,Venon,27,,,276770000C0366,,,,,,,,,,,,,0,,,,,S,sols,,,100,1.050444,49.17228
2021-381495,2021-12-15,000001,Vente,291600,,,LES BUISSONNETS,B006,27110,27677,Venon,27,,,276770000C0367,,,,,,,,,,,,,0,,,,,S,sols,,,5,1.050005,49.172212
2021-381905,2021-12-16,000003,Vente,1400,,,LE CHAMP DE LA LIBERATION,B008,27110,27677,Venon,27,,,276770000D0350,,,,,,,,,,,,,0,,,,,S,sols,,,65,1.037732,49.169065
2021-381905,2021-12-16,000003,Vente,1400,,,LE CHAMP DE LA LIBERATION,B008,27110,27677,Venon,27,,,276770000D0390,,,,,,,,,,,,,0,,,,,S,sols,,,11,1.037628,49.169189
2021-381905,2021-12-16,000003,Vente,1400,,,LE CHAMP DE LA LIBERATION,B008,27110,27677,Venon,27,,,276770000D0393,,,,,,,,,,,,,0,,,,,S,sols,,,16,1.037447,49.1692
2021-381905,2021-12-16,000003,Vente,1400,,,LE CHAMP DE LA LIBERATION,B008,27110,27677,Venon,27,,,276770000D0394,,,,,,,,,,,,,0,,,,,S,sols,,,7,1.037112,49.169193
2021-382389,2021-12-28,000001,Vente,150000,,,LES BRUYERES,B005,27110,27677,Venon,27,,,276770000A0456,,,,,,,,,,,,,0,,,,,S,sols,,,11,1.035808,49.171111
2021-382389,2021-12-28,000001,Vente,150000,,,LES BRUYERES,B005,27110,27677,Venon,27,,,276770000A0457,,,,,,,,,,,,,0,,,,,S,sols,,,13,1.035589,49.171046
2021-382389,2021-12-28,000001,Vente,150000,2,,RUE DES BRUYERES,0006,27110,27677,Venon,27,,,276770000A0474,,,,,,,,,,,,,0,1,Maison,118,8,J,jardins,,,883,1.035421,49.171282
2021-382389,2021-12-28,000001,Vente,150000,2,,RUE DES BRUYERES,0006,27110,27677,Venon,27,,,276770000A0474,,,,,,,,,,,,,0,1,Maison,118,8,S,sols,,,500,1.035421,49.171282
