id_mutation,date_mutation,numero_disposition,nature_mutation,valeur_fonciere,adresse_numero,adresse_suffixe,adresse_nom_voie,adresse_code_voie,code_postal,code_commune,nom_commune,code_departement,ancien_code_commune,ancien_nom_commune,id_parcelle,ancien_id_parcelle,numero_volume,lot1_numero,lot1_surface_carrez,lot2_numero,lot2_surface_carrez,lot3_numero,lot3_surface_carrez,lot4_numero,lot4_surface_carrez,lot5_numero,lot5_surface_carrez,nombre_lots,code_type_local,type_local,surface_reelle_bati,nombre_pieces_principales,code_nature_culture,nature_culture,code_nature_culture_speciale,nature_culture_speciale,surface_terrain,longitude,latitude
2021-384160,2021-01-29,000001,Vente,39000,,,LE MARTEAU,B064,28150,28032,Beauvilliers,28,,,28032000ZH0002,,,,,,,,,,,,,0,,,,,T,terres,,,23350,1.637541,48.318145
2021-384160,2021-01-29,000001,Vente,39000,,,LE MARTEAU,B064,28150,28032,Beauvilliers,28,,,28032000ZH0002,,,,,,,,,,,,,0,,,,,T,terres,,,25400,1.637541,48.318145
2021-385094,2021-03-30,000001,Vente,55000,,,LA PIERRE A HEIMANN,B088,28150,28032,Beauvilliers,28,,,28032000ZI0072,,,,,,,,,,,,,0,,,,,T,terres,,,27960,1.665911,48.311419
2021-385094,2021-03-30,000001,Vente,55000,,,LA PIERRE A HEIMANN,B088,28150,28032,Beauvilliers,28,,,28032000ZI0072,,,,,,,,,,,,,0,,,,,T,terres,,,45674,1.665911,48.311419
2021-385094,2021-03-30,000001,Vente,55000,,,LA PIERRE A HEIMANN,B088,28150,28032,Beauvilliers,28,,,28032000ZI0072,,,,,,,,,,,,,0,,,,,T,terres,,,1137,1.665911,48.311419
2021-385094,2021-03-30,000001,Vente,55000,,,LA PIERRE A HEIMANN,B088,28150,28032,Beauvilliers,28,,,28032000ZI0072,,,,,,,,,,,,,0,,,,,T,terres,,,218,1.665911,48.311419
2021-385094,2021-03-30,000001,Vente,55000,,,LA PIERRE A HEIMANN,B088,28150,28032,Beauvilliers,28,,,28032000ZI0072,,,,,,,,,,,,,0,,,,,T,terres,,,2873,1.665911,48.311419
2021-385380,2021-03-26,000001,Vente,105000,1,,GRANDE COUR,0030,28150,28032,Beauvilliers,28,,,280320000E0107,,,,,,,,,,,,,0,2,Appartement,49,2,S,sols,,,275,1.656068,48.297025
2021-385380,2021-03-26,000001,Vente,105000,1,,GRANDE COUR,0030,28150,28032,Beauvilliers,28,,,280320000E0107,,,,,,,,,,,,,0,2,Appartement,37,2,S,sols,,,275,1.656068,48.297025
2021-385445,2021-03-24,000001,Vente,87850,,,BEAUVILLIERS,B005,28150,28032,Beauvilliers,28,,,280320000E0331,,,,,,,,,,,,,0,,,,,S,sols,,,45,1.655972,48.296864
2021-385445,2021-03-24,000001,Vente,87850,,,BEAUVILLIERS,B005,28150,28032,Beauvilliers,28,,,280320000E0341,,,,,,,,,,,,,0,,,,,S,sols,,,250,1.655897,48.296955
2021-385445,2021-03-24,000001,Vente,87850,,,BEAUVILLIERS,B005,28150,28032,Beauvilliers,28,,,280320000E0501,,,,,,,,,,,,,0,,,,,J,jardins,,,34,1.656025,48.296862
2021-385445,2021-03-24,000001,Vente,87850,4,,GRANDE COUR,0030,28150,28032,Beauvilliers,28,,,280320000E0506,,2,,,,,,,,,,,0,,,,,,,,,,1.655899,48.297061
2021-386924,2021-05-31,000002,Vente,130000,48,,RUE DE PARIS,0065,28150,28032,Beauvilliers,28,,,280320000E0325,,,,,,,,,,,,,0,4,Local industriel. commercial ou assimilé,1069,0,S,sols,,,1972,,
2021-386924,2021-05-31,000002,Vente,130000,48,,RUE DE PARIS,0065,28150,28032,Beauvilliers,28,,,280320000E0325,,,,,,,,,,,,,0,1,Maison,180,6,S,sols,,,1972,,
2021-386924,2021-05-31,000002,Vente,130000,,,BEAUVILLIERS,B005,28150,28032,Beauvilliers,28,,,280320000E0420,,,,,,,,,,,,,0,,,,,T,terres,,,13,1.657697,48.296743
2021-386924,2021-05-31,000002,Vente,130000,6,,RUE DES LILAS,0044,28150,28032,Beauvilliers,28,,,280320000E0514,,,,,,,,,,,,,0,,,,,S,sols,,,102,1.657523,48.296703
2021-386924,2021-05-31,000002,Vente,130000,6,,RUE DES LILAS,0044,28150,28032,Beauvilliers,28,,,280320000E0515,,,,,,,,,,,,,0,,,,,S,sols,,,13,1.656969,48.296677
2021-387285,2021-05-19,000001,Vente,115000,9,,RUE DE PARIS,0065,28150,28032,Beauvilliers,28,,,280320000E0013,,,,,,,,,,,,,0,,,,,J,jardins,,,1125,1.652317,48.297742
2021-387285,2021-05-19,000001,Vente,115000,9,,RUE DE PARIS,0065,28150,28032,Beauvilliers,28,,,280320000E0014,,,,,,,,,,,,,0,1,Maison,66,3,S,sols,,,105,1.652371,48.297518
2021-387285,2021-05-19,000001,Vente,115000,9,,RUE DE PARIS,0065,28150,28032,Beauvilliers,28,,,280320000E0014,,,,,,,,,,,,,0,3,Dépendance,,0,S,sols,,,105,1.652371,48.297518
2021-387285,2021-05-19,000001,Vente,115000,,,BEAUVILLIERS,B005,28150,28032,Beauvilliers,28,,,280320000E0368,,,,,,,,,,,,,0,,,,,L,landes,,,150,1.6525,48.297823
2021-387965,2021-06-03,000001,Vente,86000,19,,RUE DE PARIS,0065,28150,28032,Beauvilliers,28,,,280320000E0022,,,,,,,,,,,,,0,3,Dépendance,,0,S,sols,,,320,1.653283,48.297418
2021-387965,2021-06-03,000001,Vente,86000,19,,RUE DE PARIS,0065,28150,28032,Beauvilliers,28,,,280320000E0022,,,,,,,,,,,,,0,1,Maison,78,5,S,sols,,,320,1.653283,48.297418
2021-387965,2021-06-03,000001,Vente,86000,19,,RUE DE PARIS,0065,28150,28032,Beauvilliers,28,,,280320000E0022,,,,,,,,,,,,,0,3,Dépendance,,0,S,sols,,,320,1.653283,48.297418
2021-387965,2021-06-03,000001,Vente,86000,17,,RUE DE PARIS,0065,28150,28032,Beauvilliers,28,,,280320000E0497,,,,,,,,,,,,,0,,,,,S,sols,,,41,1.653238,48.297508
2021-387965,2021-06-03,000001,Vente,86000,19,,RUE DE PARIS,0065,28150,28032,Beauvilliers,28,,,280320000E0498,,,,,,,,,,,,,0,,,,,J,jardins,,,504,1.653338,48.297687
2021-391185,2021-09-22,000001,Vente,110000,1,,RUE DE PARIS,0065,28150,28032,Beauvilliers,28,,,280320000E0006,,,,,,,,,,,,,0,,,,,J,jardins,,,460,1.651085,48.29791
2021-391185,2021-09-22,000001,Vente,110000,1,,RUE DE PARIS,0065,28150,28032,Beauvilliers,28,,,280320000E0007,,,,,,,,,,,,,0,3,Dépendance,,0,S,sols,,,240,1.650962,48.297755
2021-391185,2021-09-22,000001,Vente,110000,1,,RUE DE PARIS,0065,28150,28032,Beauvilliers,28,,,280320000E0007,,,,,,,,,,,,,0,1,Maison,44,2,S,sols,,,240,1.650962,48.297755
2021-391464,2021-09-30,000001,Vente,1025.1,,,LE CHEMIN DE PRASVILLE,B022,28150,28032,Beauvilliers,28,,,28032000ZN0021,,,,,,,,,,,,,0,,,,,T,terres,,,3417,1.691337,48.28863
2021-391465,2021-09-30,000001,Vente,25494,,,LA SABLONNIERE,B095,28150,28032,Beauvilliers,28,,,28032000ZL0011,,,,,,,,,,,,,0,,,,,T,terres,,,44835,1.675098,48.307984
2021-391465,2021-09-30,000001,Vente,25494,,,LE BOIS DES PLACES,B011,28150,28032,Beauvilliers,28,,,28032000ZL0022,,,,,,,,,,,,,0,,,,,T,terres,,,19980,1.679716,48.304025
2021-391465,2021-09-30,000001,Vente,25494,,,LE BOIS DES PLACES,B011,28150,28032,Beauvilliers,28,,,28032000ZL0023,,,,,,,,,,,,,0,,,,,T,terres,,,20165,1.680125,48.30367
2021-391466,2021-09-30,000001,Vente,18832.5,,,LE BOIS DES PLACES,B011,28150,28032,Beauvilliers,28,,,28032000ZL0007,,,,,,,,,,,,,0,,,,,T,terres,,,5080,1.680246,48.302153
2021-391466,2021-09-30,000001,Vente,18832.5,,,LE BOIS DES PLACES,B011,28150,28032,Beauvilliers,28,,,28032000ZL0007,,,,,,,,,,,,,0,,,,,T,terres,,,3990,1.680246,48.302153
2021-391466,2021-09-30,000001,Vente,18832.5,,,LE BOIS DES PLACES,B011,28150,28032,Beauvilliers,28,,,28032000ZL0007,,,,,,,,,,,,,0,,,,,T,terres,,,4540,1.680246,48.302153
2021-391466,2021-09-30,000001,Vente,18832.5,,,LE BOIS DES PLACES,B011,28150,28032,Beauvilliers,28,,,28032000ZL0007,,,,,,,,,,,,,0,,,,,T,terres,,,4420,1.680246,48.302153
2021-391466,2021-09-30,000001,Vente,18832.5,,,LE BOIS DES PLACES,B011,28150,28032,Beauvilliers,28,,,28032000ZL0008,,,,,,,,,,,,,0,,,,,T,terres,,,13760,1.681093,48.303319
2021-391466,2021-09-30,000001,Vente,18832.5,,,LE BOIS DES PLACES,B011,28150,28032,Beauvilliers,28,,,28032000ZL0008,,,,,,,,,,,,,0,,,,,T,terres,,,9730,1.681093,48.303319
2021-391466,2021-09-30,000001,Vente,18832.5,,,LE BOIS DES PLACES,B011,28150,28032,Beauvilliers,28,,,28032000ZL0008,,,,,,,,,,,,,0,,,,,T,terres,,,9950,1.681093,48.303319
2021-391466,2021-09-30,000001,Vente,18832.5,,,LE BOIS DES PLACES,B011,28150,28032,Beauvilliers,28,,,28032000ZL0008,,,,,,,,,,,,,0,,,,,T,terres,,,11305,1.681093,48.303319
2021-391468,2021-09-30,000001,Vente,2586,,,VILLEREAU,B108,28150,28032,Beauvilliers,28,,,280320000D0027,,,,,,,,,,,,,0,,,,,T,terres,,,4310,1.692243,48.298762
2021-392001,2021-09-29,000001,Vente,115000,3,,RUE DES ROSES,0075,28150,28032,Beauvilliers,28,,,280320000D0021,,,,,,,,,,,,,0,1,Maison,86,4,S,sols,,,1625,1.691176,48.29946
2021-392001,2021-09-29,000001,Vente,115000,3,,RUE DES ROSES,0075,28150,28032,Beauvilliers,28,,,280320000D0021,,,,,,,,,,,,,0,3,Dépendance,,0,S,sols,,,1625,1.691176,48.29946
2021-393778,2021-12-16,000001,Vente,157000,8,,RUE DE PARIS,0065,28150,28032,Beauvilliers,28,,,280320000E0151,,,,,,,,,,,,,0,1,Maison,130,5,S,sols,,,625,1.652932,48.297141
2021-393778,2021-12-16,000001,Vente,157000,8,,RUE DE PARIS,0065,28150,28032,Beauvilliers,28,,,280320000E0151,,,,,,,,,,,,,0,3,Dépendance,,0,S,sols,,,625,1.652932,48.297141
2021-393778,2021-12-16,000001,Vente,157000,8,,RUE DE PARIS,0065,28150,28032,Beauvilliers,28,,,280320000E0152,,,,,,,,,,,,,0,,,,,J,jardins,,,690,1.652813,48.29702
2021-393778,2021-12-16,000001,Vente,157000,8,,RUE DE PARIS,0065,28150,28032,Beauvilliers,28,,,280320000E0152,,,,,,,,,,,,,0,,,,,S,sols,,,40,1.652813,48.29702
2021-394645,2021-12-22,000001,Vente,120000,,,HOMBIERES,B056,28150,28032,Beauvilliers,28,,,280320000B0009,,,,,,,,,,,,,0,,,,,T,terres,,,5005,1.62433,48.298652
2021-394645,2021-12-22,000001,Vente,120000,,,HOMBIERES,B056,28150,28032,Beauvilliers,28,,,280320000B0010,,,,,,,,,,,,,0,,,,,T,terres,,,15928,1.625256,48.299377
2021-394645,2021-12-22,000001,Vente,120000,,,HOMBIERES,B056,28150,28032,Beauvilliers,28,,,280320000B0010,,,,,,,,,,,,,0,,,,,T,terres,,,23892,1.625256,48.299377
2021-394645,2021-12-22,000001,Vente,120000,,,SUR LES BROSSES,B110,28150,28032,Beauvilliers,28,,,28032000ZE0002,,,,,,,,,,,,,0,,,,,T,terres,,,600,1.608287,48.316853
2021-394645,2021-12-22,000001,Vente,120000,,,SUR LES BROSSES,B110,28150,28032,Beauvilliers,28,,,28032000ZE0002,,,,,,,,,,,,,0,,,,,T,terres,,,9200,1.608287,48.316853
2021-394645,2021-12-22,000001,Vente,120000,,,SUR LES BROSSES,B110,28150,28032,Beauvilliers,28,,,28032000ZE0002,,,,,,,,,,,,,0,,,,,T,terres,,,5800,1.608287,48.316853
2021-394645,2021-12-22,000001,Vente,120000,,,SUR LES BROSSES,B110,28150,28032,Beauvilliers,28,,,28032000ZE0002,,,,,,,,,,,,,0,,,,,T,terres,,,18100,1.608287,48.316853
2021-394645,2021-12-22,000001,Vente,120000,,,LA SAUSSAIE,B096,28150,28032,Beauvilliers,28,,,28032000ZX0009,,,,,,,,,,,,,0,,,,,T,terres,,,31700,1.620768,48.300536
2021-394645,2021-12-22,000001,Vente,120000,,,HOMBIERES,B056,28150,28032,Beauvilliers,28,,,28032000ZX0026,,,,,,,,,,,,,0,,,,,BT,taillis simples,,,10790,1.620667,48.300983
2021-394645,2021-12-22,000001,Vente,120000,,,LA FOSSE JUDARD,B044,28150,28032,Beauvilliers,28,,,28032000ZY0002,,,,,,,,,,,,,0,,,,,T,terres,,,4000,1.613204,48.309434
2021-394645,2021-12-22,000001,Vente,120000,,,LA FOSSE JUDARD,B044,28150,28032,Beauvilliers,28,,,28032000ZY0002,,,,,,,,,,,,,0,,,,,T,terres,,,68200,1.613204,48.309434
2021-394781,2021-12-29,000001,Vente,183500,,,LA HOUIE,B058,28150,28032,Beauvilliers,28,,,28032000ZO0005,,,,,,,,,,,,,0,,,,,T,terres,,,75710,1.684306,48.286774
2021-394781,2021-12-29,000001,Vente,183500,,,LA HOUIE,B058,28150,28032,Beauvilliers,28,,,28032000ZO0005,,,,,,,,,,,,,0,,,,,T,terres,,,79740,1.684306,48.286774
